airavata-dev mailing list archives

Site index · List index
Message view « Date » · « Thread »
Top « Date » · « Thread »
From Apache Jenkins Server <jenk...@builds.apache.org>
Subject Build failed in Jenkins: Apache Airavata #804
Date Mon, 22 Oct 2012 15:05:00 GMT
See <https://builds.apache.org/job/Apache%20Airavata/804/changes>

Changes:

[raminder] Error was not thrown if property file don't exists.AIRAVATA-617

[chathuri] removing provanance registry module from commons module

[chathuri] fixing AIRAVATA-615

------------------------------------------
[...truncated 2226 lines...]
mojoStarted org.apache.maven.plugins:maven-compiler-plugin:2.3.2(default-compile)[INFO] Compiling
15 source files to <https://builds.apache.org/job/Apache%20Airavata/ws/modules/commons/utils/target/classes>

[INFO] 
[INFO] --- maven-compiler-plugin:2.3.2:compile (default-compile) @ airavata-common-utils ---
mojoSucceeded org.apache.maven.plugins:maven-compiler-plugin:2.3.2(default-compile)
[debug] execute contextualize
mojoStarted org.apache.maven.plugins:maven-resources-plugin:2.5(default-testResources)[INFO]
Using 'UTF-8' encoding to copy filtered resources.
[INFO] Copying 0 resource
[INFO] Copying 3 resources

[INFO] 
[INFO] --- maven-resources-plugin:2.5:testResources (default-testResources) @ airavata-common-utils
---
mojoSucceeded org.apache.maven.plugins:maven-resources-plugin:2.5(default-testResources)
mojoStarted org.apache.maven.plugins:maven-compiler-plugin:2.3.2(default-testCompile)[INFO]
Compiling 1 source file to <https://builds.apache.org/job/Apache%20Airavata/ws/modules/commons/utils/target/test-classes>

[INFO] 
[INFO] --- maven-compiler-plugin:2.3.2:testCompile (default-testCompile) @ airavata-common-utils
---
mojoSucceeded org.apache.maven.plugins:maven-compiler-plugin:2.3.2(default-testCompile)
mojoStarted org.apache.maven.plugins:maven-surefire-plugin:2.12(default-test)[INFO] Surefire
report directory: <https://builds.apache.org/job/Apache%20Airavata/ws/modules/commons/utils/target/surefire-reports>

-------------------------------------------------------
 T E S T S
-------------------------------------------------------

[INFO] 
[INFO] --- maven-surefire-plugin:2.12:test (default-test) @ airavata-common-utils ---
Running org.apache.airavata.common.utils.XMLUtilTest
Tests run: 3, Failures: 0, Errors: 0, Skipped: 0, Time elapsed: 0.104 sec

Results :

Tests run: 3, Failures: 0, Errors: 0, Skipped: 0

mojoSucceeded org.apache.maven.plugins:maven-surefire-plugin:2.12(default-test)
[JENKINS] Recording test results
mojoStarted org.apache.maven.plugins:maven-jar-plugin:2.3.1(default-jar)
[INFO] 
[INFO] --- maven-jar-plugin:2.3.1:jar (default-jar) @ airavata-common-utils ---
[INFO] Building jar: <https://builds.apache.org/job/Apache%20Airavata/ws/modules/commons/utils/target/airavata-common-utils-0.5-SNAPSHOT.jar>
mojoSucceeded org.apache.maven.plugins:maven-jar-plugin:2.3.1(default-jar)
mojoStarted org.apache.maven.plugins:maven-site-plugin:3.0(attach-descriptor)
[INFO] 
[INFO] --- maven-site-plugin:3.0:attach-descriptor (attach-descriptor) @ airavata-common-utils
---
mojoSucceeded org.apache.maven.plugins:maven-site-plugin:3.0(attach-descriptor)
mojoStarted org.apache.maven.plugins:maven-install-plugin:2.3.1(default-install)[INFO] Installing
<https://builds.apache.org/job/Apache%20Airavata/ws/modules/commons/utils/target/airavata-common-utils-0.5-SNAPSHOT.jar>
to /home/hudson/hudson-slave/maven-repositories/1/org/apache/airavata/airavata-common-utils/0.5-SNAPSHOT/airavata-common-utils-0.5-SNAPSHOT.jar
[INFO] Installing <https://builds.apache.org/job/Apache%20Airavata/ws/modules/commons/utils/pom.xml>
to /home/hudson/hudson-slave/maven-repositories/1/org/apache/airavata/airavata-common-utils/0.5-SNAPSHOT/airavata-common-utils-0.5-SNAPSHOT.pom

[INFO] 
[INFO] --- maven-install-plugin:2.3.1:install (default-install) @ airavata-common-utils ---
mojoSucceeded org.apache.maven.plugins:maven-install-plugin:2.3.1(default-install)
projectSucceeded org.apache.airavata:airavata-common-utils:0.5-SNAPSHOT
projectStarted org.apache.airavata:registry:0.5-SNAPSHOT
[INFO]                                                                         
[INFO] ------------------------------------------------------------------------
[INFO] Building Airavata Registry 0.5-SNAPSHOT
[INFO] ------------------------------------------------------------------------
mojoStarted org.apache.maven.plugins:maven-clean-plugin:2.4.1(default-clean)
[INFO] 
[INFO] --- maven-clean-plugin:2.4.1:clean (default-clean) @ registry ---
mojoSucceeded org.apache.maven.plugins:maven-clean-plugin:2.4.1(default-clean)
mojoStarted org.apache.maven.plugins:maven-resources-plugin:2.5(copy-resources)[debug] execute
contextualize
[INFO] Using 'UTF-8' encoding to copy filtered resources.
[INFO] skip non existing resourceDirectory <https://builds.apache.org/job/Apache%20Airavata/ws/modules/registry/src/main/assembly/dist>

[INFO] 
[INFO] --- maven-resources-plugin:2.5:copy-resources (copy-resources) @ registry ---
mojoSucceeded org.apache.maven.plugins:maven-resources-plugin:2.5(copy-resources)
mojoStarted org.apache.maven.plugins:maven-remote-resources-plugin:1.2.1(default)
[INFO] 
[INFO] --- maven-remote-resources-plugin:1.2.1:process (default) @ registry ---
mojoSucceeded org.apache.maven.plugins:maven-remote-resources-plugin:1.2.1(default)
mojoStarted org.apache.maven.plugins:maven-site-plugin:3.0(attach-descriptor)
[INFO] 
[INFO] --- maven-site-plugin:3.0:attach-descriptor (attach-descriptor) @ registry ---
mojoSucceeded org.apache.maven.plugins:maven-site-plugin:3.0(attach-descriptor)
mojoStarted org.apache.maven.plugins:maven-install-plugin:2.3.1(default-install)[INFO] Installing
<https://builds.apache.org/job/Apache%20Airavata/ws/modules/registry/pom.xml> to /home/hudson/hudson-slave/maven-repositories/1/org/apache/airavata/registry/0.5-SNAPSHOT/registry-0.5-SNAPSHOT.pom

[INFO] 
[INFO] --- maven-install-plugin:2.3.1:install (default-install) @ registry ---
mojoSucceeded org.apache.maven.plugins:maven-install-plugin:2.3.1(default-install)
projectSucceeded org.apache.airavata:registry:0.5-SNAPSHOT
projectStarted org.apache.airavata:airavata-registry-api:0.5-SNAPSHOT
[INFO]                                                                         
[INFO] ------------------------------------------------------------------------
[INFO] Building Airavata Registry API 0.5-SNAPSHOT
[INFO] ------------------------------------------------------------------------
mojoStarted org.apache.maven.plugins:maven-clean-plugin:2.4.1(default-clean)
[INFO] 
[INFO] --- maven-clean-plugin:2.4.1:clean (default-clean) @ airavata-registry-api ---
mojoSucceeded org.apache.maven.plugins:maven-clean-plugin:2.4.1(default-clean)
mojoStarted org.apache.maven.plugins:maven-resources-plugin:2.5(copy-resources)[debug] execute
contextualize
[INFO] Using 'UTF-8' encoding to copy filtered resources.
[INFO] skip non existing resourceDirectory <https://builds.apache.org/job/Apache%20Airavata/ws/modules/registry/registry-api/src/main/assembly/dist>

[INFO] 
[INFO] --- maven-resources-plugin:2.5:copy-resources (copy-resources) @ airavata-registry-api
---
mojoSucceeded org.apache.maven.plugins:maven-resources-plugin:2.5(copy-resources)
mojoStarted org.apache.maven.plugins:maven-remote-resources-plugin:1.2.1(default)
[INFO] 
[INFO] --- maven-remote-resources-plugin:1.2.1:process (default) @ airavata-registry-api ---
mojoSucceeded org.apache.maven.plugins:maven-remote-resources-plugin:1.2.1(default)
mojoStarted org.apache.maven.plugins:maven-resources-plugin:2.5(default-resources)[debug]
execute contextualize
[INFO] Using 'UTF-8' encoding to copy filtered resources.
[INFO] Copying 0 resource
[INFO] Copying 3 resources

[INFO] 
[INFO] --- maven-resources-plugin:2.5:resources (default-resources) @ airavata-registry-api
---
mojoSucceeded org.apache.maven.plugins:maven-resources-plugin:2.5(default-resources)
mojoStarted org.apache.maven.plugins:maven-compiler-plugin:2.3.2(default-compile)[INFO] Compiling
63 source files to <https://builds.apache.org/job/Apache%20Airavata/ws/modules/registry/registry-api/target/classes>

[INFO] 
[INFO] --- maven-compiler-plugin:2.3.2:compile (default-compile) @ airavata-registry-api ---
[INFO] -------------------------------------------------------------
[ERROR] COMPILATION ERROR : 
[INFO] -------------------------------------------------------------
[ERROR] <https://builds.apache.org/job/Apache%20Airavata/ws/modules/registry/registry-api/src/main/java/org/apache/airavata/registry/api/AiravataRegistryFactory.java>:[118,45]
cannot find symbol
symbol  : variable e
location: class org.apache.airavata.registry.api.AiravataRegistryFactory
[INFO] 1 error
[INFO] -------------------------------------------------------------
mojoFailed org.apache.maven.plugins:maven-compiler-plugin:2.3.2(default-compile)
projectFailed org.apache.airavata:airavata-registry-api:0.5-SNAPSHOT
sessionEnded
[INFO] ------------------------------------------------------------------------
[INFO] Reactor Summary:
[INFO] 
[INFO] Airavata .......................................... SUCCESS [26.894s]
[INFO] Airavata Commons .................................. SUCCESS [0.955s]
[INFO] Airavata GFac Schema Utilities .................... SUCCESS [18.409s]
[INFO] Airavata Common Utilities ......................... SUCCESS [5.507s]
[INFO] Airavata Registry ................................. SUCCESS [0.722s]
[INFO] Airavata Registry API ............................. FAILURE [2.117s]
[INFO] Airavata Workflow Execution Context ............... SKIPPED
[INFO] Airavata WS Messenger ............................. SKIPPED
[INFO] Airavata Messenger Commons ........................ SKIPPED
[INFO] Airavata Messenger Client ......................... SKIPPED
[INFO] Airavata Workflow Tracking ........................ SKIPPED
[INFO] Airavata JPA Registry ............................. SKIPPED
[INFO] Airavata GFac Core ................................ SKIPPED
[INFO] Airavata GFac Axis2 Interface ..................... SKIPPED
[INFO] Airavata Message Box .............................. SKIPPED
[INFO] Airavata Message Broker ........................... SKIPPED
[INFO] Airavata Workflow Model Parent .................... SKIPPED
[INFO] Airavata Workflow Model Core ...................... SKIPPED
[INFO] Airavata XBaya .................................... SKIPPED
[INFO] Airavata Registry Service ......................... SKIPPED
[INFO] Airavata Registry Test ............................ SKIPPED
[INFO] Airavata Client ................................... SKIPPED
[INFO] Simple Math Service ............................... SKIPPED
[INFO] Complex Math Service .............................. SKIPPED
[INFO] Levenshtein Distance Service ...................... SKIPPED
[INFO] distribution ...................................... SKIPPED
[INFO] Airavata Test Suite ............................... SKIPPED
[INFO] ------------------------------------------------------------------------
[INFO] BUILD FAILURE
[INFO] ------------------------------------------------------------------------
[INFO] Total time: 57.986s
[INFO] Finished at: Mon Oct 22 15:03:25 UTC 2012
[INFO] Final Memory: 36M/74M
[INFO] ------------------------------------------------------------------------
Projects to build: [MavenProject: org.apache.airavata:airavata:0.5-SNAPSHOT @ <https://builds.apache.org/job/Apache%20Airavata/ws/pom.xml,>
MavenProject: org.apache.airavata:commons:0.5-SNAPSHOT @ <https://builds.apache.org/job/Apache%20Airavata/ws/modules/commons/pom.xml,>
MavenProject: org.apache.airavata:airavata-gfac-schema-utils:0.5-SNAPSHOT @ <https://builds.apache.org/job/Apache%20Airavata/ws/modules/commons/gfac-schema/pom.xml,>
MavenProject: org.apache.airavata:airavata-common-utils:0.5-SNAPSHOT @ <https://builds.apache.org/job/Apache%20Airavata/ws/modules/commons/utils/pom.xml,>
MavenProject: org.apache.airavata:registry:0.5-SNAPSHOT @ <https://builds.apache.org/job/Apache%20Airavata/ws/modules/registry/pom.xml,>
MavenProject: org.apache.airavata:airavata-registry-api:0.5-SNAPSHOT @ <https://builds.apache.org/job/Apache%20Airavata/ws/modules/registry/registry-api/pom.xml,>
MavenProject: org.apache.airavata:airavata-workflow-execution-context:0.5-SNAPSHOT @ <https://builds.apache.org/job/Apache%20Airavata/ws/modules/commons/workflow-execution-context/pom.xml,>
MavenProject: org.apache.airavata:airavata-ws-messenger:0.5-SNAPSHOT @ <https://builds.apache.org/job/Apache%20Airavata/ws/modules/ws-messenger/pom.xml,>
MavenProject: org.apache.airavata:airavata-messenger-commons:0.5-SNAPSHOT @ <https://builds.apache.org/job/Apache%20Airavata/ws/modules/ws-messenger/commons/pom.xml,>
MavenProject: org.apache.airavata:airavata-messenger-client:0.5-SNAPSHOT @ <https://builds.apache.org/job/Apache%20Airavata/ws/modules/ws-messenger/client/pom.xml,>
MavenProject: org.apache.airavata:airavata-workflow-tracking:0.5-SNAPSHOT @ <https://builds.apache.org/job/Apache%20Airavata/ws/modules/commons/workflow-tracking/pom.xml,>
MavenProject: org.apache.airavata:airavata-jpa-registry:0.5-SNAPSHOT @ <https://builds.apache.org/job/Apache%20Airavata/ws/modules/registry/airavata-jpa-registry/pom.xml,>
MavenProject: org.apache.airavata:airavata-gfac-core:0.5-SNAPSHOT @ <https://builds.apache.org/job/Apache%20Airavata/ws/modules/gfac-core/pom.xml,>
MavenProject: org.apache.airavata:airavata-gfac-axis2-interface:0.5-SNAPSHOT @ <https://builds.apache.org/job/Apache%20Airavata/ws/modules/gfac-axis2/pom.xml,>
MavenProject: org.apache.airavata:airavata-message-box:0.5-SNAPSHOT @ <https://builds.apache.org/job/Apache%20Airavata/ws/modules/ws-messenger/messagebox/pom.xml,>
MavenProject: org.apache.airavata:airavata-message-broker:0.5-SNAPSHOT @ <https://builds.apache.org/job/Apache%20Airavata/ws/modules/ws-messenger/messagebroker/pom.xml,>
MavenProject: org.apache.airavata:airavata-workflow-model-parent:0.5-SNAPSHOT @ <https://builds.apache.org/job/Apache%20Airavata/ws/modules/workflow-model/pom.xml,>
MavenProject: org.apache.airavata:airavata-workflow-model-core:0.5-SNAPSHOT @ <https://builds.apache.org/job/Apache%20Airavata/ws/modules/workflow-model/workflow-model-core/pom.xml,>
MavenProject: org.apache.airavata:airavata-xbaya-gui:0.5-SNAPSHOT @ <https://builds.apache.org/job/Apache%20Airavata/ws/modules/xbaya-gui/pom.xml,>
MavenProject: org.apache.airavata:airavata-registry-service:0.5-SNAPSHOT @ <https://builds.apache.org/job/Apache%20Airavata/ws/modules/registry/airavata-registry-service/pom.xml,>
MavenProject: org.apache.airavata:airavata-registry-test:0.5-SNAPSHOT @ <https://builds.apache.org/job/Apache%20Airavata/ws/modules/registry/airavata-registry-test/pom.xml,>
MavenProject: org.apache.airavata:airavata-client-api:0.5-SNAPSHOT @ <https://builds.apache.org/job/Apache%20Airavata/ws/modules/airavata-client/pom.xml,>
MavenProject: org.apache.airavata:airavata-simple-math-service:0.5-SNAPSHOT @ <https://builds.apache.org/job/Apache%20Airavata/ws/samples/simple-math-service/pom.xml,>
MavenProject: org.apache.airavata:airavata-complex-math-service:0.5-SNAPSHOT @ <https://builds.apache.org/job/Apache%20Airavata/ws/samples/complex-math-service/pom.xml,>
MavenProject: org.apache.airavata:airavata-levenshtein-distance-service:0.5-SNAPSHOT @ <https://builds.apache.org/job/Apache%20Airavata/ws/samples/levenshtein-distance-service/pom.xml,>
MavenProject: org.apache.airavata:distribution:0.5-SNAPSHOT @ <https://builds.apache.org/job/Apache%20Airavata/ws/modules/distribution/pom.xml,>
MavenProject: org.apache.airavata:test-suite:0.5-SNAPSHOT @ <https://builds.apache.org/job/Apache%20Airavata/ws/modules/test-suite/pom.xml]>
[JENKINS] Archiving <https://builds.apache.org/job/Apache%20Airavata/ws/modules/commons/workflow-tracking/pom.xml>
to /home/hudson/hudson/jobs/Apache Airavata/modules/org.apache.airavata$airavata-workflow-tracking/builds/2012-10-22_15-02-06/archive/org.apache.airavata/airavata-workflow-tracking/0.5-SNAPSHOT/airavata-workflow-tracking-0.5-SNAPSHOT.pom
[JENKINS] Archiving <https://builds.apache.org/job/Apache%20Airavata/ws/samples/complex-math-service/pom.xml>
to /home/hudson/hudson/jobs/Apache Airavata/modules/org.apache.airavata$airavata-complex-math-service/builds/2012-10-22_15-02-06/archive/org.apache.airavata/airavata-complex-math-service/0.5-SNAPSHOT/airavata-complex-math-service-0.5-SNAPSHOT.pom
[JENKINS] Archiving <https://builds.apache.org/job/Apache%20Airavata/ws/samples/simple-math-service/pom.xml>
to /home/hudson/hudson/jobs/Apache Airavata/modules/org.apache.airavata$airavata-simple-math-service/builds/2012-10-22_15-02-06/archive/org.apache.airavata/airavata-simple-math-service/0.5-SNAPSHOT/airavata-simple-math-service-0.5-SNAPSHOT.pom
[JENKINS] Archiving <https://builds.apache.org/job/Apache%20Airavata/ws/modules/distribution/pom.xml>
to /home/hudson/hudson/jobs/Apache Airavata/modules/org.apache.airavata$distribution/builds/2012-10-22_15-02-06/archive/org.apache.airavata/distribution/0.5-SNAPSHOT/distribution-0.5-SNAPSHOT.pom
[JENKINS] Archiving <https://builds.apache.org/job/Apache%20Airavata/ws/modules/registry/registry-api/pom.xml>
to /home/hudson/hudson/jobs/Apache Airavata/modules/org.apache.airavata$airavata-registry-api/builds/2012-10-22_15-02-06/archive/org.apache.airavata/airavata-registry-api/0.5-SNAPSHOT/airavata-registry-api-0.5-SNAPSHOT.pom
[JENKINS] Archiving <https://builds.apache.org/job/Apache%20Airavata/ws/modules/xbaya-gui/pom.xml>
to /home/hudson/hudson/jobs/Apache Airavata/modules/org.apache.airavata$airavata-xbaya-gui/builds/2012-10-22_15-02-06/archive/org.apache.airavata/airavata-xbaya-gui/0.5-SNAPSHOT/airavata-xbaya-gui-0.5-SNAPSHOT.pom
[JENKINS] Archiving <https://builds.apache.org/job/Apache%20Airavata/ws/modules/ws-messenger/messagebox/pom.xml>
to /home/hudson/hudson/jobs/Apache Airavata/modules/org.apache.airavata$airavata-message-box/builds/2012-10-22_15-02-05/archive/org.apache.airavata/airavata-message-box/0.5-SNAPSHOT/airavata-message-box-0.5-SNAPSHOT.pom
[JENKINS] Archiving <https://builds.apache.org/job/Apache%20Airavata/ws/modules/gfac-core/pom.xml>
to /home/hudson/hudson/jobs/Apache Airavata/modules/org.apache.airavata$airavata-gfac-core/builds/2012-10-22_15-02-05/archive/org.apache.airavata/airavata-gfac-core/0.5-SNAPSHOT/airavata-gfac-core-0.5-SNAPSHOT.pom
[JENKINS] Archiving <https://builds.apache.org/job/Apache%20Airavata/ws/modules/registry/airavata-registry-test/pom.xml>
to /home/hudson/hudson/jobs/Apache Airavata/modules/org.apache.airavata$airavata-registry-test/builds/2012-10-22_15-02-06/archive/org.apache.airavata/airavata-registry-test/0.5-SNAPSHOT/airavata-registry-test-0.5-SNAPSHOT.pom
[JENKINS] Archiving <https://builds.apache.org/job/Apache%20Airavata/ws/modules/commons/workflow-execution-context/pom.xml>
to /home/hudson/hudson/jobs/Apache Airavata/modules/org.apache.airavata$airavata-workflow-execution-context/builds/2012-10-22_15-02-06/archive/org.apache.airavata/airavata-workflow-execution-context/0.5-SNAPSHOT/airavata-workflow-execution-context-0.5-SNAPSHOT.pom
[JENKINS] Archiving <https://builds.apache.org/job/Apache%20Airavata/ws/modules/gfac-axis2/pom.xml>
to /home/hudson/hudson/jobs/Apache Airavata/modules/org.apache.airavata$airavata-gfac-axis2-interface/builds/2012-10-22_15-02-05/archive/org.apache.airavata/airavata-gfac-axis2-interface/0.5-SNAPSHOT/airavata-gfac-axis2-interface-0.5-SNAPSHOT.pom
[JENKINS] Archiving <https://builds.apache.org/job/Apache%20Airavata/ws/modules/commons/pom.xml>
to /home/hudson/hudson/jobs/Apache Airavata/modules/org.apache.airavata$commons/builds/2012-10-22_15-02-06/archive/org.apache.airavata/commons/0.5-SNAPSHOT/commons-0.5-SNAPSHOT.pom
[JENKINS] Archiving <https://builds.apache.org/job/Apache%20Airavata/ws/modules/registry/pom.xml>
to /home/hudson/hudson/jobs/Apache Airavata/modules/org.apache.airavata$registry/builds/2012-10-22_15-02-06/archive/org.apache.airavata/registry/0.5-SNAPSHOT/registry-0.5-SNAPSHOT.pom
[JENKINS] Archiving <https://builds.apache.org/job/Apache%20Airavata/ws/modules/ws-messenger/pom.xml>
to /home/hudson/hudson/jobs/Apache Airavata/modules/org.apache.airavata$airavata-ws-messenger/builds/2012-10-22_15-02-05/archive/org.apache.airavata/airavata-ws-messenger/0.5-SNAPSHOT/airavata-ws-messenger-0.5-SNAPSHOT.pom
[JENKINS] Archiving <https://builds.apache.org/job/Apache%20Airavata/ws/samples/levenshtein-distance-service/pom.xml>
to /home/hudson/hudson/jobs/Apache Airavata/modules/org.apache.airavata$airavata-levenshtein-distance-service/builds/2012-10-22_15-02-06/archive/org.apache.airavata/airavata-levenshtein-distance-service/0.5-SNAPSHOT/airavata-levenshtein-distance-service-0.5-SNAPSHOT.pom
[JENKINS] Archiving <https://builds.apache.org/job/Apache%20Airavata/ws/modules/registry/airavata-jpa-registry/pom.xml>
to /home/hudson/hudson/jobs/Apache Airavata/modules/org.apache.airavata$airavata-jpa-registry/builds/2012-10-22_15-02-06/archive/org.apache.airavata/airavata-jpa-registry/0.5-SNAPSHOT/airavata-jpa-registry-0.5-SNAPSHOT.pom
[JENKINS] Archiving <https://builds.apache.org/job/Apache%20Airavata/ws/modules/commons/utils/pom.xml>
to /home/hudson/hudson/jobs/Apache Airavata/modules/org.apache.airavata$airavata-common-utils/builds/2012-10-22_15-02-06/archive/org.apache.airavata/airavata-common-utils/0.5-SNAPSHOT/airavata-common-utils-0.5-SNAPSHOT.pom
[JENKINS] Archiving <https://builds.apache.org/job/Apache%20Airavata/ws/modules/commons/utils/target/airavata-common-utils-0.5-SNAPSHOT.jar>
to /home/hudson/hudson/jobs/Apache Airavata/modules/org.apache.airavata$airavata-common-utils/builds/2012-10-22_15-02-06/archive/org.apache.airavata/airavata-common-utils/0.5-SNAPSHOT/airavata-common-utils-0.5-SNAPSHOT.jar
[JENKINS] Archiving <https://builds.apache.org/job/Apache%20Airavata/ws/modules/airavata-client/pom.xml>
to /home/hudson/hudson/jobs/Apache Airavata/modules/org.apache.airavata$airavata-client-api/builds/2012-10-22_15-02-06/archive/org.apache.airavata/airavata-client-api/0.5-SNAPSHOT/airavata-client-api-0.5-SNAPSHOT.pom
[JENKINS] Archiving <https://builds.apache.org/job/Apache%20Airavata/ws/modules/ws-messenger/messagebroker/pom.xml>
to /home/hudson/hudson/jobs/Apache Airavata/modules/org.apache.airavata$airavata-message-broker/builds/2012-10-22_15-02-05/archive/org.apache.airavata/airavata-message-broker/0.5-SNAPSHOT/airavata-message-broker-0.5-SNAPSHOT.pom
[JENKINS] Archiving <https://builds.apache.org/job/Apache%20Airavata/ws/modules/commons/gfac-schema/pom.xml>
to /home/hudson/hudson/jobs/Apache Airavata/modules/org.apache.airavata$airavata-gfac-schema-utils/builds/2012-10-22_15-02-06/archive/org.apache.airavata/airavata-gfac-schema-utils/0.5-SNAPSHOT/airavata-gfac-schema-utils-0.5-SNAPSHOT.pom
[JENKINS] Archiving <https://builds.apache.org/job/Apache%20Airavata/ws/modules/commons/gfac-schema/target/airavata-gfac-schema-utils-0.5-SNAPSHOT.jar>
to /home/hudson/hudson/jobs/Apache Airavata/modules/org.apache.airavata$airavata-gfac-schema-utils/builds/2012-10-22_15-02-06/archive/org.apache.airavata/airavata-gfac-schema-utils/0.5-SNAPSHOT/airavata-gfac-schema-utils-0.5-SNAPSHOT.jar
[JENKINS] Archiving <https://builds.apache.org/job/Apache%20Airavata/ws/modules/workflow-model/pom.xml>
to /home/hudson/hudson/jobs/Apache Airavata/modules/org.apache.airavata$airavata-workflow-model-parent/builds/2012-10-22_15-02-05/archive/org.apache.airavata/airavata-workflow-model-parent/0.5-SNAPSHOT/airavata-workflow-model-parent-0.5-SNAPSHOT.pom
[JENKINS] Archiving <https://builds.apache.org/job/Apache%20Airavata/ws/modules/registry/airavata-registry-service/pom.xml>
to /home/hudson/hudson/jobs/Apache Airavata/modules/org.apache.airavata$airavata-registry-service/builds/2012-10-22_15-02-06/archive/org.apache.airavata/airavata-registry-service/0.5-SNAPSHOT/airavata-registry-service-0.5-SNAPSHOT.pom
[JENKINS] Archiving <https://builds.apache.org/job/Apache%20Airavata/ws/modules/ws-messenger/client/pom.xml>
to /home/hudson/hudson/jobs/Apache Airavata/modules/org.apache.airavata$airavata-messenger-client/builds/2012-10-22_15-02-05/archive/org.apache.airavata/airavata-messenger-client/0.5-SNAPSHOT/airavata-messenger-client-0.5-SNAPSHOT.pom
[JENKINS] Archiving <https://builds.apache.org/job/Apache%20Airavata/ws/modules/ws-messenger/commons/pom.xml>
to /home/hudson/hudson/jobs/Apache Airavata/modules/org.apache.airavata$airavata-messenger-commons/builds/2012-10-22_15-02-05/archive/org.apache.airavata/airavata-messenger-commons/0.5-SNAPSHOT/airavata-messenger-commons-0.5-SNAPSHOT.pom
[JENKINS] Archiving <https://builds.apache.org/job/Apache%20Airavata/ws/modules/workflow-model/workflow-model-core/pom.xml>
to /home/hudson/hudson/jobs/Apache Airavata/modules/org.apache.airavata$airavata-workflow-model-core/builds/2012-10-22_15-02-05/archive/org.apache.airavata/airavata-workflow-model-core/0.5-SNAPSHOT/airavata-workflow-model-core-0.5-SNAPSHOT.pom
[JENKINS] Archiving <https://builds.apache.org/job/Apache%20Airavata/ws/modules/test-suite/pom.xml>
to /home/hudson/hudson/jobs/Apache Airavata/modules/org.apache.airavata$test-suite/builds/2012-10-22_15-02-06/archive/org.apache.airavata/test-suite/0.5-SNAPSHOT/test-suite-0.5-SNAPSHOT.pom
[JENKINS] Archiving <https://builds.apache.org/job/Apache%20Airavata/ws/pom.xml> to
/home/hudson/hudson/jobs/Apache Airavata/modules/org.apache.airavata$airavata/builds/2012-10-22_15-02-05/archive/org.apache.airavata/airavata/0.5-SNAPSHOT/airavata-0.5-SNAPSHOT.pom
Waiting for Jenkins to finish collecting data
mavenExecutionResult exceptions not empty
message : Failed to execute goal org.apache.maven.plugins:maven-compiler-plugin:2.3.2:compile
(default-compile) on project airavata-registry-api: Compilation failure
<https://builds.apache.org/job/Apache%20Airavata/ws/modules/registry/registry-api/src/main/java/org/apache/airavata/registry/api/AiravataRegistryFactory.java>:[118,45]
cannot find symbol
symbol  : variable e
location: class org.apache.airavata.registry.api.AiravataRegistryFactory

cause : Compilation failure
<https://builds.apache.org/job/Apache%20Airavata/ws/modules/registry/registry-api/src/main/java/org/apache/airavata/registry/api/AiravataRegistryFactory.java>:[118,45]
cannot find symbol
symbol  : variable e
location: class org.apache.airavata.registry.api.AiravataRegistryFactory

Stack trace : 
org.apache.maven.lifecycle.LifecycleExecutionException: Failed to execute goal org.apache.maven.plugins:maven-compiler-plugin:2.3.2:compile
(default-compile) on project airavata-registry-api: Compilation failure
<https://builds.apache.org/job/Apache%20Airavata/ws/modules/registry/registry-api/src/main/java/org/apache/airavata/registry/api/AiravataRegistryFactory.java>:[118,45]
cannot find symbol
symbol  : variable e
location: class org.apache.airavata.registry.api.AiravataRegistryFactory

	at org.apache.maven.lifecycle.internal.MojoExecutor.execute(MojoExecutor.java:213)
	at org.apache.maven.lifecycle.internal.MojoExecutor.execute(MojoExecutor.java:153)
	at org.apache.maven.lifecycle.internal.MojoExecutor.execute(MojoExecutor.java:145)
	at org.apache.maven.lifecycle.internal.LifecycleModuleBuilder.buildProject(LifecycleModuleBuilder.java:84)
	at org.apache.maven.lifecycle.internal.LifecycleModuleBuilder.buildProject(LifecycleModuleBuilder.java:59)
	at org.apache.maven.lifecycle.internal.LifecycleStarter.singleThreadedBuild(LifecycleStarter.java:183)
	at org.apache.maven.lifecycle.internal.LifecycleStarter.execute(LifecycleStarter.java:161)
	at org.apache.maven.DefaultMaven.doExecute(DefaultMaven.java:319)
	at org.apache.maven.DefaultMaven.execute(DefaultMaven.java:156)
	at org.jvnet.hudson.maven3.launcher.Maven3Launcher.main(Maven3Launcher.java:79)
	at sun.reflect.NativeMethodAccessorImpl.invoke0(Native Method)
	at sun.reflect.NativeMethodAccessorImpl.invoke(NativeMethodAccessorImpl.java:39)
	at sun.reflect.DelegatingMethodAccessorImpl.invoke(DelegatingMethodAccessorImpl.java:25)
	at java.lang.reflect.Method.invoke(Method.java:597)
	at org.codehaus.plexus.classworlds.launcher.Launcher.launchStandard(Launcher.java:329)
	at org.codehaus.plexus.classworlds.launcher.Launcher.launch(Launcher.java:239)
	at org.jvnet.hudson.maven3.agent.Maven3Main.launch(Maven3Main.java:158)
	at hudson.maven.Maven3Builder.call(Maven3Builder.java:98)
	at hudson.maven.Maven3Builder.call(Maven3Builder.java:64)
	at hudson.remoting.UserRequest.perform(UserRequest.java:118)
	at hudson.remoting.UserRequest.perform(UserRequest.java:48)
	at hudson.remoting.Request$2.run(Request.java:326)
	at hudson.remoting.InterceptingExecutorService$1.call(InterceptingExecutorService.java:72)
	at java.util.concurrent.FutureTask$Sync.innerRun(FutureTask.java:303)
	at java.util.concurrent.FutureTask.run(FutureTask.java:138)
	at java.util.concurrent.ThreadPoolExecutor$Worker.runTask(ThreadPoolExecutor.java:886)
	at java.util.concurrent.ThreadPoolExecutor$Worker.run(ThreadPoolExecutor.java:908)
	at java.lang.Thread.run(Thread.java:662)
Caused by: org.apache.maven.plugin.CompilationFailureException: Compilation failure
<https://builds.apache.org/job/Apache%20Airavata/ws/modules/registry/registry-api/src/main/java/org/apache/airavata/registry/api/AiravataRegistryFactory.java>:[118,45]
cannot find symbol
symbol  : variable e
location: class org.apache.airavata.registry.api.AiravataRegistryFactory

	at org.apache.maven.plugin.AbstractCompilerMojo.execute(AbstractCompilerMojo.java:656)
	at org.apache.maven.plugin.CompilerMojo.execute(CompilerMojo.java:128)
	at org.apache.maven.plugin.DefaultBuildPluginManager.executeMojo(DefaultBuildPluginManager.java:101)
	at org.apache.maven.lifecycle.internal.MojoExecutor.execute(MojoExecutor.java:209)
	... 27 more
Sending e-mails to: dev@airavata.apache.org raminderjsingh@gmail.com
channel stopped

Mime
View raw message