airavata-dev mailing list archives

Site index · List index
Message view « Date » · « Thread »
Top « Date » · « Thread »
From Apache Jenkins Server <jenk...@builds.apache.org>
Subject Build failed in Jenkins: Apache Airavata #686
Date Sat, 08 Sep 2012 21:32:43 GMT
See <https://builds.apache.org/job/Apache%20Airavata/686/changes>

Changes:

[samindaw] new reg api integration

------------------------------------------
[...truncated 3807 lines...]

Tests run: 0, Failures: 0, Errors: 0, Skipped: 0

mojoSucceeded org.apache.maven.plugins:maven-surefire-plugin:2.12(default-test)
[JENKINS] Recording test results
mojoStarted org.apache.maven.plugins:maven-jar-plugin:2.3.1(default-jar)
[INFO] 
[INFO] --- maven-jar-plugin:2.3.1:jar (default-jar) @ airavata-workflow-model-core ---
[INFO] Building jar: <https://builds.apache.org/job/Apache%20Airavata/ws/modules/workflow-model/workflow-model-core/target/airavata-workflow-model-core-0.5-incubating-SNAPSHOT.jar>
mojoSucceeded org.apache.maven.plugins:maven-jar-plugin:2.3.1(default-jar)
mojoStarted org.apache.maven.plugins:maven-site-plugin:3.0(attach-descriptor)
[INFO] 
[INFO] --- maven-site-plugin:3.0:attach-descriptor (attach-descriptor) @ airavata-workflow-model-core
---
mojoSucceeded org.apache.maven.plugins:maven-site-plugin:3.0(attach-descriptor)
mojoStarted org.apache.maven.plugins:maven-install-plugin:2.3.1(default-install)
[INFO] Installing <https://builds.apache.org/job/Apache%20Airavata/ws/modules/workflow-model/workflow-model-core/target/airavata-workflow-model-core-0.5-incubating-SNAPSHOT.jar>
to /export/home/hudson/hudson-slave/maven-repositories/1/org/apache/airavata/airavata-workflow-model-core/0.5-incubating-SNAPSHOT/airavata-workflow-model-core-0.5-incubating-SNAPSHOT.jar
[INFO] 
[INFO] --- maven-install-plugin:2.3.1:install (default-install) @ airavata-workflow-model-core
---
[INFO] Installing <https://builds.apache.org/job/Apache%20Airavata/ws/modules/workflow-model/workflow-model-core/pom.xml>
to /export/home/hudson/hudson-slave/maven-repositories/1/org/apache/airavata/airavata-workflow-model-core/0.5-incubating-SNAPSHOT/airavata-workflow-model-core-0.5-incubating-SNAPSHOT.pom
mojoSucceeded org.apache.maven.plugins:maven-install-plugin:2.3.1(default-install)
projectSucceeded org.apache.airavata:airavata-workflow-model-core:0.5-incubating-SNAPSHOT
projectStarted org.apache.airavata:registry:0.5-incubating-SNAPSHOT
[INFO]                                                                         
[INFO] ------------------------------------------------------------------------
[INFO] Building Airavata Registry 0.5-incubating-SNAPSHOT
[INFO] ------------------------------------------------------------------------
mojoStarted org.apache.maven.plugins:maven-clean-plugin:2.4.1(default-clean)
[INFO] 
[INFO] --- maven-clean-plugin:2.4.1:clean (default-clean) @ registry ---
mojoSucceeded org.apache.maven.plugins:maven-clean-plugin:2.4.1(default-clean)
mojoStarted org.apache.maven.plugins:maven-resources-plugin:2.5(copy-resources)[debug] execute
contextualize

[INFO] 
[INFO] Using 'UTF-8' encoding to copy filtered resources.
[INFO] skip non existing resourceDirectory <https://builds.apache.org/job/Apache%20Airavata/ws/modules/registry/src/main/assembly/dist>
[INFO] --- maven-resources-plugin:2.5:copy-resources (copy-resources) @ registry ---
mojoSucceeded org.apache.maven.plugins:maven-resources-plugin:2.5(copy-resources)
mojoStarted org.apache.maven.plugins:maven-remote-resources-plugin:1.2.1(default)
[INFO] 
[INFO] --- maven-remote-resources-plugin:1.2.1:process (default) @ registry ---
mojoSucceeded org.apache.maven.plugins:maven-remote-resources-plugin:1.2.1(default)
mojoStarted org.apache.maven.plugins:maven-site-plugin:3.0(attach-descriptor)
[INFO] 
[INFO] --- maven-site-plugin:3.0:attach-descriptor (attach-descriptor) @ registry ---
mojoSucceeded org.apache.maven.plugins:maven-site-plugin:3.0(attach-descriptor)
mojoStarted org.apache.maven.plugins:maven-install-plugin:2.3.1(default-install)
[INFO] 
[INFO] Installing <https://builds.apache.org/job/Apache%20Airavata/ws/modules/registry/pom.xml>
to /export/home/hudson/hudson-slave/maven-repositories/1/org/apache/airavata/registry/0.5-incubating-SNAPSHOT/registry-0.5-incubating-SNAPSHOT.pom
[INFO] --- maven-install-plugin:2.3.1:install (default-install) @ registry ---
mojoSucceeded org.apache.maven.plugins:maven-install-plugin:2.3.1(default-install)
projectSucceeded org.apache.airavata:registry:0.5-incubating-SNAPSHOT
projectStarted org.apache.airavata:airavata-jpa-registry:0.5-incubating-SNAPSHOT
[INFO]                                                                         
[INFO] ------------------------------------------------------------------------
[INFO] Building Airavata JPA Registry 0.5-incubating-SNAPSHOT
[INFO] ------------------------------------------------------------------------
mojoStarted org.apache.maven.plugins:maven-clean-plugin:2.4.1(default-clean)
[INFO] 
[INFO] --- maven-clean-plugin:2.4.1:clean (default-clean) @ airavata-jpa-registry ---
mojoSucceeded org.apache.maven.plugins:maven-clean-plugin:2.4.1(default-clean)
mojoStarted org.apache.maven.plugins:maven-resources-plugin:2.5(copy-resources)
[INFO] 
[debug] execute contextualize
[INFO] Using 'UTF-8' encoding to copy filtered resources.
[INFO] --- maven-resources-plugin:2.5:copy-resources (copy-resources) @ airavata-jpa-registry
---
[INFO] skip non existing resourceDirectory <https://builds.apache.org/job/Apache%20Airavata/ws/modules/registry/airavata-jpa-registry/src/main/assembly/dist>
mojoSucceeded org.apache.maven.plugins:maven-resources-plugin:2.5(copy-resources)
mojoStarted org.apache.maven.plugins:maven-remote-resources-plugin:1.2.1(default)
[INFO] 
[INFO] --- maven-remote-resources-plugin:1.2.1:process (default) @ airavata-jpa-registry ---
mojoSucceeded org.apache.maven.plugins:maven-remote-resources-plugin:1.2.1(default)
mojoStarted org.apache.maven.plugins:maven-resources-plugin:2.5(default-resources)
[INFO] 
[debug] execute contextualize
[INFO] Using 'UTF-8' encoding to copy filtered resources.
[INFO] Copying 2 resources
[INFO] Copying 4 resources
[INFO] --- maven-resources-plugin:2.5:resources (default-resources) @ airavata-jpa-registry
---
mojoSucceeded org.apache.maven.plugins:maven-resources-plugin:2.5(default-resources)
mojoStarted org.apache.maven.plugins:maven-compiler-plugin:2.3.2(default-compile)
[INFO] 
[INFO] --- maven-compiler-plugin:2.3.2:compile (default-compile) @ airavata-jpa-registry ---
[INFO] Compiling 34 source files to <https://builds.apache.org/job/Apache%20Airavata/ws/modules/registry/airavata-jpa-registry/target/classes>
mojoSucceeded org.apache.maven.plugins:maven-compiler-plugin:2.3.2(default-compile)
mojoStarted org.apache.maven.plugins:maven-resources-plugin:2.5(default-testResources)[debug]
execute contextualize

[INFO] Using 'UTF-8' encoding to copy filtered resources.
[INFO] skip non existing resourceDirectory <https://builds.apache.org/job/Apache%20Airavata/ws/modules/registry/airavata-jpa-registry/src/test/resources>
[INFO] Copying 4 resources
[INFO] 
[INFO] --- maven-resources-plugin:2.5:testResources (default-testResources) @ airavata-jpa-registry
---
mojoSucceeded org.apache.maven.plugins:maven-resources-plugin:2.5(default-testResources)
mojoStarted org.apache.maven.plugins:maven-compiler-plugin:2.3.2(default-testCompile)
[INFO] 
[INFO] Compiling 1 source file to <https://builds.apache.org/job/Apache%20Airavata/ws/modules/registry/airavata-jpa-registry/target/test-classes>
[INFO] --- maven-compiler-plugin:2.3.2:testCompile (default-testCompile) @ airavata-jpa-registry
---
mojoSucceeded org.apache.maven.plugins:maven-compiler-plugin:2.3.2(default-testCompile)
mojoStarted org.apache.maven.plugins:maven-surefire-plugin:2.12(default-test)
[INFO] 
[INFO] Surefire report directory: <https://builds.apache.org/job/Apache%20Airavata/ws/modules/registry/airavata-jpa-registry/target/surefire-reports>

-------------------------------------------------------
 T E S T S
-------------------------------------------------------
[INFO] --- maven-surefire-plugin:2.12:test (default-test) @ airavata-jpa-registry ---

Results :

Tests run: 0, Failures: 0, Errors: 0, Skipped: 0

mojoFailed org.apache.maven.plugins:maven-surefire-plugin:2.12(default-test)
[JENKINS] Recording test results
projectFailed org.apache.airavata:airavata-jpa-registry:0.5-incubating-SNAPSHOT
sessionEnded
[INFO] ------------------------------------------------------------------------
[INFO] Reactor Summary:
[INFO] 
[INFO] Airavata .......................................... SUCCESS [2:20.548s]
[INFO] Airavata Commons .................................. SUCCESS [10.470s]
[INFO] Airavata Common Utilities ......................... SUCCESS [1:48.726s]
[INFO] Airavata Common Registry API ...................... SUCCESS [1:08.477s]
[INFO] Airavata Registry API ............................. SUCCESS [2:27.020s]
[INFO] Airavata GFac Core ................................ SUCCESS [1:16.820s]
[INFO] Airavata GFac Axis2 Interface ..................... SUCCESS [35.538s]
[INFO] Airavata WS Messenger ............................. SUCCESS [6.918s]
[INFO] Airavata Messenger Commons ........................ SUCCESS [15.794s]
[INFO] Airavata Messenger Client ......................... SUCCESS [17.289s]
[INFO] Airavata Message Box .............................. SUCCESS [26.763s]
[INFO] Airavata Message Broker ........................... SUCCESS [1:10.002s]
[INFO] Airavata Workflow Model Parent .................... SUCCESS [6.770s]
[INFO] Airavata Workflow Model Core ...................... SUCCESS [42.153s]
[INFO] Airavata Registry ................................. SUCCESS [10.808s]
[INFO] Airavata JPA Registry ............................. FAILURE [39.121s]
[INFO] Airavata XBaya .................................... SKIPPED
[INFO] Airavata Provenance Registry ...................... SKIPPED
[INFO] Airavata Client ................................... SKIPPED
[INFO] Simple Math Service ............................... SKIPPED
[INFO] Complex Math Service .............................. SKIPPED
[INFO] Levenshtein Distance Service ...................... SKIPPED
[INFO] distribution ...................................... SKIPPED
[INFO] Airavata Test Suite ............................... SKIPPED
[INFO] ------------------------------------------------------------------------
[INFO] BUILD FAILURE
[INFO] ------------------------------------------------------------------------
[INFO] Total time: 14:24.574s
[INFO] Finished at: Sat Sep 08 21:29:35 GMT+00:00 2012
[INFO] Final Memory: 127M/381M
[INFO] ------------------------------------------------------------------------
Projects to build: [MavenProject: org.apache.airavata:airavata:0.5-incubating-SNAPSHOT @ <https://builds.apache.org/job/Apache%20Airavata/ws/pom.xml,>
MavenProject: org.apache.airavata:commons:0.5-incubating-SNAPSHOT @ <https://builds.apache.org/job/Apache%20Airavata/ws/modules/commons/pom.xml,>
MavenProject: org.apache.airavata:airavata-common-utils:0.5-incubating-SNAPSHOT @ <https://builds.apache.org/job/Apache%20Airavata/ws/modules/commons/utils/pom.xml,>
MavenProject: org.apache.airavata:airavata-common-registry-api:0.5-incubating-SNAPSHOT @ <https://builds.apache.org/job/Apache%20Airavata/ws/modules/commons/common-registry-api/pom.xml,>
MavenProject: org.apache.airavata:airavata-registry-api:0.5-incubating-SNAPSHOT @ <https://builds.apache.org/job/Apache%20Airavata/ws/modules/commons/registry-api/pom.xml,>
MavenProject: org.apache.airavata:airavata-gfac-core:0.5-incubating-SNAPSHOT @ <https://builds.apache.org/job/Apache%20Airavata/ws/modules/gfac-core/pom.xml,>
MavenProject: org.apache.airavata:airavata-gfac-axis2-interface:0.5-incubating-SNAPSHOT @
<https://builds.apache.org/job/Apache%20Airavata/ws/modules/gfac-axis2/pom.xml,> MavenProject:
org.apache.airavata:airavata-ws-messenger:0.5-incubating-SNAPSHOT @ <https://builds.apache.org/job/Apache%20Airavata/ws/modules/ws-messenger/pom.xml,>
MavenProject: org.apache.airavata:airavata-messenger-commons:0.5-incubating-SNAPSHOT @ <https://builds.apache.org/job/Apache%20Airavata/ws/modules/ws-messenger/commons/pom.xml,>
MavenProject: org.apache.airavata:airavata-messenger-client:0.5-incubating-SNAPSHOT @ <https://builds.apache.org/job/Apache%20Airavata/ws/modules/ws-messenger/client/pom.xml,>
MavenProject: org.apache.airavata:airavata-message-box:0.5-incubating-SNAPSHOT @ <https://builds.apache.org/job/Apache%20Airavata/ws/modules/ws-messenger/messagebox/pom.xml,>
MavenProject: org.apache.airavata:airavata-message-broker:0.5-incubating-SNAPSHOT @ <https://builds.apache.org/job/Apache%20Airavata/ws/modules/ws-messenger/messagebroker/pom.xml,>
MavenProject: org.apache.airavata:airavata-workflow-model-parent:0.5-incubating-SNAPSHOT @
<https://builds.apache.org/job/Apache%20Airavata/ws/modules/workflow-model/pom.xml,>
MavenProject: org.apache.airavata:airavata-workflow-model-core:0.5-incubating-SNAPSHOT @ <https://builds.apache.org/job/Apache%20Airavata/ws/modules/workflow-model/workflow-model-core/pom.xml,>
MavenProject: org.apache.airavata:registry:0.5-incubating-SNAPSHOT @ <https://builds.apache.org/job/Apache%20Airavata/ws/modules/registry/pom.xml,>
MavenProject: org.apache.airavata:airavata-jpa-registry:0.5-incubating-SNAPSHOT @ <https://builds.apache.org/job/Apache%20Airavata/ws/modules/registry/airavata-jpa-registry/pom.xml,>
MavenProject: org.apache.airavata:airavata-xbaya-gui:0.5-incubating-SNAPSHOT @ <https://builds.apache.org/job/Apache%20Airavata/ws/modules/xbaya-gui/pom.xml,>
MavenProject: org.apache.airavata:airavata-provenance-registry:0.5-incubating-SNAPSHOT @ <https://builds.apache.org/job/Apache%20Airavata/ws/modules/commons/provenance-registry/pom.xml,>
MavenProject: org.apache.airavata:airavata-client-api:0.5-incubating-SNAPSHOT @ <https://builds.apache.org/job/Apache%20Airavata/ws/modules/airavata-client/pom.xml,>
MavenProject: org.apache.airavata:airavata-simple-math-service:0.5-incubating-SNAPSHOT @ <https://builds.apache.org/job/Apache%20Airavata/ws/samples/simple-math-service/pom.xml,>
MavenProject: org.apache.airavata:airavata-complex-math-service:0.5-incubating-SNAPSHOT @
<https://builds.apache.org/job/Apache%20Airavata/ws/samples/complex-math-service/pom.xml,>
MavenProject: org.apache.airavata:airavata-levenshtein-distance-service:0.5-incubating-SNAPSHOT
@ <https://builds.apache.org/job/Apache%20Airavata/ws/samples/levenshtein-distance-service/pom.xml,>
MavenProject: org.apache.airavata:distribution:0.5-incubating-SNAPSHOT @ <https://builds.apache.org/job/Apache%20Airavata/ws/modules/distribution/pom.xml,>
MavenProject: org.apache.airavata:test-suite:0.5-incubating-SNAPSHOT @ <https://builds.apache.org/job/Apache%20Airavata/ws/modules/test-suite/pom.xml]>
[JENKINS] Archiving <https://builds.apache.org/job/Apache%20Airavata/ws/samples/complex-math-service/pom.xml>
to /home/hudson/hudson/jobs/Apache Airavata/modules/org.apache.airavata$airavata-complex-math-service/builds/2012-09-08_21-13-04/archive/org.apache.airavata/airavata-complex-math-service/0.5-incubating-SNAPSHOT/airavata-complex-math-service-0.5-incubating-SNAPSHOT.pom
[JENKINS] Archiving <https://builds.apache.org/job/Apache%20Airavata/ws/samples/simple-math-service/pom.xml>
to /home/hudson/hudson/jobs/Apache Airavata/modules/org.apache.airavata$airavata-simple-math-service/builds/2012-09-08_21-13-04/archive/org.apache.airavata/airavata-simple-math-service/0.5-incubating-SNAPSHOT/airavata-simple-math-service-0.5-incubating-SNAPSHOT.pom
[JENKINS] Archiving <https://builds.apache.org/job/Apache%20Airavata/ws/modules/commons/registry-api/pom.xml>
to /home/hudson/hudson/jobs/Apache Airavata/modules/org.apache.airavata$airavata-registry-api/builds/2012-09-08_21-13-02/archive/org.apache.airavata/airavata-registry-api/0.5-incubating-SNAPSHOT/airavata-registry-api-0.5-incubating-SNAPSHOT.pom
[JENKINS] Archiving <https://builds.apache.org/job/Apache%20Airavata/ws/modules/commons/registry-api/target/airavata-registry-api-0.5-incubating-SNAPSHOT.jar>
to /home/hudson/hudson/jobs/Apache Airavata/modules/org.apache.airavata$airavata-registry-api/builds/2012-09-08_21-13-02/archive/org.apache.airavata/airavata-registry-api/0.5-incubating-SNAPSHOT/airavata-registry-api-0.5-incubating-SNAPSHOT.jar
[JENKINS] Archiving <https://builds.apache.org/job/Apache%20Airavata/ws/modules/distribution/pom.xml>
to /home/hudson/hudson/jobs/Apache Airavata/modules/org.apache.airavata$distribution/builds/2012-09-08_21-13-05/archive/org.apache.airavata/distribution/0.5-incubating-SNAPSHOT/distribution-0.5-incubating-SNAPSHOT.pom
[JENKINS] Archiving <https://builds.apache.org/job/Apache%20Airavata/ws/modules/xbaya-gui/pom.xml>
to /home/hudson/hudson/jobs/Apache Airavata/modules/org.apache.airavata$airavata-xbaya-gui/builds/2012-09-08_21-13-01/archive/org.apache.airavata/airavata-xbaya-gui/0.5-incubating-SNAPSHOT/airavata-xbaya-gui-0.5-incubating-SNAPSHOT.pom
[JENKINS] Archiving <https://builds.apache.org/job/Apache%20Airavata/ws/modules/gfac-core/pom.xml>
to /home/hudson/hudson/jobs/Apache Airavata/modules/org.apache.airavata$airavata-gfac-core/builds/2012-09-08_21-12-58/archive/org.apache.airavata/airavata-gfac-core/0.5-incubating-SNAPSHOT/airavata-gfac-core-0.5-incubating-SNAPSHOT.pom
[JENKINS] Archiving <https://builds.apache.org/job/Apache%20Airavata/ws/modules/gfac-core/target/airavata-gfac-core-0.5-incubating-SNAPSHOT.jar>
to /home/hudson/hudson/jobs/Apache Airavata/modules/org.apache.airavata$airavata-gfac-core/builds/2012-09-08_21-12-58/archive/org.apache.airavata/airavata-gfac-core/0.5-incubating-SNAPSHOT/airavata-gfac-core-0.5-incubating-SNAPSHOT.jar
[JENKINS] Archiving <https://builds.apache.org/job/Apache%20Airavata/ws/modules/ws-messenger/messagebox/pom.xml>
to /home/hudson/hudson/jobs/Apache Airavata/modules/org.apache.airavata$airavata-message-box/builds/2012-09-08_21-13-00/archive/org.apache.airavata/airavata-message-box/0.5-incubating-SNAPSHOT/airavata-message-box-0.5-incubating-SNAPSHOT.pom
[JENKINS] Archiving <https://builds.apache.org/job/Apache%20Airavata/ws/modules/ws-messenger/messagebox/target/airavata-message-box-0.5-incubating-SNAPSHOT.jar>
to /home/hudson/hudson/jobs/Apache Airavata/modules/org.apache.airavata$airavata-message-box/builds/2012-09-08_21-13-00/archive/org.apache.airavata/airavata-message-box/0.5-incubating-SNAPSHOT/airavata-message-box-0.5-incubating-SNAPSHOT.jar
[JENKINS] Archiving <https://builds.apache.org/job/Apache%20Airavata/ws/modules/gfac-axis2/pom.xml>
to /home/hudson/hudson/jobs/Apache Airavata/modules/org.apache.airavata$airavata-gfac-axis2-interface/builds/2012-09-08_21-12-58/archive/org.apache.airavata/airavata-gfac-axis2-interface/0.5-incubating-SNAPSHOT/airavata-gfac-axis2-interface-0.5-incubating-SNAPSHOT.pom
[JENKINS] Archiving <https://builds.apache.org/job/Apache%20Airavata/ws/modules/gfac-axis2/target/airavata-gfac-axis2-interface-0.5-incubating-SNAPSHOT.jar>
to /home/hudson/hudson/jobs/Apache Airavata/modules/org.apache.airavata$airavata-gfac-axis2-interface/builds/2012-09-08_21-12-58/archive/org.apache.airavata/airavata-gfac-axis2-interface/0.5-incubating-SNAPSHOT/airavata-gfac-axis2-interface-0.5-incubating-SNAPSHOT.jar
[JENKINS] Archiving <https://builds.apache.org/job/Apache%20Airavata/ws/modules/commons/pom.xml>
to /home/hudson/hudson/jobs/Apache Airavata/modules/org.apache.airavata$commons/builds/2012-09-08_21-13-01/archive/org.apache.airavata/commons/0.5-incubating-SNAPSHOT/commons-0.5-incubating-SNAPSHOT.pom
[JENKINS] Archiving <https://builds.apache.org/job/Apache%20Airavata/ws/modules/registry/pom.xml>
to /home/hudson/hudson/jobs/Apache Airavata/modules/org.apache.airavata$registry/builds/2012-09-08_21-13-03/archive/org.apache.airavata/registry/0.5-incubating-SNAPSHOT/registry-0.5-incubating-SNAPSHOT.pom
[JENKINS] Archiving <https://builds.apache.org/job/Apache%20Airavata/ws/modules/ws-messenger/pom.xml>
to /home/hudson/hudson/jobs/Apache Airavata/modules/org.apache.airavata$airavata-ws-messenger/builds/2012-09-08_21-12-59/archive/org.apache.airavata/airavata-ws-messenger/0.5-incubating-SNAPSHOT/airavata-ws-messenger-0.5-incubating-SNAPSHOT.pom
[JENKINS] Archiving <https://builds.apache.org/job/Apache%20Airavata/ws/samples/levenshtein-distance-service/pom.xml>
to /home/hudson/hudson/jobs/Apache Airavata/modules/org.apache.airavata$airavata-levenshtein-distance-service/builds/2012-09-08_21-13-04/archive/org.apache.airavata/airavata-levenshtein-distance-service/0.5-incubating-SNAPSHOT/airavata-levenshtein-distance-service-0.5-incubating-SNAPSHOT.pom
[JENKINS] Archiving <https://builds.apache.org/job/Apache%20Airavata/ws/modules/commons/utils/pom.xml>
to /home/hudson/hudson/jobs/Apache Airavata/modules/org.apache.airavata$airavata-common-utils/builds/2012-09-08_21-13-01/archive/org.apache.airavata/airavata-common-utils/0.5-incubating-SNAPSHOT/airavata-common-utils-0.5-incubating-SNAPSHOT.pom
[JENKINS] Archiving <https://builds.apache.org/job/Apache%20Airavata/ws/modules/commons/utils/target/airavata-common-utils-0.5-incubating-SNAPSHOT.jar>
to /home/hudson/hudson/jobs/Apache Airavata/modules/org.apache.airavata$airavata-common-utils/builds/2012-09-08_21-13-01/archive/org.apache.airavata/airavata-common-utils/0.5-incubating-SNAPSHOT/airavata-common-utils-0.5-incubating-SNAPSHOT.jar
[JENKINS] Archiving <https://builds.apache.org/job/Apache%20Airavata/ws/modules/registry/airavata-jpa-registry/pom.xml>
to /home/hudson/hudson/jobs/Apache Airavata/modules/org.apache.airavata$airavata-jpa-registry/builds/2012-09-08_21-13-03/archive/org.apache.airavata/airavata-jpa-registry/0.5-incubating-SNAPSHOT/airavata-jpa-registry-0.5-incubating-SNAPSHOT.pom
[JENKINS] Archiving <https://builds.apache.org/job/Apache%20Airavata/ws/modules/airavata-client/pom.xml>
to /home/hudson/hudson/jobs/Apache Airavata/modules/org.apache.airavata$airavata-client-api/builds/2012-09-08_21-13-04/archive/org.apache.airavata/airavata-client-api/0.5-incubating-SNAPSHOT/airavata-client-api-0.5-incubating-SNAPSHOT.pom
[JENKINS] Archiving <https://builds.apache.org/job/Apache%20Airavata/ws/modules/ws-messenger/messagebroker/pom.xml>
to /home/hudson/hudson/jobs/Apache Airavata/modules/org.apache.airavata$airavata-message-broker/builds/2012-09-08_21-13-00/archive/org.apache.airavata/airavata-message-broker/0.5-incubating-SNAPSHOT/airavata-message-broker-0.5-incubating-SNAPSHOT.pom
[JENKINS] Archiving <https://builds.apache.org/job/Apache%20Airavata/ws/modules/ws-messenger/messagebroker/target/airavata-message-broker-0.5-incubating-SNAPSHOT.jar>
to /home/hudson/hudson/jobs/Apache Airavata/modules/org.apache.airavata$airavata-message-broker/builds/2012-09-08_21-13-00/archive/org.apache.airavata/airavata-message-broker/0.5-incubating-SNAPSHOT/airavata-message-broker-0.5-incubating-SNAPSHOT.jar
[JENKINS] Archiving <https://builds.apache.org/job/Apache%20Airavata/ws/modules/workflow-model/pom.xml>
to /home/hudson/hudson/jobs/Apache Airavata/modules/org.apache.airavata$airavata-workflow-model-parent/builds/2012-09-08_21-13-00/archive/org.apache.airavata/airavata-workflow-model-parent/0.5-incubating-SNAPSHOT/airavata-workflow-model-parent-0.5-incubating-SNAPSHOT.pom
[JENKINS] Archiving <https://builds.apache.org/job/Apache%20Airavata/ws/modules/commons/common-registry-api/pom.xml>
to /home/hudson/hudson/jobs/Apache Airavata/modules/org.apache.airavata$airavata-common-registry-api/builds/2012-09-08_21-13-02/archive/org.apache.airavata/airavata-common-registry-api/0.5-incubating-SNAPSHOT/airavata-common-registry-api-0.5-incubating-SNAPSHOT.pom
[JENKINS] Archiving <https://builds.apache.org/job/Apache%20Airavata/ws/modules/commons/common-registry-api/target/airavata-common-registry-api-0.5-incubating-SNAPSHOT.jar>
to /home/hudson/hudson/jobs/Apache Airavata/modules/org.apache.airavata$airavata-common-registry-api/builds/2012-09-08_21-13-02/archive/org.apache.airavata/airavata-common-registry-api/0.5-incubating-SNAPSHOT/airavata-common-registry-api-0.5-incubating-SNAPSHOT.jar
[JENKINS] Archiving <https://builds.apache.org/job/Apache%20Airavata/ws/modules/ws-messenger/client/pom.xml>
to /home/hudson/hudson/jobs/Apache Airavata/modules/org.apache.airavata$airavata-messenger-client/builds/2012-09-08_21-12-59/archive/org.apache.airavata/airavata-messenger-client/0.5-incubating-SNAPSHOT/airavata-messenger-client-0.5-incubating-SNAPSHOT.pom
[JENKINS] Archiving <https://builds.apache.org/job/Apache%20Airavata/ws/modules/ws-messenger/client/target/airavata-messenger-client-0.5-incubating-SNAPSHOT.jar>
to /home/hudson/hudson/jobs/Apache Airavata/modules/org.apache.airavata$airavata-messenger-client/builds/2012-09-08_21-12-59/archive/org.apache.airavata/airavata-messenger-client/0.5-incubating-SNAPSHOT/airavata-messenger-client-0.5-incubating-SNAPSHOT.jar
[JENKINS] Archiving <https://builds.apache.org/job/Apache%20Airavata/ws/modules/ws-messenger/commons/pom.xml>
to /home/hudson/hudson/jobs/Apache Airavata/modules/org.apache.airavata$airavata-messenger-commons/builds/2012-09-08_21-12-59/archive/org.apache.airavata/airavata-messenger-commons/0.5-incubating-SNAPSHOT/airavata-messenger-commons-0.5-incubating-SNAPSHOT.pom
[JENKINS] Archiving <https://builds.apache.org/job/Apache%20Airavata/ws/modules/ws-messenger/commons/target/airavata-messenger-commons-0.5-incubating-SNAPSHOT.jar>
to /home/hudson/hudson/jobs/Apache Airavata/modules/org.apache.airavata$airavata-messenger-commons/builds/2012-09-08_21-12-59/archive/org.apache.airavata/airavata-messenger-commons/0.5-incubating-SNAPSHOT/airavata-messenger-commons-0.5-incubating-SNAPSHOT.jar
[JENKINS] Archiving <https://builds.apache.org/job/Apache%20Airavata/ws/modules/workflow-model/workflow-model-core/pom.xml>
to /home/hudson/hudson/jobs/Apache Airavata/modules/org.apache.airavata$airavata-workflow-model-core/builds/2012-09-08_21-13-00/archive/org.apache.airavata/airavata-workflow-model-core/0.5-incubating-SNAPSHOT/airavata-workflow-model-core-0.5-incubating-SNAPSHOT.pom
[JENKINS] Archiving <https://builds.apache.org/job/Apache%20Airavata/ws/modules/workflow-model/workflow-model-core/target/airavata-workflow-model-core-0.5-incubating-SNAPSHOT.jar>
to /home/hudson/hudson/jobs/Apache Airavata/modules/org.apache.airavata$airavata-workflow-model-core/builds/2012-09-08_21-13-00/archive/org.apache.airavata/airavata-workflow-model-core/0.5-incubating-SNAPSHOT/airavata-workflow-model-core-0.5-incubating-SNAPSHOT.jar
[JENKINS] Archiving <https://builds.apache.org/job/Apache%20Airavata/ws/modules/test-suite/pom.xml>
to /home/hudson/hudson/jobs/Apache Airavata/modules/org.apache.airavata$test-suite/builds/2012-09-08_21-13-05/archive/org.apache.airavata/test-suite/0.5-incubating-SNAPSHOT/test-suite-0.5-incubating-SNAPSHOT.pom
[JENKINS] Archiving <https://builds.apache.org/job/Apache%20Airavata/ws/modules/commons/provenance-registry/pom.xml>
to /home/hudson/hudson/jobs/Apache Airavata/modules/org.apache.airavata$airavata-provenance-registry/builds/2012-09-08_21-13-02/archive/org.apache.airavata/airavata-provenance-registry/0.5-incubating-SNAPSHOT/airavata-provenance-registry-0.5-incubating-SNAPSHOT.pom
[JENKINS] Archiving <https://builds.apache.org/job/Apache%20Airavata/ws/pom.xml> to
/home/hudson/hudson/jobs/Apache Airavata/modules/org.apache.airavata$airavata/builds/2012-09-08_21-12-58/archive/org.apache.airavata/airavata/0.5-incubating-SNAPSHOT/airavata-0.5-incubating-SNAPSHOT.pom
Waiting for Jenkins to finish collecting data
mavenExecutionResult exceptions not empty
message : Failed to execute goal org.apache.maven.plugins:maven-surefire-plugin:2.12:test
(default-test) on project airavata-jpa-registry: Error while executing forked tests.; nested
exception is java.io.IOException: Cannot run program "/bin/sh" (in directory "<https://builds.apache.org/job/Apache%20Airavata/ws/modules/registry/airavata-jpa-registry/target/test-classes")>:
error=12, Not enough space
cause : Error while executing forked tests.; nested exception is java.io.IOException: Cannot
run program "/bin/sh" (in directory "<https://builds.apache.org/job/Apache%20Airavata/ws/modules/registry/airavata-jpa-registry/target/test-classes")>:
error=12, Not enough space
Stack trace : 
org.apache.maven.lifecycle.LifecycleExecutionException: Failed to execute goal org.apache.maven.plugins:maven-surefire-plugin:2.12:test
(default-test) on project airavata-jpa-registry: Error while executing forked tests.; nested
exception is java.io.IOException: Cannot run program "/bin/sh" (in directory "<https://builds.apache.org/job/Apache%20Airavata/ws/modules/registry/airavata-jpa-registry/target/test-classes")>:
error=12, Not enough space
	at org.apache.maven.lifecycle.internal.MojoExecutor.execute(MojoExecutor.java:217)
	at org.apache.maven.lifecycle.internal.MojoExecutor.execute(MojoExecutor.java:153)
	at org.apache.maven.lifecycle.internal.MojoExecutor.execute(MojoExecutor.java:145)
	at org.apache.maven.lifecycle.internal.LifecycleModuleBuilder.buildProject(LifecycleModuleBuilder.java:84)
	at org.apache.maven.lifecycle.internal.LifecycleModuleBuilder.buildProject(LifecycleModuleBuilder.java:59)
	at org.apache.maven.lifecycle.internal.LifecycleStarter.singleThreadedBuild(LifecycleStarter.java:183)
	at org.apache.maven.lifecycle.internal.LifecycleStarter.execute(LifecycleStarter.java:161)
	at org.apache.maven.DefaultMaven.doExecute(DefaultMaven.java:319)
	at org.apache.maven.DefaultMaven.execute(DefaultMaven.java:156)
	at org.jvnet.hudson.maven3.launcher.Maven3Launcher.main(Maven3Launcher.java:79)
	at sun.reflect.NativeMethodAccessorImpl.invoke0(Native Method)
	at sun.reflect.NativeMethodAccessorImpl.invoke(NativeMethodAccessorImpl.java:39)
	at sun.reflect.DelegatingMethodAccessorImpl.invoke(DelegatingMethodAccessorImpl.java:25)
	at java.lang.reflect.Method.invoke(Method.java:597)
	at org.codehaus.plexus.classworlds.launcher.Launcher.launchStandard(Launcher.java:329)
	at org.codehaus.plexus.classworlds.launcher.Launcher.launch(Launcher.java:239)
	at org.jvnet.hudson.maven3.agent.Maven3Main.launch(Maven3Main.java:158)
	at hudson.maven.Maven3Builder.call(Maven3Builder.java:98)
	at hudson.maven.Maven3Builder.call(Maven3Builder.java:64)
	at hudson.remoting.UserRequest.perform(UserRequest.java:118)
	at hudson.remoting.UserRequest.perform(UserRequest.java:48)
	at hudson.remoting.Request$2.run(Request.java:326)
	at hudson.remoting.InterceptingExecutorService$1.call(InterceptingExecutorService.java:72)
	at java.util.concurrent.FutureTask$Sync.innerRun(FutureTask.java:303)
	at java.util.concurrent.FutureTask.run(FutureTask.java:138)
	at java.util.concurrent.ThreadPoolExecutor$Worker.runTask(ThreadPoolExecutor.java:886)
	at java.util.concurrent.ThreadPoolExecutor$Worker.run(ThreadPoolExecutor.java:908)
	at java.lang.Thread.run(Thread.java:662)
Caused by: org.apache.maven.plugin.MojoExecutionException: Error while executing forked tests.;
nested exception is java.io.IOException: Cannot run program "/bin/sh" (in directory "<https://builds.apache.org/job/Apache%20Airavata/ws/modules/registry/airavata-jpa-registry/target/test-classes")>:
error=12, Not enough space
	at org.apache.maven.plugin.surefire.SurefirePlugin.assertNoException(SurefirePlugin.java:656)
	at org.apache.maven.plugin.surefire.SurefirePlugin.handleSummary(SurefirePlugin.java:645)
	at org.apache.maven.plugin.surefire.AbstractSurefireMojo.executeAfterPreconditionsChecked(AbstractSurefireMojo.java:137)
	at org.apache.maven.plugin.surefire.AbstractSurefireMojo.execute(AbstractSurefireMojo.java:98)
	at org.apache.maven.plugin.DefaultBuildPluginManager.executeMojo(DefaultBuildPluginManager.java:101)
	at org.apache.maven.lifecycle.internal.MojoExecutor.execute(MojoExecutor.java:209)
	... 27 more
Caused by: org.apache.maven.surefire.booter.SurefireBooterForkException: Error while executing
forked tests.; nested exception is java.io.IOException: Cannot run program "/bin/sh" (in directory
"<https://builds.apache.org/job/Apache%20Airavata/ws/modules/registry/airavata-jpa-registry/target/test-classes")>:
error=12, Not enough space
	at org.apache.maven.plugin.surefire.booterclient.ForkStarter.fork(ForkStarter.java:294)
	at org.apache.maven.plugin.surefire.booterclient.ForkStarter.run(ForkStarter.java:113)
	at org.apache.maven.plugin.surefire.AbstractSurefireMojo.executeProvider(AbstractSurefireMojo.java:199)
	at org.apache.maven.plugin.surefire.AbstractSurefireMojo.executeAllProviders(AbstractSurefireMojo.java:176)
	at org.apache.maven.plugin.surefire.AbstractSurefireMojo.executeAfterPreconditionsChecked(AbstractSurefireMojo.java:135)
	... 30 more
Caused by: java.io.IOException: Cannot run program "/bin/sh" (in directory "<https://builds.apache.org/job/Apache%20Airavata/ws/modules/registry/airavata-jpa-registry/target/test-classes")>:
error=12, Not enough space
	at java.lang.ProcessBuilder.start(ProcessBuilder.java:460)
	at java.lang.Runtime.exec(Runtime.java:593)
	at org.codehaus.plexus.util.cli.Commandline.execute(Commandline.java:651)
	at org.codehaus.plexus.util.cli.CommandLineUtils.executeCommandLineAsCallable(CommandLineUtils.java:140)
	at org.codehaus.plexus.util.cli.CommandLineUtils.executeCommandLine(CommandLineUtils.java:111)
	at org.codehaus.plexus.util.cli.CommandLineUtils.executeCommandLine(CommandLineUtils.java:86)
	at org.apache.maven.plugin.surefire.booterclient.ForkStarter.fork(ForkStarter.java:276)
	... 34 more
Caused by: java.io.IOException: error=12, Not enough space
	at java.lang.UNIXProcess.forkAndExec(Native Method)
	at java.lang.UNIXProcess.<init>(UNIXProcess.java:53)
	at java.lang.ProcessImpl.start(ProcessImpl.java:65)
	at java.lang.ProcessBuilder.start(ProcessBuilder.java:453)
	... 40 more
Sending e-mails to: airavata-dev@incubator.apache.org samindaw@gmail.com
channel stopped

Mime
View raw message