airavata-dev mailing list archives

Site index · List index
Message view « Date » · « Thread »
Top « Date » · « Thread »
From Apache Jenkins Server <jenk...@builds.apache.org>
Subject Build failed in Jenkins: Apache Airavata #677
Date Thu, 06 Sep 2012 18:33:58 GMT
See <https://builds.apache.org/job/Apache%20Airavata/677/changes>

Changes:

[lahiru] Applying the patch provided by Chathuri for AIRAVATA-562

------------------------------------------
[...truncated 3788 lines...]
[INFO] 
[INFO] --- maven-clean-plugin:2.4.1:clean (default-clean) @ airavata-message-box ---
mojoSucceeded org.apache.maven.plugins:maven-clean-plugin:2.4.1(default-clean)
mojoStarted org.apache.maven.plugins:maven-resources-plugin:2.5(copy-resources)
[INFO] 
[debug] execute contextualize
[INFO] Using 'UTF-8' encoding to copy filtered resources.
[INFO] skip non existing resourceDirectory <https://builds.apache.org/job/Apache%20Airavata/ws/modules/ws-messenger/messagebox/src/main/assembly/dist>
[INFO] --- maven-resources-plugin:2.5:copy-resources (copy-resources) @ airavata-message-box
---
mojoSucceeded org.apache.maven.plugins:maven-resources-plugin:2.5(copy-resources)
mojoStarted org.apache.maven.plugins:maven-remote-resources-plugin:1.2.1(default)
[INFO] 
[INFO] --- maven-remote-resources-plugin:1.2.1:process (default) @ airavata-message-box ---
mojoSucceeded org.apache.maven.plugins:maven-remote-resources-plugin:1.2.1(default)
mojoStarted org.apache.maven.plugins:maven-resources-plugin:2.5(default-resources)
[INFO] 
[debug] execute contextualize
[INFO] Using 'UTF-8' encoding to copy filtered resources.
[INFO] Copying 3 resources
[INFO] Copying 4 resources
[INFO] --- maven-resources-plugin:2.5:resources (default-resources) @ airavata-message-box
---
mojoSucceeded org.apache.maven.plugins:maven-resources-plugin:2.5(default-resources)
mojoStarted org.apache.maven.plugins:maven-compiler-plugin:2.3.2(default-compile)
[INFO] 
[INFO] Compiling 12 source files to <https://builds.apache.org/job/Apache%20Airavata/ws/modules/ws-messenger/messagebox/target/classes>
[INFO] --- maven-compiler-plugin:2.3.2:compile (default-compile) @ airavata-message-box ---
[WARNING] <https://builds.apache.org/job/Apache%20Airavata/ws/modules/ws-messenger/messagebox/src/main/java/org/apache/airavata/wsmg/msgbox/MsgBoxServiceSkeleton.java>:[42,24]
sun.beans.editors.LongEditor is Sun proprietary API and may be removed in a future release
mojoSucceeded org.apache.maven.plugins:maven-compiler-plugin:2.3.2(default-compile)
mojoStarted org.apache.maven.plugins:maven-resources-plugin:2.5(default-testResources)[debug]
execute contextualize

[INFO] Using 'UTF-8' encoding to copy filtered resources.
[INFO] 
[INFO] Copying 1 resource
[INFO] Copying 4 resources
[INFO] --- maven-resources-plugin:2.5:testResources (default-testResources) @ airavata-message-box
---
mojoSucceeded org.apache.maven.plugins:maven-resources-plugin:2.5(default-testResources)
mojoStarted org.apache.maven.plugins:maven-compiler-plugin:2.3.2(default-testCompile)
[INFO] 
[INFO] Compiling 3 source files to <https://builds.apache.org/job/Apache%20Airavata/ws/modules/ws-messenger/messagebox/target/test-classes>
[INFO] --- maven-compiler-plugin:2.3.2:testCompile (default-testCompile) @ airavata-message-box
---
mojoSucceeded org.apache.maven.plugins:maven-compiler-plugin:2.3.2(default-testCompile)
mojoStarted org.apache.maven.plugins:maven-surefire-plugin:2.12(default-test)
[INFO] 
[INFO] Surefire report directory: <https://builds.apache.org/job/Apache%20Airavata/ws/modules/ws-messenger/messagebox/target/surefire-reports>

-------------------------------------------------------
 T E S T S
-------------------------------------------------------
[INFO] --- maven-surefire-plugin:2.12:test (default-test) @ airavata-message-box ---
Running org.apache.airavata.wsmg.msgbox.MessageBoxStressTest
Server started on port 48799.....Sep 6, 2012 6:30:39 PM org.apache.axis2.transport.http.server.DefaultConnectionListener
run
INFO: Listening on port 48799
SLF4J: Failed to load class "org.slf4j.impl.StaticLoggerBinder".
SLF4J: Defaulting to no-operation (NOP) logger implementation
SLF4J: See http://www.slf4j.org/codes.html#StaticLoggerBinder for further details.
Address: http://localhost:48799/axis2/services/MsgBoxService/clientid/accfe3df-c99c-4847-9844-e15882d997df
Retrieved message :1
<test>A simple test message</test>
MSGBOX ID:accfe3df-c99c-4847-9844-e15882d997df
http://localhost:48799/axis2/services/MsgBoxService/clientid/accfe3df-c99c-4847-9844-e15882d997df
Retrieved message :2
<foo>bar</foo>
Delete message box response :  true
All tests Done
Tests run: 1, Failures: 0, Errors: 0, Skipped: 0, Time elapsed: 6.549 sec
Running org.apache.airavata.wsmg.msgbox.MsgBoxTest
<msg><seq>0</seq><fill>123456789123456789123456789123456789</fill></msg>
<msg><seq>1</seq><fill>123456789123456789123456789123456789123456789123456789123456789123456789123456789123456789123456789123456789123456789123456789123456789123456789</fill></msg>
<msg><seq>2</seq><fill>123456789123456789123456789123456789123456789123456789123456789123456789123456789123456789</fill></msg>
<msg><seq>3</seq><fill>123456789123456789123456789123456789123456789123456789123456789123456789</fill></msg>
<msg><seq>4</seq><fill>123456789123456789123456789123456789123456789123456789</fill></msg>
<msg><seq>5</seq><fill>123456789123456789123456789123456789123456789123456789123456789</fill></msg>
<msg><seq>6</seq><fill>123456789123456789123456789123456789123456789123456789123456789123456789123456789123456789123456789123456789123456789</fill></msg>
<msg><seq>7</seq><fill>123456789123456789123456789123456789123456789123456789</fill></msg>
<msg><seq>8</seq><fill>123456789123456789123456789123456789123456789123456789</fill></msg>
<msg><seq>9</seq><fill>123456789123456789123456789123456789123456789123456789</fill></msg>
Delete message box response :  true
Tests run: 1, Failures: 0, Errors: 0, Skipped: 0, Time elapsed: 3.076 sec

Results :

Tests run: 2, Failures: 0, Errors: 0, Skipped: 0

mojoSucceeded org.apache.maven.plugins:maven-surefire-plugin:2.12(default-test)
[JENKINS] Recording test results
mojoStarted org.apache.maven.plugins:maven-antrun-plugin:1.6(restore-persistence)
[INFO] 
[WARNING] Parameter tasks is deprecated, use target instead
[INFO] --- maven-antrun-plugin:1.6:run (restore-persistence) @ airavata-message-box ---
[INFO] Executing tasks

main:
     [copy] Copying 1 file to <https://builds.apache.org/job/Apache%20Airavata/ws/modules/ws-messenger/messagebox/target/classes/META-INF>
[INFO] Executed tasks
mojoSucceeded org.apache.maven.plugins:maven-antrun-plugin:1.6(restore-persistence)
mojoStarted org.apache.maven.plugins:maven-jar-plugin:2.3.1(default-jar)
[INFO] 
[INFO] --- maven-jar-plugin:2.3.1:jar (default-jar) @ airavata-message-box ---
mojoFailed org.apache.maven.plugins:maven-jar-plugin:2.3.1(default-jar)
projectFailed org.apache.airavata:airavata-message-box:0.5-incubating-SNAPSHOT
sessionEnded
[INFO] ------------------------------------------------------------------------
[INFO] Reactor Summary:
[INFO] 
[INFO] Airavata .......................................... SUCCESS [2:05.937s]
[INFO] Airavata Commons .................................. SUCCESS [10.174s]
[INFO] Airavata GFac Schema Utilities .................... SUCCESS [1:18.339s]
[INFO] Airavata Common Utilities ......................... SUCCESS [24.741s]
[INFO] Airavata Common Registry API ...................... SUCCESS [20.026s]
[INFO] Airavata Registry API ............................. SUCCESS [1:05.925s]
[INFO] Airavata Workflow Execution Context ............... SUCCESS [21.780s]
[INFO] Airavata WS Messenger ............................. SUCCESS [8.429s]
[INFO] Airavata Messenger Commons ........................ SUCCESS [20.151s]
[INFO] Airavata Messenger Client ......................... SUCCESS [20.396s]
[INFO] Airavata Workflow Tracking ........................ SUCCESS [34.742s]
[INFO] Airavata GFac Core ................................ SUCCESS [1:01.979s]
[INFO] Airavata GFac Axis2 Interface ..................... SUCCESS [40.550s]
[INFO] Airavata Message Box .............................. FAILURE [50.471s]
[INFO] Airavata Message Broker ........................... SKIPPED
[INFO] Airavata Workflow Model Parent .................... SKIPPED
[INFO] Airavata Workflow Model Core ...................... SKIPPED
[INFO] Airavata XBaya .................................... SKIPPED
[INFO] Airavata Provenance Registry ...................... SKIPPED
[INFO] Airavata Registry ................................. SKIPPED
[INFO] Airavata JPA Registry ............................. SKIPPED
[INFO] Airavata Client ................................... SKIPPED
[INFO] Simple Math Service ............................... SKIPPED
[INFO] Complex Math Service .............................. SKIPPED
[INFO] Levenshtein Distance Service ...................... SKIPPED
[INFO] distribution ...................................... SKIPPED
[INFO] Airavata Test Suite ............................... SKIPPED
[INFO] ------------------------------------------------------------------------
[INFO] BUILD FAILURE
[INFO] ------------------------------------------------------------------------
[INFO] Total time: 10:27.638s
[INFO] Finished at: Thu Sep 06 18:31:08 GMT+00:00 2012
[INFO] Final Memory: 111M/460M
[INFO] ------------------------------------------------------------------------
Projects to build: [MavenProject: org.apache.airavata:airavata:0.5-incubating-SNAPSHOT @ <https://builds.apache.org/job/Apache%20Airavata/ws/pom.xml,>
MavenProject: org.apache.airavata:commons:0.5-incubating-SNAPSHOT @ <https://builds.apache.org/job/Apache%20Airavata/ws/modules/commons/pom.xml,>
MavenProject: org.apache.airavata:airavata-gfac-schema-utils:0.5-incubating-SNAPSHOT @ <https://builds.apache.org/job/Apache%20Airavata/ws/modules/commons/gfac-schema/pom.xml,>
MavenProject: org.apache.airavata:airavata-common-utils:0.5-incubating-SNAPSHOT @ <https://builds.apache.org/job/Apache%20Airavata/ws/modules/commons/utils/pom.xml,>
MavenProject: org.apache.airavata:airavata-common-registry-api:0.5-incubating-SNAPSHOT @ <https://builds.apache.org/job/Apache%20Airavata/ws/modules/commons/common-registry-api/pom.xml,>
MavenProject: org.apache.airavata:airavata-registry-api:0.5-incubating-SNAPSHOT @ <https://builds.apache.org/job/Apache%20Airavata/ws/modules/commons/registry-api/pom.xml,>
MavenProject: org.apache.airavata:airavata-workflow-execution-context:0.5-incubating-SNAPSHOT
@ <https://builds.apache.org/job/Apache%20Airavata/ws/modules/commons/workflow-execution-context/pom.xml,>
MavenProject: org.apache.airavata:airavata-ws-messenger:0.5-incubating-SNAPSHOT @ <https://builds.apache.org/job/Apache%20Airavata/ws/modules/ws-messenger/pom.xml,>
MavenProject: org.apache.airavata:airavata-messenger-commons:0.5-incubating-SNAPSHOT @ <https://builds.apache.org/job/Apache%20Airavata/ws/modules/ws-messenger/commons/pom.xml,>
MavenProject: org.apache.airavata:airavata-messenger-client:0.5-incubating-SNAPSHOT @ <https://builds.apache.org/job/Apache%20Airavata/ws/modules/ws-messenger/client/pom.xml,>
MavenProject: org.apache.airavata:airavata-workflow-tracking:0.5-incubating-SNAPSHOT @ <https://builds.apache.org/job/Apache%20Airavata/ws/modules/commons/workflow-tracking/pom.xml,>
MavenProject: org.apache.airavata:airavata-gfac-core:0.5-incubating-SNAPSHOT @ <https://builds.apache.org/job/Apache%20Airavata/ws/modules/gfac-core/pom.xml,>
MavenProject: org.apache.airavata:airavata-gfac-axis2-interface:0.5-incubating-SNAPSHOT @
<https://builds.apache.org/job/Apache%20Airavata/ws/modules/gfac-axis2/pom.xml,> MavenProject:
org.apache.airavata:airavata-message-box:0.5-incubating-SNAPSHOT @ <https://builds.apache.org/job/Apache%20Airavata/ws/modules/ws-messenger/messagebox/pom.xml,>
MavenProject: org.apache.airavata:airavata-message-broker:0.5-incubating-SNAPSHOT @ <https://builds.apache.org/job/Apache%20Airavata/ws/modules/ws-messenger/messagebroker/pom.xml,>
MavenProject: org.apache.airavata:airavata-workflow-model-parent:0.5-incubating-SNAPSHOT @
<https://builds.apache.org/job/Apache%20Airavata/ws/modules/workflow-model/pom.xml,>
MavenProject: org.apache.airavata:airavata-workflow-model-core:0.5-incubating-SNAPSHOT @ <https://builds.apache.org/job/Apache%20Airavata/ws/modules/workflow-model/workflow-model-core/pom.xml,>
MavenProject: org.apache.airavata:airavata-xbaya-gui:0.5-incubating-SNAPSHOT @ <https://builds.apache.org/job/Apache%20Airavata/ws/modules/xbaya-gui/pom.xml,>
MavenProject: org.apache.airavata:airavata-provenance-registry:0.5-incubating-SNAPSHOT @ <https://builds.apache.org/job/Apache%20Airavata/ws/modules/commons/provenance-registry/pom.xml,>
MavenProject: org.apache.airavata:registry:0.5-incubating-SNAPSHOT @ <https://builds.apache.org/job/Apache%20Airavata/ws/modules/registry/pom.xml,>
MavenProject: org.apache.airavata:airavata-jpa-registry:0.5-incubating-SNAPSHOT @ <https://builds.apache.org/job/Apache%20Airavata/ws/modules/registry/airavata-jpa-registry/pom.xml,>
MavenProject: org.apache.airavata:airavata-client-api:0.5-incubating-SNAPSHOT @ <https://builds.apache.org/job/Apache%20Airavata/ws/modules/airavata-client/pom.xml,>
MavenProject: org.apache.airavata:airavata-simple-math-service:0.5-incubating-SNAPSHOT @ <https://builds.apache.org/job/Apache%20Airavata/ws/samples/simple-math-service/pom.xml,>
MavenProject: org.apache.airavata:airavata-complex-math-service:0.5-incubating-SNAPSHOT @
<https://builds.apache.org/job/Apache%20Airavata/ws/samples/complex-math-service/pom.xml,>
MavenProject: org.apache.airavata:airavata-levenshtein-distance-service:0.5-incubating-SNAPSHOT
@ <https://builds.apache.org/job/Apache%20Airavata/ws/samples/levenshtein-distance-service/pom.xml,>
MavenProject: org.apache.airavata:distribution:0.5-incubating-SNAPSHOT @ <https://builds.apache.org/job/Apache%20Airavata/ws/modules/distribution/pom.xml,>
MavenProject: org.apache.airavata:test-suite:0.5-incubating-SNAPSHOT @ <https://builds.apache.org/job/Apache%20Airavata/ws/modules/test-suite/pom.xml]>
[JENKINS] Archiving <https://builds.apache.org/job/Apache%20Airavata/ws/modules/commons/workflow-tracking/pom.xml>
to /home/hudson/hudson/jobs/Apache Airavata/modules/org.apache.airavata$airavata-workflow-tracking/builds/2012-09-06_18-18-43/archive/org.apache.airavata/airavata-workflow-tracking/0.5-incubating-SNAPSHOT/airavata-workflow-tracking-0.5-incubating-SNAPSHOT.pom
[JENKINS] Archiving <https://builds.apache.org/job/Apache%20Airavata/ws/modules/commons/workflow-tracking/target/airavata-workflow-tracking-0.5-incubating-SNAPSHOT.jar>
to /home/hudson/hudson/jobs/Apache Airavata/modules/org.apache.airavata$airavata-workflow-tracking/builds/2012-09-06_18-18-43/archive/org.apache.airavata/airavata-workflow-tracking/0.5-incubating-SNAPSHOT/airavata-workflow-tracking-0.5-incubating-SNAPSHOT.jar
[JENKINS] Archiving <https://builds.apache.org/job/Apache%20Airavata/ws/samples/complex-math-service/pom.xml>
to /home/hudson/hudson/jobs/Apache Airavata/modules/org.apache.airavata$airavata-complex-math-service/builds/2012-09-06_18-18-46/archive/org.apache.airavata/airavata-complex-math-service/0.5-incubating-SNAPSHOT/airavata-complex-math-service-0.5-incubating-SNAPSHOT.pom
[JENKINS] Archiving <https://builds.apache.org/job/Apache%20Airavata/ws/samples/simple-math-service/pom.xml>
to /home/hudson/hudson/jobs/Apache Airavata/modules/org.apache.airavata$airavata-simple-math-service/builds/2012-09-06_18-18-46/archive/org.apache.airavata/airavata-simple-math-service/0.5-incubating-SNAPSHOT/airavata-simple-math-service-0.5-incubating-SNAPSHOT.pom
[JENKINS] Archiving <https://builds.apache.org/job/Apache%20Airavata/ws/modules/distribution/pom.xml>
to /home/hudson/hudson/jobs/Apache Airavata/modules/org.apache.airavata$distribution/builds/2012-09-06_18-18-47/archive/org.apache.airavata/distribution/0.5-incubating-SNAPSHOT/distribution-0.5-incubating-SNAPSHOT.pom
[JENKINS] Archiving <https://builds.apache.org/job/Apache%20Airavata/ws/modules/commons/registry-api/pom.xml>
to /home/hudson/hudson/jobs/Apache Airavata/modules/org.apache.airavata$airavata-registry-api/builds/2012-09-06_18-18-44/archive/org.apache.airavata/airavata-registry-api/0.5-incubating-SNAPSHOT/airavata-registry-api-0.5-incubating-SNAPSHOT.pom
[JENKINS] Archiving <https://builds.apache.org/job/Apache%20Airavata/ws/modules/commons/registry-api/target/airavata-registry-api-0.5-incubating-SNAPSHOT.jar>
to /home/hudson/hudson/jobs/Apache Airavata/modules/org.apache.airavata$airavata-registry-api/builds/2012-09-06_18-18-44/archive/org.apache.airavata/airavata-registry-api/0.5-incubating-SNAPSHOT/airavata-registry-api-0.5-incubating-SNAPSHOT.jar
[JENKINS] Archiving <https://builds.apache.org/job/Apache%20Airavata/ws/modules/xbaya-gui/pom.xml>
to /home/hudson/hudson/jobs/Apache Airavata/modules/org.apache.airavata$airavata-xbaya-gui/builds/2012-09-06_18-18-42/archive/org.apache.airavata/airavata-xbaya-gui/0.5-incubating-SNAPSHOT/airavata-xbaya-gui-0.5-incubating-SNAPSHOT.pom
[JENKINS] Archiving <https://builds.apache.org/job/Apache%20Airavata/ws/modules/ws-messenger/messagebox/pom.xml>
to /home/hudson/hudson/jobs/Apache Airavata/modules/org.apache.airavata$airavata-message-box/builds/2012-09-06_18-18-41/archive/org.apache.airavata/airavata-message-box/0.5-incubating-SNAPSHOT/airavata-message-box-0.5-incubating-SNAPSHOT.pom
[JENKINS] Archiving <https://builds.apache.org/job/Apache%20Airavata/ws/modules/gfac-core/pom.xml>
to /home/hudson/hudson/jobs/Apache Airavata/modules/org.apache.airavata$airavata-gfac-core/builds/2012-09-06_18-18-40/archive/org.apache.airavata/airavata-gfac-core/0.5-incubating-SNAPSHOT/airavata-gfac-core-0.5-incubating-SNAPSHOT.pom
[JENKINS] Archiving <https://builds.apache.org/job/Apache%20Airavata/ws/modules/gfac-core/target/airavata-gfac-core-0.5-incubating-SNAPSHOT.jar>
to /home/hudson/hudson/jobs/Apache Airavata/modules/org.apache.airavata$airavata-gfac-core/builds/2012-09-06_18-18-40/archive/org.apache.airavata/airavata-gfac-core/0.5-incubating-SNAPSHOT/airavata-gfac-core-0.5-incubating-SNAPSHOT.jar
[JENKINS] Archiving <https://builds.apache.org/job/Apache%20Airavata/ws/modules/commons/workflow-execution-context/pom.xml>
to /home/hudson/hudson/jobs/Apache Airavata/modules/org.apache.airavata$airavata-workflow-execution-context/builds/2012-09-06_18-18-44/archive/org.apache.airavata/airavata-workflow-execution-context/0.5-incubating-SNAPSHOT/airavata-workflow-execution-context-0.5-incubating-SNAPSHOT.pom
[JENKINS] Archiving <https://builds.apache.org/job/Apache%20Airavata/ws/modules/commons/workflow-execution-context/target/airavata-workflow-execution-context-0.5-incubating-SNAPSHOT.jar>
to /home/hudson/hudson/jobs/Apache Airavata/modules/org.apache.airavata$airavata-workflow-execution-context/builds/2012-09-06_18-18-44/archive/org.apache.airavata/airavata-workflow-execution-context/0.5-incubating-SNAPSHOT/airavata-workflow-execution-context-0.5-incubating-SNAPSHOT.jar
[JENKINS] Archiving <https://builds.apache.org/job/Apache%20Airavata/ws/modules/gfac-axis2/pom.xml>
to /home/hudson/hudson/jobs/Apache Airavata/modules/org.apache.airavata$airavata-gfac-axis2-interface/builds/2012-09-06_18-18-40/archive/org.apache.airavata/airavata-gfac-axis2-interface/0.5-incubating-SNAPSHOT/airavata-gfac-axis2-interface-0.5-incubating-SNAPSHOT.pom
[JENKINS] Archiving <https://builds.apache.org/job/Apache%20Airavata/ws/modules/gfac-axis2/target/airavata-gfac-axis2-interface-0.5-incubating-SNAPSHOT.jar>
to /home/hudson/hudson/jobs/Apache Airavata/modules/org.apache.airavata$airavata-gfac-axis2-interface/builds/2012-09-06_18-18-40/archive/org.apache.airavata/airavata-gfac-axis2-interface/0.5-incubating-SNAPSHOT/airavata-gfac-axis2-interface-0.5-incubating-SNAPSHOT.jar
[JENKINS] Archiving <https://builds.apache.org/job/Apache%20Airavata/ws/modules/commons/pom.xml>
to /home/hudson/hudson/jobs/Apache Airavata/modules/org.apache.airavata$commons/builds/2012-09-06_18-18-43/archive/org.apache.airavata/commons/0.5-incubating-SNAPSHOT/commons-0.5-incubating-SNAPSHOT.pom
[JENKINS] Archiving <https://builds.apache.org/job/Apache%20Airavata/ws/modules/registry/pom.xml>
to /home/hudson/hudson/jobs/Apache Airavata/modules/org.apache.airavata$registry/builds/2012-09-06_18-18-45/archive/org.apache.airavata/registry/0.5-incubating-SNAPSHOT/registry-0.5-incubating-SNAPSHOT.pom
[JENKINS] Archiving <https://builds.apache.org/job/Apache%20Airavata/ws/modules/ws-messenger/pom.xml>
to /home/hudson/hudson/jobs/Apache Airavata/modules/org.apache.airavata$airavata-ws-messenger/builds/2012-09-06_18-18-41/archive/org.apache.airavata/airavata-ws-messenger/0.5-incubating-SNAPSHOT/airavata-ws-messenger-0.5-incubating-SNAPSHOT.pom
[JENKINS] Archiving <https://builds.apache.org/job/Apache%20Airavata/ws/samples/levenshtein-distance-service/pom.xml>
to /home/hudson/hudson/jobs/Apache Airavata/modules/org.apache.airavata$airavata-levenshtein-distance-service/builds/2012-09-06_18-18-46/archive/org.apache.airavata/airavata-levenshtein-distance-service/0.5-incubating-SNAPSHOT/airavata-levenshtein-distance-service-0.5-incubating-SNAPSHOT.pom
[JENKINS] Archiving <https://builds.apache.org/job/Apache%20Airavata/ws/modules/registry/airavata-jpa-registry/pom.xml>
to /home/hudson/hudson/jobs/Apache Airavata/modules/org.apache.airavata$airavata-jpa-registry/builds/2012-09-06_18-18-45/archive/org.apache.airavata/airavata-jpa-registry/0.5-incubating-SNAPSHOT/airavata-jpa-registry-0.5-incubating-SNAPSHOT.pom
[JENKINS] Archiving <https://builds.apache.org/job/Apache%20Airavata/ws/modules/commons/utils/pom.xml>
to /home/hudson/hudson/jobs/Apache Airavata/modules/org.apache.airavata$airavata-common-utils/builds/2012-09-06_18-18-44/archive/org.apache.airavata/airavata-common-utils/0.5-incubating-SNAPSHOT/airavata-common-utils-0.5-incubating-SNAPSHOT.pom
[JENKINS] Archiving <https://builds.apache.org/job/Apache%20Airavata/ws/modules/commons/utils/target/airavata-common-utils-0.5-incubating-SNAPSHOT.jar>
to /home/hudson/hudson/jobs/Apache Airavata/modules/org.apache.airavata$airavata-common-utils/builds/2012-09-06_18-18-44/archive/org.apache.airavata/airavata-common-utils/0.5-incubating-SNAPSHOT/airavata-common-utils-0.5-incubating-SNAPSHOT.jar
[JENKINS] Archiving <https://builds.apache.org/job/Apache%20Airavata/ws/modules/airavata-client/pom.xml>
to /home/hudson/hudson/jobs/Apache Airavata/modules/org.apache.airavata$airavata-client-api/builds/2012-09-06_18-18-46/archive/org.apache.airavata/airavata-client-api/0.5-incubating-SNAPSHOT/airavata-client-api-0.5-incubating-SNAPSHOT.pom
[JENKINS] Archiving <https://builds.apache.org/job/Apache%20Airavata/ws/modules/ws-messenger/messagebroker/pom.xml>
to /home/hudson/hudson/jobs/Apache Airavata/modules/org.apache.airavata$airavata-message-broker/builds/2012-09-06_18-18-42/archive/org.apache.airavata/airavata-message-broker/0.5-incubating-SNAPSHOT/airavata-message-broker-0.5-incubating-SNAPSHOT.pom
[JENKINS] Archiving <https://builds.apache.org/job/Apache%20Airavata/ws/modules/commons/gfac-schema/pom.xml>
to /home/hudson/hudson/jobs/Apache Airavata/modules/org.apache.airavata$airavata-gfac-schema-utils/builds/2012-09-06_18-18-43/archive/org.apache.airavata/airavata-gfac-schema-utils/0.5-incubating-SNAPSHOT/airavata-gfac-schema-utils-0.5-incubating-SNAPSHOT.pom
[JENKINS] Archiving <https://builds.apache.org/job/Apache%20Airavata/ws/modules/commons/gfac-schema/target/airavata-gfac-schema-utils-0.5-incubating-SNAPSHOT.jar>
to /home/hudson/hudson/jobs/Apache Airavata/modules/org.apache.airavata$airavata-gfac-schema-utils/builds/2012-09-06_18-18-43/archive/org.apache.airavata/airavata-gfac-schema-utils/0.5-incubating-SNAPSHOT/airavata-gfac-schema-utils-0.5-incubating-SNAPSHOT.jar
[JENKINS] Archiving <https://builds.apache.org/job/Apache%20Airavata/ws/modules/workflow-model/pom.xml>
to /home/hudson/hudson/jobs/Apache Airavata/modules/org.apache.airavata$airavata-workflow-model-parent/builds/2012-09-06_18-18-42/archive/org.apache.airavata/airavata-workflow-model-parent/0.5-incubating-SNAPSHOT/airavata-workflow-model-parent-0.5-incubating-SNAPSHOT.pom
[JENKINS] Archiving <https://builds.apache.org/job/Apache%20Airavata/ws/modules/commons/common-registry-api/pom.xml>
to /home/hudson/hudson/jobs/Apache Airavata/modules/org.apache.airavata$airavata-common-registry-api/builds/2012-09-06_18-18-44/archive/org.apache.airavata/airavata-common-registry-api/0.5-incubating-SNAPSHOT/airavata-common-registry-api-0.5-incubating-SNAPSHOT.pom
[JENKINS] Archiving <https://builds.apache.org/job/Apache%20Airavata/ws/modules/commons/common-registry-api/target/airavata-common-registry-api-0.5-incubating-SNAPSHOT.jar>
to /home/hudson/hudson/jobs/Apache Airavata/modules/org.apache.airavata$airavata-common-registry-api/builds/2012-09-06_18-18-44/archive/org.apache.airavata/airavata-common-registry-api/0.5-incubating-SNAPSHOT/airavata-common-registry-api-0.5-incubating-SNAPSHOT.jar
[JENKINS] Archiving <https://builds.apache.org/job/Apache%20Airavata/ws/modules/ws-messenger/client/pom.xml>
to /home/hudson/hudson/jobs/Apache Airavata/modules/org.apache.airavata$airavata-messenger-client/builds/2012-09-06_18-18-41/archive/org.apache.airavata/airavata-messenger-client/0.5-incubating-SNAPSHOT/airavata-messenger-client-0.5-incubating-SNAPSHOT.pom
[JENKINS] Archiving <https://builds.apache.org/job/Apache%20Airavata/ws/modules/ws-messenger/client/target/airavata-messenger-client-0.5-incubating-SNAPSHOT.jar>
to /home/hudson/hudson/jobs/Apache Airavata/modules/org.apache.airavata$airavata-messenger-client/builds/2012-09-06_18-18-41/archive/org.apache.airavata/airavata-messenger-client/0.5-incubating-SNAPSHOT/airavata-messenger-client-0.5-incubating-SNAPSHOT.jar
[JENKINS] Archiving <https://builds.apache.org/job/Apache%20Airavata/ws/modules/ws-messenger/commons/pom.xml>
to /home/hudson/hudson/jobs/Apache Airavata/modules/org.apache.airavata$airavata-messenger-commons/builds/2012-09-06_18-18-41/archive/org.apache.airavata/airavata-messenger-commons/0.5-incubating-SNAPSHOT/airavata-messenger-commons-0.5-incubating-SNAPSHOT.pom
[JENKINS] Archiving <https://builds.apache.org/job/Apache%20Airavata/ws/modules/ws-messenger/commons/target/airavata-messenger-commons-0.5-incubating-SNAPSHOT.jar>
to /home/hudson/hudson/jobs/Apache Airavata/modules/org.apache.airavata$airavata-messenger-commons/builds/2012-09-06_18-18-41/archive/org.apache.airavata/airavata-messenger-commons/0.5-incubating-SNAPSHOT/airavata-messenger-commons-0.5-incubating-SNAPSHOT.jar
[JENKINS] Archiving <https://builds.apache.org/job/Apache%20Airavata/ws/modules/workflow-model/workflow-model-core/pom.xml>
to /home/hudson/hudson/jobs/Apache Airavata/modules/org.apache.airavata$airavata-workflow-model-core/builds/2012-09-06_18-18-42/archive/org.apache.airavata/airavata-workflow-model-core/0.5-incubating-SNAPSHOT/airavata-workflow-model-core-0.5-incubating-SNAPSHOT.pom
[JENKINS] Archiving <https://builds.apache.org/job/Apache%20Airavata/ws/modules/test-suite/pom.xml>
to /home/hudson/hudson/jobs/Apache Airavata/modules/org.apache.airavata$test-suite/builds/2012-09-06_18-18-47/archive/org.apache.airavata/test-suite/0.5-incubating-SNAPSHOT/test-suite-0.5-incubating-SNAPSHOT.pom
[JENKINS] Archiving <https://builds.apache.org/job/Apache%20Airavata/ws/modules/commons/provenance-registry/pom.xml>
to /home/hudson/hudson/jobs/Apache Airavata/modules/org.apache.airavata$airavata-provenance-registry/builds/2012-09-06_18-18-44/archive/org.apache.airavata/airavata-provenance-registry/0.5-incubating-SNAPSHOT/airavata-provenance-registry-0.5-incubating-SNAPSHOT.pom
[JENKINS] Archiving <https://builds.apache.org/job/Apache%20Airavata/ws/pom.xml> to
/home/hudson/hudson/jobs/Apache Airavata/modules/org.apache.airavata$airavata/builds/2012-09-06_18-18-39/archive/org.apache.airavata/airavata/0.5-incubating-SNAPSHOT/airavata-0.5-incubating-SNAPSHOT.pom
Waiting for Jenkins to finish collecting data
mavenExecutionResult exceptions not empty
message : Failed to execute goal org.apache.maven.plugins:maven-jar-plugin:2.3.1:jar (default-jar)
on project airavata-message-box: Error assembling JAR
cause : Error assembling JAR
Stack trace : 
org.apache.maven.lifecycle.LifecycleExecutionException: Failed to execute goal org.apache.maven.plugins:maven-jar-plugin:2.3.1:jar
(default-jar) on project airavata-message-box: Error assembling JAR
	at org.apache.maven.lifecycle.internal.MojoExecutor.execute(MojoExecutor.java:217)
	at org.apache.maven.lifecycle.internal.MojoExecutor.execute(MojoExecutor.java:153)
	at org.apache.maven.lifecycle.internal.MojoExecutor.execute(MojoExecutor.java:145)
	at org.apache.maven.lifecycle.internal.LifecycleModuleBuilder.buildProject(LifecycleModuleBuilder.java:84)
	at org.apache.maven.lifecycle.internal.LifecycleModuleBuilder.buildProject(LifecycleModuleBuilder.java:59)
	at org.apache.maven.lifecycle.internal.LifecycleStarter.singleThreadedBuild(LifecycleStarter.java:183)
	at org.apache.maven.lifecycle.internal.LifecycleStarter.execute(LifecycleStarter.java:161)
	at org.apache.maven.DefaultMaven.doExecute(DefaultMaven.java:319)
	at org.apache.maven.DefaultMaven.execute(DefaultMaven.java:156)
	at org.jvnet.hudson.maven3.launcher.Maven3Launcher.main(Maven3Launcher.java:79)
	at sun.reflect.NativeMethodAccessorImpl.invoke0(Native Method)
	at sun.reflect.NativeMethodAccessorImpl.invoke(NativeMethodAccessorImpl.java:39)
	at sun.reflect.DelegatingMethodAccessorImpl.invoke(DelegatingMethodAccessorImpl.java:25)
	at java.lang.reflect.Method.invoke(Method.java:597)
	at org.codehaus.plexus.classworlds.launcher.Launcher.launchStandard(Launcher.java:329)
	at org.codehaus.plexus.classworlds.launcher.Launcher.launch(Launcher.java:239)
	at org.jvnet.hudson.maven3.agent.Maven3Main.launch(Maven3Main.java:158)
	at hudson.maven.Maven3Builder.call(Maven3Builder.java:98)
	at hudson.maven.Maven3Builder.call(Maven3Builder.java:64)
	at hudson.remoting.UserRequest.perform(UserRequest.java:118)
	at hudson.remoting.UserRequest.perform(UserRequest.java:48)
	at hudson.remoting.Request$2.run(Request.java:326)
	at hudson.remoting.InterceptingExecutorService$1.call(InterceptingExecutorService.java:72)
	at java.util.concurrent.FutureTask$Sync.innerRun(FutureTask.java:303)
	at java.util.concurrent.FutureTask.run(FutureTask.java:138)
	at java.util.concurrent.ThreadPoolExecutor$Worker.runTask(ThreadPoolExecutor.java:886)
	at java.util.concurrent.ThreadPoolExecutor$Worker.run(ThreadPoolExecutor.java:908)
	at java.lang.Thread.run(Thread.java:662)
Caused by: org.apache.maven.plugin.MojoExecutionException: Error assembling JAR
	at org.apache.maven.plugin.jar.AbstractJarMojo.createArchive(AbstractJarMojo.java:223)
	at org.apache.maven.plugin.jar.AbstractJarMojo.execute(AbstractJarMojo.java:235)
	at org.apache.maven.plugin.DefaultBuildPluginManager.executeMojo(DefaultBuildPluginManager.java:101)
	at org.apache.maven.lifecycle.internal.MojoExecutor.execute(MojoExecutor.java:209)
	... 27 more
Caused by: org.codehaus.plexus.archiver.ArchiverException: Failed to read filesystem attributes
for: <https://builds.apache.org/job/Apache%20Airavata/ws/modules/ws-messenger/messagebox/pom.xml>
	at org.codehaus.plexus.archiver.ArchiveEntry.createFileEntry(ArchiveEntry.java:161)
	at org.codehaus.plexus.archiver.AbstractArchiver.addFile(AbstractArchiver.java:374)
	at org.codehaus.plexus.archiver.AbstractArchiver.addFile(AbstractArchiver.java:290)
	at org.apache.maven.archiver.MavenArchiver.createArchive(MavenArchiver.java:487)
	at org.apache.maven.plugin.jar.AbstractJarMojo.createArchive(AbstractJarMojo.java:216)
	... 30 more
Caused by: java.io.IOException: Failed to retrieve numeric file attributes using: '/bin/sh
-c ls -1lad '<https://builds.apache.org/job/Apache%20Airavata/ws/modules/ws-messenger/messagebox/pom.xml''>
	at org.codehaus.plexus.components.io.attributes.PlexusIoResourceAttributeUtils.executeLs(PlexusIoResourceAttributeUtils.java:287)
	at org.codehaus.plexus.components.io.attributes.PlexusIoResourceAttributeUtils.getFileAttributesByPath(PlexusIoResourceAttributeUtils.java:237)
	at org.codehaus.plexus.components.io.attributes.PlexusIoResourceAttributeUtils.getFileAttributes(PlexusIoResourceAttributeUtils.java:168)
	at org.codehaus.plexus.archiver.ArchiveEntry.createFileEntry(ArchiveEntry.java:157)
	... 34 more
Caused by: org.codehaus.plexus.util.cli.CommandLineException: Error while executing process.
	at org.codehaus.plexus.util.cli.Commandline.execute(Commandline.java:656)
	at org.codehaus.plexus.util.cli.CommandLineUtils.executeCommandLine(CommandLineUtils.java:144)
	at org.codehaus.plexus.util.cli.CommandLineUtils.executeCommandLine(CommandLineUtils.java:107)
	at org.codehaus.plexus.components.io.attributes.PlexusIoResourceAttributeUtils.executeLs(PlexusIoResourceAttributeUtils.java:277)
	... 37 more
Caused by: java.io.IOException: Cannot run program "/bin/sh": error=12, Not enough space
	at java.lang.ProcessBuilder.start(ProcessBuilder.java:460)
	at java.lang.Runtime.exec(Runtime.java:593)
	at java.lang.Runtime.exec(Runtime.java:509)
	at org.codehaus.plexus.util.cli.Commandline.execute(Commandline.java:636)
	... 40 more
Caused by: java.io.IOException: error=12, Not enough space
	at java.lang.UNIXProcess.forkAndExec(Native Method)
	at java.lang.UNIXProcess.<init>(UNIXProcess.java:53)
	at java.lang.ProcessImpl.start(ProcessImpl.java:65)
	at java.lang.ProcessBuilder.start(ProcessBuilder.java:453)
	... 43 more
Sending e-mails to: airavata-dev@incubator.apache.org
channel stopped

Mime
View raw message