airavata-dev mailing list archives

Site index · List index
Message view « Date » · « Thread »
Top « Date » · « Thread »
From Apache Jenkins Server <jenk...@builds.apache.org>
Subject Build failed in Jenkins: Apache Airavata #707
Date Thu, 13 Sep 2012 15:14:47 GMT
See <https://builds.apache.org/job/Apache%20Airavata/707/changes>

Changes:

[lahiru] updating isExist method of GatewaiyResource

------------------------------------------
[...truncated 5353 lines...]
[WARNING] Entry: apache-airavata-0.5-incubating-SNAPSHOT/samples/messagebroker/wse-multiple-producers-consumers/src/org/apache/airavata/wsmg/samples/wse/Consumer.java
longer than 100 characters.
[WARNING] Entry: apache-airavata-0.5-incubating-SNAPSHOT/samples/messagebroker/wse-multiple-producers-consumers/build.xml
longer than 100 characters.
[WARNING] Entry: apache-airavata-0.5-incubating-SNAPSHOT/samples/messagebroker/wse-multiple-producers-consumers/build.properties
longer than 100 characters.
[WARNING] Entry: apache-airavata-0.5-incubating-SNAPSHOT/samples/messagebroker/wse-multiple-producers-consumers/conf/configurations.properties
longer than 100 characters.
[WARNING] Entry: apache-airavata-0.5-incubating-SNAPSHOT/samples/messagebroker/wse-topic-subscription/src/org/apache/airavata/wsmg/samples/util/ConfigKeys.java
longer than 100 characters.
[WARNING] Entry: apache-airavata-0.5-incubating-SNAPSHOT/samples/messagebroker/wse-topic-subscription/src/org/apache/airavata/wsmg/samples/wse/TopicSubscribe.java
longer than 100 characters.
[WARNING] Entry: apache-airavata-0.5-incubating-SNAPSHOT/samples/messagebroker/wse-topic-subscription/build.properties
longer than 100 characters.
[WARNING] Entry: apache-airavata-0.5-incubating-SNAPSHOT/samples/messagebroker/wse-topic-subscription/conf/configurations.properties
longer than 100 characters.
[WARNING] Entry: apache-airavata-0.5-incubating-SNAPSHOT/samples/messagebroker/wse-xpath-subscription/src/org/apache/airavata/wsmg/samples/util/ConfigKeys.java
longer than 100 characters.
[WARNING] Entry: apache-airavata-0.5-incubating-SNAPSHOT/samples/messagebroker/wse-xpath-subscription/src/org/apache/airavata/wsmg/samples/wse/XpathSubscribe.java
longer than 100 characters.
[WARNING] Entry: apache-airavata-0.5-incubating-SNAPSHOT/samples/messagebroker/wse-xpath-subscription/build.properties
longer than 100 characters.
[WARNING] Entry: apache-airavata-0.5-incubating-SNAPSHOT/samples/messagebroker/wse-xpath-subscription/conf/configurations.properties
longer than 100 characters.
[WARNING] Entry: apache-airavata-0.5-incubating-SNAPSHOT/samples/messagebroker/wse-multiple-producers-consumers-topics/README.txt
longer than 100 characters.
[WARNING] Entry: apache-airavata-0.5-incubating-SNAPSHOT/samples/messagebroker/wse-multiple-producers-consumers-topics/src/org/apache/airavata/wsmg/samples/util/ConfigKeys.java
longer than 100 characters.
[WARNING] Entry: apache-airavata-0.5-incubating-SNAPSHOT/samples/messagebroker/wse-multiple-producers-consumers-topics/src/org/apache/airavata/wsmg/samples/wse/Producer.java
longer than 100 characters.
[WARNING] Entry: apache-airavata-0.5-incubating-SNAPSHOT/samples/messagebroker/wse-multiple-producers-consumers-topics/src/org/apache/airavata/wsmg/samples/wse/MsgUtil.java
longer than 100 characters.
[WARNING] Entry: apache-airavata-0.5-incubating-SNAPSHOT/samples/messagebroker/wse-multiple-producers-consumers-topics/src/org/apache/airavata/wsmg/samples/wse/MultipleProducersConsumersTopics.java
longer than 100 characters.
[WARNING] Entry: apache-airavata-0.5-incubating-SNAPSHOT/samples/messagebroker/wse-multiple-producers-consumers-topics/src/org/apache/airavata/wsmg/samples/wse/Consumer.java
longer than 100 characters.
[WARNING] Entry: apache-airavata-0.5-incubating-SNAPSHOT/samples/messagebroker/wse-multiple-producers-consumers-topics/build.xml
longer than 100 characters.
[WARNING] Entry: apache-airavata-0.5-incubating-SNAPSHOT/samples/messagebroker/wse-multiple-producers-consumers-topics/build.properties
longer than 100 characters.
[WARNING] Entry: apache-airavata-0.5-incubating-SNAPSHOT/samples/messagebroker/wse-multiple-producers-consumers-topics/conf/configurations.properties
longer than 100 characters.
[WARNING] Entry: apache-airavata-0.5-incubating-SNAPSHOT/samples/messagebroker/wnt-multiple-producers-consumers-topics/README.txt
longer than 100 characters.
[WARNING] Entry: apache-airavata-0.5-incubating-SNAPSHOT/samples/messagebroker/wnt-multiple-producers-consumers-topics/src/org/apache/airavata/wsmg/samples/util/ConfigKeys.java
longer than 100 characters.
[WARNING] Entry: apache-airavata-0.5-incubating-SNAPSHOT/samples/messagebroker/wnt-multiple-producers-consumers-topics/src/org/apache/airavata/wsmg/samples/wse/Producer.java
longer than 100 characters.
[WARNING] Entry: apache-airavata-0.5-incubating-SNAPSHOT/samples/messagebroker/wnt-multiple-producers-consumers-topics/src/org/apache/airavata/wsmg/samples/wse/MsgUtil.java
longer than 100 characters.
[WARNING] Entry: apache-airavata-0.5-incubating-SNAPSHOT/samples/messagebroker/wnt-multiple-producers-consumers-topics/src/org/apache/airavata/wsmg/samples/wse/MultipleProducersConsumersTopics.java
longer than 100 characters.
[WARNING] Entry: apache-airavata-0.5-incubating-SNAPSHOT/samples/messagebroker/wnt-multiple-producers-consumers-topics/build.xml
longer than 100 characters.
[WARNING] Entry: apache-airavata-0.5-incubating-SNAPSHOT/samples/messagebroker/wnt-multiple-producers-consumers-topics/build.properties
longer than 100 characters.
[WARNING] Entry: apache-airavata-0.5-incubating-SNAPSHOT/samples/messagebroker/wnt-multiple-producers-consumers-topics/conf/configurations.properties
longer than 100 characters.
[WARNING] Entry: apache-airavata-0.5-incubating-SNAPSHOT/standalone-server/repository/services/airavata-complex-math-service-0.5-incubating-SNAPSHOT.aar
longer than 100 characters.
[WARNING] Entry: apache-airavata-0.5-incubating-SNAPSHOT/standalone-server/repository/services/airavata-levenshtein-distance-service-0.5-incubating-SNAPSHOT.aar
longer than 100 characters.
[INFO] apache-airavata-0.5-incubating-SNAPSHOT/standalone-server/conf/jcr.properties already
added, skipping
[INFO] apache-airavata-0.5-incubating-SNAPSHOT/standalone-server/conf/xbaya.properties already
added, skipping
[INFO] apache-airavata-0.5-incubating-SNAPSHOT/standalone-server/conf/provenance.sql already
added, skipping
[INFO] apache-airavata-0.5-incubating-SNAPSHOT/standalone-server/conf/host.xml already added,
skipping
[WARNING] Cannot include project artifact: org.apache.airavata:distribution:pom:0.5-incubating-SNAPSHOT;
it doesn't have an associated file or directory.
[WARNING] The following patterns were never triggered in this artifact inclusion filter:
o  'gfac:gfac-schema-utils'
o  'lead-security:jce'
o  'xmlbeans-ogce:jsr173_api'
o  'wsmg:wsmg'
o  'org.apache.airavata:airavata-registry-migrator:jar'

[WARNING] Cannot include project artifact: org.apache.airavata:distribution:pom:0.5-incubating-SNAPSHOT;
it doesn't have an associated file or directory.
[WARNING] Cannot include project artifact: org.apache.airavata:distribution:pom:0.5-incubating-SNAPSHOT;
it doesn't have an associated file or directory.
[WARNING] The following patterns were never triggered in this artifact inclusion filter:
o  'org.apache.airavata:airavata-client-api'

Downloading: http://repo1.maven.org/maven2/org/apache/jackrabbit/jackrabbit-standalone/2.2.7/jackrabbit-standalone-2.2.7.pom
Downloading: http://community.ucs.indiana.edu:9090/archiva/repository/ogce.m2.all/org/apache/jackrabbit/jackrabbit-standalone/2.2.7/jackrabbit-standalone-2.2.7.pom
Downloading: http://people.apache.org/repo/m2-snapshot-repository/org/apache/jackrabbit/jackrabbit-standalone/2.2.7/jackrabbit-standalone-2.2.7.pom
Downloading: http://maven.ow2.org/maven2/org/apache/jackrabbit/jackrabbit-standalone/2.2.7/jackrabbit-standalone-2.2.7.pom
[INFO] apache-airavata-0.5-incubating-SNAPSHOT/standalone-server/conf/jcr.properties already
added, skipping
[INFO] apache-airavata-0.5-incubating-SNAPSHOT/standalone-server/conf/xbaya.properties already
added, skipping
[INFO] apache-airavata-0.5-incubating-SNAPSHOT/standalone-server/conf/provenance.sql already
added, skipping
[INFO] apache-airavata-0.5-incubating-SNAPSHOT/standalone-server/conf/host.xml already added,
skipping
[INFO] Building zip: <https://builds.apache.org/job/Apache%20Airavata/ws/modules/distribution/target/apache-airavata-0.5-incubating-SNAPSHOT-bin.zip>
[INFO] apache-airavata-0.5-incubating-SNAPSHOT/standalone-server/conf/jcr.properties already
added, skipping
[INFO] apache-airavata-0.5-incubating-SNAPSHOT/standalone-server/conf/xbaya.properties already
added, skipping
[INFO] apache-airavata-0.5-incubating-SNAPSHOT/standalone-server/conf/provenance.sql already
added, skipping
[INFO] apache-airavata-0.5-incubating-SNAPSHOT/standalone-server/conf/host.xml already added,
skipping
mojoSucceeded org.apache.maven.plugins:maven-assembly-plugin:2.3(distribution-package)
mojoStarted org.apache.maven.plugins:maven-install-plugin:2.3.1(default-install)[INFO] Installing
<https://builds.apache.org/job/Apache%20Airavata/ws/modules/distribution/pom.xml> to
/home/jenkins/jenkins-slave/maven-repositories/0/org/apache/airavata/distribution/0.5-incubating-SNAPSHOT/distribution-0.5-incubating-SNAPSHOT.pom

[INFO] 
[INFO] --- maven-install-plugin:2.3.1:install (default-install) @ distribution ---
mojoSucceeded org.apache.maven.plugins:maven-install-plugin:2.3.1(default-install)
projectSucceeded org.apache.airavata:distribution:0.5-incubating-SNAPSHOT
projectStarted org.apache.airavata:test-suite:0.5-incubating-SNAPSHOT
[INFO]                                                                         
[INFO] ------------------------------------------------------------------------
[INFO] Building Airavata Test Suite 0.5-incubating-SNAPSHOT
[INFO] ------------------------------------------------------------------------
mojoStarted org.apache.maven.plugins:maven-clean-plugin:2.4.1(default-clean)
[INFO] 
[INFO] --- maven-clean-plugin:2.4.1:clean (default-clean) @ test-suite ---
mojoSucceeded org.apache.maven.plugins:maven-clean-plugin:2.4.1(default-clean)
mojoStarted org.apache.maven.plugins:maven-resources-plugin:2.5(copy-resources)[debug] execute
contextualize
[INFO] Using 'UTF-8' encoding to copy filtered resources.
[INFO] skip non existing resourceDirectory <https://builds.apache.org/job/Apache%20Airavata/ws/modules/test-suite/src/main/assembly/dist>

[INFO] 
[INFO] --- maven-resources-plugin:2.5:copy-resources (copy-resources) @ test-suite ---
mojoSucceeded org.apache.maven.plugins:maven-resources-plugin:2.5(copy-resources)
mojoStarted org.apache.maven.plugins:maven-remote-resources-plugin:1.2.1(default)
[INFO] 
[INFO] --- maven-remote-resources-plugin:1.2.1:process (default) @ test-suite ---
mojoSucceeded org.apache.maven.plugins:maven-remote-resources-plugin:1.2.1(default)
mojoStarted org.apache.maven.plugins:maven-resources-plugin:2.5(default-resources)[debug]
execute contextualize
[INFO] Using 'UTF-8' encoding to copy filtered resources.
[INFO] Copying 0 resource
[INFO] Copying 4 resources

[INFO] 
[INFO] --- maven-resources-plugin:2.5:resources (default-resources) @ test-suite ---
mojoSucceeded org.apache.maven.plugins:maven-resources-plugin:2.5(default-resources)
mojoStarted org.apache.maven.plugins:maven-compiler-plugin:2.3.2(default-compile)[INFO] Nothing
to compile - all classes are up to date

[INFO] 
[INFO] --- maven-compiler-plugin:2.3.2:compile (default-compile) @ test-suite ---
mojoSucceeded org.apache.maven.plugins:maven-compiler-plugin:2.3.2(default-compile)
[debug] execute contextualize
mojoStarted org.apache.maven.plugins:maven-resources-plugin:2.5(default-testResources)[INFO]
Using 'UTF-8' encoding to copy filtered resources.
[INFO] Copying 2 resources
[INFO] Copying 4 resources

[INFO] 
[INFO] --- maven-resources-plugin:2.5:testResources (default-testResources) @ test-suite ---
mojoSucceeded org.apache.maven.plugins:maven-resources-plugin:2.5(default-testResources)
mojoStarted org.apache.maven.plugins:maven-compiler-plugin:2.3.2(default-testCompile)[INFO]
Compiling 23 source files to <https://builds.apache.org/job/Apache%20Airavata/ws/modules/test-suite/target/test-classes>

[INFO] 
[INFO] --- maven-compiler-plugin:2.3.2:testCompile (default-testCompile) @ test-suite ---
[INFO] -------------------------------------------------------------
[ERROR] COMPILATION ERROR : 
[INFO] -------------------------------------------------------------
[ERROR] <https://builds.apache.org/job/Apache%20Airavata/ws/modules/test-suite/src/test/java/org/apache/airavata/test/suite/gfac/GramProviderPwscfRangerTest.java>:[124,14]
setRegistryService(org.apache.airavata.registry.api.AiravataRegistry2) in org.apache.airavata.core.gfac.context.invocation.impl.DefaultExecutionContext
cannot be applied to (org.apache.airavata.registry.api.impl.AiravataJCRRegistry)
[ERROR] <https://builds.apache.org/job/Apache%20Airavata/ws/modules/test-suite/src/test/java/org/apache/airavata/test/suite/gfac/GramProviderMPIRangerTest.java>:[124,14]
setRegistryService(org.apache.airavata.registry.api.AiravataRegistry2) in org.apache.airavata.core.gfac.context.invocation.impl.DefaultExecutionContext
cannot be applied to (org.apache.airavata.registry.api.impl.AiravataJCRRegistry)
[ERROR] <https://builds.apache.org/job/Apache%20Airavata/ws/modules/test-suite/src/test/java/org/apache/airavata/test/suite/gfac/FileBreedGramTest.java>:[142,14]
setRegistryService(org.apache.airavata.registry.api.AiravataRegistry2) in org.apache.airavata.core.gfac.context.invocation.impl.DefaultExecutionContext
cannot be applied to (org.apache.airavata.registry.api.impl.AiravataJCRRegistry)
[ERROR] <https://builds.apache.org/job/Apache%20Airavata/ws/modules/test-suite/src/test/java/org/apache/airavata/test/suite/gfac/GramProviderTest.java>:[138,14]
setRegistryService(org.apache.airavata.registry.api.AiravataRegistry2) in org.apache.airavata.core.gfac.context.invocation.impl.DefaultExecutionContext
cannot be applied to (org.apache.airavata.registry.api.impl.AiravataJCRRegistry)
mojoFailed org.apache.maven.plugins:maven-compiler-plugin:2.3.2(default-testCompile)[INFO]
4 errors 
[INFO] -------------------------------------------------------------

projectFailed org.apache.airavata:test-suite:0.5-incubating-SNAPSHOT
sessionEnded
[INFO] ------------------------------------------------------------------------
[INFO] Reactor Summary:
[INFO] 
[INFO] Airavata .......................................... SUCCESS [22.037s]
[INFO] Airavata Commons .................................. SUCCESS [1.099s]
[INFO] Airavata Common Utilities ......................... SUCCESS [28.138s]
[INFO] Airavata Common Registry API ...................... SUCCESS [6.629s]
[INFO] Airavata Registry API ............................. SUCCESS [59.884s]
[INFO] Airavata Registry ................................. SUCCESS [1.172s]
[INFO] Airavata JPA Registry ............................. SUCCESS [6.048s]
[INFO] Airavata GFac Core ................................ SUCCESS [10.390s]
[INFO] Airavata GFac Axis2 Interface ..................... SUCCESS [5.157s]
[INFO] Airavata WS Messenger ............................. SUCCESS [1.250s]
[INFO] Airavata Messenger Commons ........................ SUCCESS [3.394s]
[INFO] Airavata Messenger Client ......................... SUCCESS [5.267s]
[INFO] Airavata Message Box .............................. SUCCESS [12.814s]
[INFO] Airavata Message Broker ........................... SUCCESS [38.767s]
[INFO] Airavata Workflow Model Parent .................... SUCCESS [1.020s]
[INFO] Airavata Workflow Model Core ...................... SUCCESS [7.306s]
[INFO] Airavata XBaya .................................... SUCCESS [1:46.350s]
[INFO] Airavata Provenance Registry ...................... SUCCESS [2.809s]
[INFO] Airavata Registry Service ......................... SUCCESS [3.815s]
[INFO] Airavata Client ................................... SUCCESS [13.091s]
[INFO] Simple Math Service ............................... SUCCESS [3.086s]
[INFO] Complex Math Service .............................. SUCCESS [2.691s]
[INFO] Levenshtein Distance Service ...................... SUCCESS [2.384s]
[INFO] distribution ...................................... SUCCESS [36.062s]
[INFO] Airavata Test Suite ............................... FAILURE [2.792s]
[INFO] ------------------------------------------------------------------------
[INFO] BUILD FAILURE
[INFO] ------------------------------------------------------------------------
[INFO] Total time: 6:31.018s
[INFO] Finished at: Thu Sep 13 15:14:06 UTC 2012
[INFO] Final Memory: 73M/446M
[INFO] ------------------------------------------------------------------------
Projects to build: [MavenProject: org.apache.airavata:airavata:0.5-incubating-SNAPSHOT @ <https://builds.apache.org/job/Apache%20Airavata/ws/pom.xml,>
MavenProject: org.apache.airavata:commons:0.5-incubating-SNAPSHOT @ <https://builds.apache.org/job/Apache%20Airavata/ws/modules/commons/pom.xml,>
MavenProject: org.apache.airavata:airavata-common-utils:0.5-incubating-SNAPSHOT @ <https://builds.apache.org/job/Apache%20Airavata/ws/modules/commons/utils/pom.xml,>
MavenProject: org.apache.airavata:airavata-common-registry-api:0.5-incubating-SNAPSHOT @ <https://builds.apache.org/job/Apache%20Airavata/ws/modules/commons/common-registry-api/pom.xml,>
MavenProject: org.apache.airavata:airavata-registry-api:0.5-incubating-SNAPSHOT @ <https://builds.apache.org/job/Apache%20Airavata/ws/modules/commons/registry-api/pom.xml,>
MavenProject: org.apache.airavata:registry:0.5-incubating-SNAPSHOT @ <https://builds.apache.org/job/Apache%20Airavata/ws/modules/registry/pom.xml,>
MavenProject: org.apache.airavata:airavata-jpa-registry:0.5-incubating-SNAPSHOT @ <https://builds.apache.org/job/Apache%20Airavata/ws/modules/registry/airavata-jpa-registry/pom.xml,>
MavenProject: org.apache.airavata:airavata-gfac-core:0.5-incubating-SNAPSHOT @ <https://builds.apache.org/job/Apache%20Airavata/ws/modules/gfac-core/pom.xml,>
MavenProject: org.apache.airavata:airavata-gfac-axis2-interface:0.5-incubating-SNAPSHOT @
<https://builds.apache.org/job/Apache%20Airavata/ws/modules/gfac-axis2/pom.xml,> MavenProject:
org.apache.airavata:airavata-ws-messenger:0.5-incubating-SNAPSHOT @ <https://builds.apache.org/job/Apache%20Airavata/ws/modules/ws-messenger/pom.xml,>
MavenProject: org.apache.airavata:airavata-messenger-commons:0.5-incubating-SNAPSHOT @ <https://builds.apache.org/job/Apache%20Airavata/ws/modules/ws-messenger/commons/pom.xml,>
MavenProject: org.apache.airavata:airavata-messenger-client:0.5-incubating-SNAPSHOT @ <https://builds.apache.org/job/Apache%20Airavata/ws/modules/ws-messenger/client/pom.xml,>
MavenProject: org.apache.airavata:airavata-message-box:0.5-incubating-SNAPSHOT @ <https://builds.apache.org/job/Apache%20Airavata/ws/modules/ws-messenger/messagebox/pom.xml,>
MavenProject: org.apache.airavata:airavata-message-broker:0.5-incubating-SNAPSHOT @ <https://builds.apache.org/job/Apache%20Airavata/ws/modules/ws-messenger/messagebroker/pom.xml,>
MavenProject: org.apache.airavata:airavata-workflow-model-parent:0.5-incubating-SNAPSHOT @
<https://builds.apache.org/job/Apache%20Airavata/ws/modules/workflow-model/pom.xml,>
MavenProject: org.apache.airavata:airavata-workflow-model-core:0.5-incubating-SNAPSHOT @ <https://builds.apache.org/job/Apache%20Airavata/ws/modules/workflow-model/workflow-model-core/pom.xml,>
MavenProject: org.apache.airavata:airavata-xbaya-gui:0.5-incubating-SNAPSHOT @ <https://builds.apache.org/job/Apache%20Airavata/ws/modules/xbaya-gui/pom.xml,>
MavenProject: org.apache.airavata:airavata-provenance-registry:0.5-incubating-SNAPSHOT @ <https://builds.apache.org/job/Apache%20Airavata/ws/modules/commons/provenance-registry/pom.xml,>
MavenProject: org.apache.airavata:airavata-registry-service:0.5-incubating-SNAPSHOT @ <https://builds.apache.org/job/Apache%20Airavata/ws/modules/registry/airavata-registry-service/pom.xml,>
MavenProject: org.apache.airavata:airavata-client-api:0.5-incubating-SNAPSHOT @ <https://builds.apache.org/job/Apache%20Airavata/ws/modules/airavata-client/pom.xml,>
MavenProject: org.apache.airavata:airavata-simple-math-service:0.5-incubating-SNAPSHOT @ <https://builds.apache.org/job/Apache%20Airavata/ws/samples/simple-math-service/pom.xml,>
MavenProject: org.apache.airavata:airavata-complex-math-service:0.5-incubating-SNAPSHOT @
<https://builds.apache.org/job/Apache%20Airavata/ws/samples/complex-math-service/pom.xml,>
MavenProject: org.apache.airavata:airavata-levenshtein-distance-service:0.5-incubating-SNAPSHOT
@ <https://builds.apache.org/job/Apache%20Airavata/ws/samples/levenshtein-distance-service/pom.xml,>
MavenProject: org.apache.airavata:distribution:0.5-incubating-SNAPSHOT @ <https://builds.apache.org/job/Apache%20Airavata/ws/modules/distribution/pom.xml,>
MavenProject: org.apache.airavata:test-suite:0.5-incubating-SNAPSHOT @ <https://builds.apache.org/job/Apache%20Airavata/ws/modules/test-suite/pom.xml]>
[JENKINS] Archiving <https://builds.apache.org/job/Apache%20Airavata/ws/samples/complex-math-service/pom.xml>
to /home/hudson/hudson/jobs/Apache Airavata/modules/org.apache.airavata$airavata-complex-math-service/builds/2012-09-13_15-07-14/archive/org.apache.airavata/airavata-complex-math-service/0.5-incubating-SNAPSHOT/airavata-complex-math-service-0.5-incubating-SNAPSHOT.pom
[JENKINS] Archiving <https://builds.apache.org/job/Apache%20Airavata/ws/samples/complex-math-service/target/airavata-complex-math-service-0.5-incubating-SNAPSHOT.aar>
to /home/hudson/hudson/jobs/Apache Airavata/modules/org.apache.airavata$airavata-complex-math-service/builds/2012-09-13_15-07-14/archive/org.apache.airavata/airavata-complex-math-service/0.5-incubating-SNAPSHOT/airavata-complex-math-service-0.5-incubating-SNAPSHOT.jar
[JENKINS] Archiving <https://builds.apache.org/job/Apache%20Airavata/ws/samples/simple-math-service/pom.xml>
to /home/hudson/hudson/jobs/Apache Airavata/modules/org.apache.airavata$airavata-simple-math-service/builds/2012-09-13_15-07-14/archive/org.apache.airavata/airavata-simple-math-service/0.5-incubating-SNAPSHOT/airavata-simple-math-service-0.5-incubating-SNAPSHOT.pom
[JENKINS] Archiving <https://builds.apache.org/job/Apache%20Airavata/ws/samples/simple-math-service/target/airavata-simple-math-service-0.5-incubating-SNAPSHOT.aar>
to /home/hudson/hudson/jobs/Apache Airavata/modules/org.apache.airavata$airavata-simple-math-service/builds/2012-09-13_15-07-14/archive/org.apache.airavata/airavata-simple-math-service/0.5-incubating-SNAPSHOT/airavata-simple-math-service-0.5-incubating-SNAPSHOT.jar
[JENKINS] Archiving <https://builds.apache.org/job/Apache%20Airavata/ws/modules/distribution/pom.xml>
to /home/hudson/hudson/jobs/Apache Airavata/modules/org.apache.airavata$distribution/builds/2012-09-13_15-07-14/archive/org.apache.airavata/distribution/0.5-incubating-SNAPSHOT/distribution-0.5-incubating-SNAPSHOT.pom
[JENKINS] Archiving <https://builds.apache.org/job/Apache%20Airavata/ws/modules/commons/registry-api/pom.xml>
to /home/hudson/hudson/jobs/Apache Airavata/modules/org.apache.airavata$airavata-registry-api/builds/2012-09-13_15-07-13/archive/org.apache.airavata/airavata-registry-api/0.5-incubating-SNAPSHOT/airavata-registry-api-0.5-incubating-SNAPSHOT.pom
[JENKINS] Archiving <https://builds.apache.org/job/Apache%20Airavata/ws/modules/commons/registry-api/target/airavata-registry-api-0.5-incubating-SNAPSHOT.jar>
to /home/hudson/hudson/jobs/Apache Airavata/modules/org.apache.airavata$airavata-registry-api/builds/2012-09-13_15-07-13/archive/org.apache.airavata/airavata-registry-api/0.5-incubating-SNAPSHOT/airavata-registry-api-0.5-incubating-SNAPSHOT.jar
[JENKINS] Archiving <https://builds.apache.org/job/Apache%20Airavata/ws/modules/xbaya-gui/pom.xml>
to /home/hudson/hudson/jobs/Apache Airavata/modules/org.apache.airavata$airavata-xbaya-gui/builds/2012-09-13_15-07-13/archive/org.apache.airavata/airavata-xbaya-gui/0.5-incubating-SNAPSHOT/airavata-xbaya-gui-0.5-incubating-SNAPSHOT.pom
[JENKINS] Archiving <https://builds.apache.org/job/Apache%20Airavata/ws/modules/xbaya-gui/target/airavata-xbaya-gui-0.5-incubating-SNAPSHOT.jar>
to /home/hudson/hudson/jobs/Apache Airavata/modules/org.apache.airavata$airavata-xbaya-gui/builds/2012-09-13_15-07-13/archive/org.apache.airavata/airavata-xbaya-gui/0.5-incubating-SNAPSHOT/airavata-xbaya-gui-0.5-incubating-SNAPSHOT.jar
[JENKINS] Archiving <https://builds.apache.org/job/Apache%20Airavata/ws/modules/ws-messenger/messagebox/pom.xml>
to /home/hudson/hudson/jobs/Apache Airavata/modules/org.apache.airavata$airavata-message-box/builds/2012-09-13_15-07-13/archive/org.apache.airavata/airavata-message-box/0.5-incubating-SNAPSHOT/airavata-message-box-0.5-incubating-SNAPSHOT.pom
[JENKINS] Archiving <https://builds.apache.org/job/Apache%20Airavata/ws/modules/ws-messenger/messagebox/target/airavata-message-box-0.5-incubating-SNAPSHOT.jar>
to /home/hudson/hudson/jobs/Apache Airavata/modules/org.apache.airavata$airavata-message-box/builds/2012-09-13_15-07-13/archive/org.apache.airavata/airavata-message-box/0.5-incubating-SNAPSHOT/airavata-message-box-0.5-incubating-SNAPSHOT.jar
[JENKINS] Archiving <https://builds.apache.org/job/Apache%20Airavata/ws/modules/gfac-core/pom.xml>
to /home/hudson/hudson/jobs/Apache Airavata/modules/org.apache.airavata$airavata-gfac-core/builds/2012-09-13_15-07-12/archive/org.apache.airavata/airavata-gfac-core/0.5-incubating-SNAPSHOT/airavata-gfac-core-0.5-incubating-SNAPSHOT.pom
[JENKINS] Archiving <https://builds.apache.org/job/Apache%20Airavata/ws/modules/gfac-core/target/airavata-gfac-core-0.5-incubating-SNAPSHOT.jar>
to /home/hudson/hudson/jobs/Apache Airavata/modules/org.apache.airavata$airavata-gfac-core/builds/2012-09-13_15-07-12/archive/org.apache.airavata/airavata-gfac-core/0.5-incubating-SNAPSHOT/airavata-gfac-core-0.5-incubating-SNAPSHOT.jar
[JENKINS] Archiving <https://builds.apache.org/job/Apache%20Airavata/ws/modules/gfac-axis2/pom.xml>
to /home/hudson/hudson/jobs/Apache Airavata/modules/org.apache.airavata$airavata-gfac-axis2-interface/builds/2012-09-13_15-07-12/archive/org.apache.airavata/airavata-gfac-axis2-interface/0.5-incubating-SNAPSHOT/airavata-gfac-axis2-interface-0.5-incubating-SNAPSHOT.pom
[JENKINS] Archiving <https://builds.apache.org/job/Apache%20Airavata/ws/modules/gfac-axis2/target/airavata-gfac-axis2-interface-0.5-incubating-SNAPSHOT.jar>
to /home/hudson/hudson/jobs/Apache Airavata/modules/org.apache.airavata$airavata-gfac-axis2-interface/builds/2012-09-13_15-07-12/archive/org.apache.airavata/airavata-gfac-axis2-interface/0.5-incubating-SNAPSHOT/airavata-gfac-axis2-interface-0.5-incubating-SNAPSHOT.jar
[JENKINS] Archiving <https://builds.apache.org/job/Apache%20Airavata/ws/modules/commons/pom.xml>
to /home/hudson/hudson/jobs/Apache Airavata/modules/org.apache.airavata$commons/builds/2012-09-13_15-07-13/archive/org.apache.airavata/commons/0.5-incubating-SNAPSHOT/commons-0.5-incubating-SNAPSHOT.pom
[JENKINS] Archiving <https://builds.apache.org/job/Apache%20Airavata/ws/modules/registry/pom.xml>
to /home/hudson/hudson/jobs/Apache Airavata/modules/org.apache.airavata$registry/builds/2012-09-13_15-07-13/archive/org.apache.airavata/registry/0.5-incubating-SNAPSHOT/registry-0.5-incubating-SNAPSHOT.pom
[JENKINS] Archiving <https://builds.apache.org/job/Apache%20Airavata/ws/modules/ws-messenger/pom.xml>
to /home/hudson/hudson/jobs/Apache Airavata/modules/org.apache.airavata$airavata-ws-messenger/builds/2012-09-13_15-07-13/archive/org.apache.airavata/airavata-ws-messenger/0.5-incubating-SNAPSHOT/airavata-ws-messenger-0.5-incubating-SNAPSHOT.pom
[JENKINS] Archiving <https://builds.apache.org/job/Apache%20Airavata/ws/samples/levenshtein-distance-service/pom.xml>
to /home/hudson/hudson/jobs/Apache Airavata/modules/org.apache.airavata$airavata-levenshtein-distance-service/builds/2012-09-13_15-07-14/archive/org.apache.airavata/airavata-levenshtein-distance-service/0.5-incubating-SNAPSHOT/airavata-levenshtein-distance-service-0.5-incubating-SNAPSHOT.pom
[JENKINS] Archiving <https://builds.apache.org/job/Apache%20Airavata/ws/samples/levenshtein-distance-service/target/airavata-levenshtein-distance-service-0.5-incubating-SNAPSHOT.aar>
to /home/hudson/hudson/jobs/Apache Airavata/modules/org.apache.airavata$airavata-levenshtein-distance-service/builds/2012-09-13_15-07-14/archive/org.apache.airavata/airavata-levenshtein-distance-service/0.5-incubating-SNAPSHOT/airavata-levenshtein-distance-service-0.5-incubating-SNAPSHOT.jar
[JENKINS] Archiving <https://builds.apache.org/job/Apache%20Airavata/ws/modules/registry/airavata-jpa-registry/pom.xml>
to /home/hudson/hudson/jobs/Apache Airavata/modules/org.apache.airavata$airavata-jpa-registry/builds/2012-09-13_15-07-13/archive/org.apache.airavata/airavata-jpa-registry/0.5-incubating-SNAPSHOT/airavata-jpa-registry-0.5-incubating-SNAPSHOT.pom
[JENKINS] Archiving <https://builds.apache.org/job/Apache%20Airavata/ws/modules/registry/airavata-jpa-registry/target/airavata-jpa-registry-0.5-incubating-SNAPSHOT.jar>
to /home/hudson/hudson/jobs/Apache Airavata/modules/org.apache.airavata$airavata-jpa-registry/builds/2012-09-13_15-07-13/archive/org.apache.airavata/airavata-jpa-registry/0.5-incubating-SNAPSHOT/airavata-jpa-registry-0.5-incubating-SNAPSHOT.jar
[JENKINS] Archiving <https://builds.apache.org/job/Apache%20Airavata/ws/modules/commons/utils/pom.xml>
to /home/hudson/hudson/jobs/Apache Airavata/modules/org.apache.airavata$airavata-common-utils/builds/2012-09-13_15-07-13/archive/org.apache.airavata/airavata-common-utils/0.5-incubating-SNAPSHOT/airavata-common-utils-0.5-incubating-SNAPSHOT.pom
[JENKINS] Archiving <https://builds.apache.org/job/Apache%20Airavata/ws/modules/commons/utils/target/airavata-common-utils-0.5-incubating-SNAPSHOT.jar>
to /home/hudson/hudson/jobs/Apache Airavata/modules/org.apache.airavata$airavata-common-utils/builds/2012-09-13_15-07-13/archive/org.apache.airavata/airavata-common-utils/0.5-incubating-SNAPSHOT/airavata-common-utils-0.5-incubating-SNAPSHOT.jar
[JENKINS] Archiving <https://builds.apache.org/job/Apache%20Airavata/ws/modules/airavata-client/pom.xml>
to /home/hudson/hudson/jobs/Apache Airavata/modules/org.apache.airavata$airavata-client-api/builds/2012-09-13_15-07-13/archive/org.apache.airavata/airavata-client-api/0.5-incubating-SNAPSHOT/airavata-client-api-0.5-incubating-SNAPSHOT.pom
[JENKINS] Archiving <https://builds.apache.org/job/Apache%20Airavata/ws/modules/airavata-client/target/airavata-client-api-0.5-incubating-SNAPSHOT.jar>
to /home/hudson/hudson/jobs/Apache Airavata/modules/org.apache.airavata$airavata-client-api/builds/2012-09-13_15-07-13/archive/org.apache.airavata/airavata-client-api/0.5-incubating-SNAPSHOT/airavata-client-api-0.5-incubating-SNAPSHOT.jar
[JENKINS] Archiving <https://builds.apache.org/job/Apache%20Airavata/ws/modules/ws-messenger/messagebroker/pom.xml>
to /home/hudson/hudson/jobs/Apache Airavata/modules/org.apache.airavata$airavata-message-broker/builds/2012-09-13_15-07-13/archive/org.apache.airavata/airavata-message-broker/0.5-incubating-SNAPSHOT/airavata-message-broker-0.5-incubating-SNAPSHOT.pom
[JENKINS] Archiving <https://builds.apache.org/job/Apache%20Airavata/ws/modules/ws-messenger/messagebroker/target/airavata-message-broker-0.5-incubating-SNAPSHOT.jar>
to /home/hudson/hudson/jobs/Apache Airavata/modules/org.apache.airavata$airavata-message-broker/builds/2012-09-13_15-07-13/archive/org.apache.airavata/airavata-message-broker/0.5-incubating-SNAPSHOT/airavata-message-broker-0.5-incubating-SNAPSHOT.jar
[JENKINS] Archiving <https://builds.apache.org/job/Apache%20Airavata/ws/modules/workflow-model/pom.xml>
to /home/hudson/hudson/jobs/Apache Airavata/modules/org.apache.airavata$airavata-workflow-model-parent/builds/2012-09-13_15-07-13/archive/org.apache.airavata/airavata-workflow-model-parent/0.5-incubating-SNAPSHOT/airavata-workflow-model-parent-0.5-incubating-SNAPSHOT.pom
[JENKINS] Archiving <https://builds.apache.org/job/Apache%20Airavata/ws/modules/registry/airavata-registry-service/pom.xml>
to /home/hudson/hudson/jobs/Apache Airavata/modules/org.apache.airavata$airavata-registry-service/builds/2012-09-13_15-07-13/archive/org.apache.airavata/airavata-registry-service/0.5-incubating-SNAPSHOT/airavata-registry-service-0.5-incubating-SNAPSHOT.pom
[JENKINS] Archiving <https://builds.apache.org/job/Apache%20Airavata/ws/modules/registry/airavata-registry-service/target/airavata-registry-service-0.5-incubating-SNAPSHOT.jar>
to /home/hudson/hudson/jobs/Apache Airavata/modules/org.apache.airavata$airavata-registry-service/builds/2012-09-13_15-07-13/archive/org.apache.airavata/airavata-registry-service/0.5-incubating-SNAPSHOT/airavata-registry-service-0.5-incubating-SNAPSHOT.jar
[JENKINS] Archiving <https://builds.apache.org/job/Apache%20Airavata/ws/modules/commons/common-registry-api/pom.xml>
to /home/hudson/hudson/jobs/Apache Airavata/modules/org.apache.airavata$airavata-common-registry-api/builds/2012-09-13_15-07-13/archive/org.apache.airavata/airavata-common-registry-api/0.5-incubating-SNAPSHOT/airavata-common-registry-api-0.5-incubating-SNAPSHOT.pom
[JENKINS] Archiving <https://builds.apache.org/job/Apache%20Airavata/ws/modules/commons/common-registry-api/target/airavata-common-registry-api-0.5-incubating-SNAPSHOT.jar>
to /home/hudson/hudson/jobs/Apache Airavata/modules/org.apache.airavata$airavata-common-registry-api/builds/2012-09-13_15-07-13/archive/org.apache.airavata/airavata-common-registry-api/0.5-incubating-SNAPSHOT/airavata-common-registry-api-0.5-incubating-SNAPSHOT.jar
[JENKINS] Archiving <https://builds.apache.org/job/Apache%20Airavata/ws/modules/ws-messenger/client/pom.xml>
to /home/hudson/hudson/jobs/Apache Airavata/modules/org.apache.airavata$airavata-messenger-client/builds/2012-09-13_15-07-13/archive/org.apache.airavata/airavata-messenger-client/0.5-incubating-SNAPSHOT/airavata-messenger-client-0.5-incubating-SNAPSHOT.pom
[JENKINS] Archiving <https://builds.apache.org/job/Apache%20Airavata/ws/modules/ws-messenger/client/target/airavata-messenger-client-0.5-incubating-SNAPSHOT.jar>
to /home/hudson/hudson/jobs/Apache Airavata/modules/org.apache.airavata$airavata-messenger-client/builds/2012-09-13_15-07-13/archive/org.apache.airavata/airavata-messenger-client/0.5-incubating-SNAPSHOT/airavata-messenger-client-0.5-incubating-SNAPSHOT.jar
[JENKINS] Archiving <https://builds.apache.org/job/Apache%20Airavata/ws/modules/ws-messenger/commons/pom.xml>
to /home/hudson/hudson/jobs/Apache Airavata/modules/org.apache.airavata$airavata-messenger-commons/builds/2012-09-13_15-07-13/archive/org.apache.airavata/airavata-messenger-commons/0.5-incubating-SNAPSHOT/airavata-messenger-commons-0.5-incubating-SNAPSHOT.pom
[JENKINS] Archiving <https://builds.apache.org/job/Apache%20Airavata/ws/modules/ws-messenger/commons/target/airavata-messenger-commons-0.5-incubating-SNAPSHOT.jar>
to /home/hudson/hudson/jobs/Apache Airavata/modules/org.apache.airavata$airavata-messenger-commons/builds/2012-09-13_15-07-13/archive/org.apache.airavata/airavata-messenger-commons/0.5-incubating-SNAPSHOT/airavata-messenger-commons-0.5-incubating-SNAPSHOT.jar
[JENKINS] Archiving <https://builds.apache.org/job/Apache%20Airavata/ws/modules/workflow-model/workflow-model-core/pom.xml>
to /home/hudson/hudson/jobs/Apache Airavata/modules/org.apache.airavata$airavata-workflow-model-core/builds/2012-09-13_15-07-13/archive/org.apache.airavata/airavata-workflow-model-core/0.5-incubating-SNAPSHOT/airavata-workflow-model-core-0.5-incubating-SNAPSHOT.pom
[JENKINS] Archiving <https://builds.apache.org/job/Apache%20Airavata/ws/modules/workflow-model/workflow-model-core/target/airavata-workflow-model-core-0.5-incubating-SNAPSHOT.jar>
to /home/hudson/hudson/jobs/Apache Airavata/modules/org.apache.airavata$airavata-workflow-model-core/builds/2012-09-13_15-07-13/archive/org.apache.airavata/airavata-workflow-model-core/0.5-incubating-SNAPSHOT/airavata-workflow-model-core-0.5-incubating-SNAPSHOT.jar
[JENKINS] Archiving <https://builds.apache.org/job/Apache%20Airavata/ws/modules/test-suite/pom.xml>
to /home/hudson/hudson/jobs/Apache Airavata/modules/org.apache.airavata$test-suite/builds/2012-09-13_15-07-14/archive/org.apache.airavata/test-suite/0.5-incubating-SNAPSHOT/test-suite-0.5-incubating-SNAPSHOT.pom
[JENKINS] Archiving <https://builds.apache.org/job/Apache%20Airavata/ws/modules/commons/provenance-registry/pom.xml>
to /home/hudson/hudson/jobs/Apache Airavata/modules/org.apache.airavata$airavata-provenance-registry/builds/2012-09-13_15-07-13/archive/org.apache.airavata/airavata-provenance-registry/0.5-incubating-SNAPSHOT/airavata-provenance-registry-0.5-incubating-SNAPSHOT.pom
[JENKINS] Archiving <https://builds.apache.org/job/Apache%20Airavata/ws/modules/commons/provenance-registry/target/airavata-provenance-registry-0.5-incubating-SNAPSHOT.jar>
to /home/hudson/hudson/jobs/Apache Airavata/modules/org.apache.airavata$airavata-provenance-registry/builds/2012-09-13_15-07-13/archive/org.apache.airavata/airavata-provenance-registry/0.5-incubating-SNAPSHOT/airavata-provenance-registry-0.5-incubating-SNAPSHOT.jar
[JENKINS] Archiving <https://builds.apache.org/job/Apache%20Airavata/ws/pom.xml> to
/home/hudson/hudson/jobs/Apache Airavata/modules/org.apache.airavata$airavata/builds/2012-09-13_15-07-12/archive/org.apache.airavata/airavata/0.5-incubating-SNAPSHOT/airavata-0.5-incubating-SNAPSHOT.pom
Waiting for Jenkins to finish collecting data
mavenExecutionResult exceptions not empty
message : Failed to execute goal org.apache.maven.plugins:maven-compiler-plugin:2.3.2:testCompile
(default-testCompile) on project test-suite: Compilation failure
cause : Compilation failure
Stack trace : 
org.apache.maven.lifecycle.LifecycleExecutionException: Failed to execute goal org.apache.maven.plugins:maven-compiler-plugin:2.3.2:testCompile
(default-testCompile) on project test-suite: Compilation failure
	at org.apache.maven.lifecycle.internal.MojoExecutor.execute(MojoExecutor.java:213)
	at org.apache.maven.lifecycle.internal.MojoExecutor.execute(MojoExecutor.java:153)
	at org.apache.maven.lifecycle.internal.MojoExecutor.execute(MojoExecutor.java:145)
	at org.apache.maven.lifecycle.internal.LifecycleModuleBuilder.buildProject(LifecycleModuleBuilder.java:84)
	at org.apache.maven.lifecycle.internal.LifecycleModuleBuilder.buildProject(LifecycleModuleBuilder.java:59)
	at org.apache.maven.lifecycle.internal.LifecycleStarter.singleThreadedBuild(LifecycleStarter.java:183)
	at org.apache.maven.lifecycle.internal.LifecycleStarter.execute(LifecycleStarter.java:161)
	at org.apache.maven.DefaultMaven.doExecute(DefaultMaven.java:319)
	at org.apache.maven.DefaultMaven.execute(DefaultMaven.java:156)
	at org.jvnet.hudson.maven3.launcher.Maven3Launcher.main(Maven3Launcher.java:79)
	at sun.reflect.NativeMethodAccessorImpl.invoke0(Native Method)
	at sun.reflect.NativeMethodAccessorImpl.invoke(NativeMethodAccessorImpl.java:39)
	at sun.reflect.DelegatingMethodAccessorImpl.invoke(DelegatingMethodAccessorImpl.java:25)
	at java.lang.reflect.Method.invoke(Method.java:597)
	at org.codehaus.plexus.classworlds.launcher.Launcher.launchStandard(Launcher.java:329)
	at org.codehaus.plexus.classworlds.launcher.Launcher.launch(Launcher.java:239)
	at org.jvnet.hudson.maven3.agent.Maven3Main.launch(Maven3Main.java:158)
	at hudson.maven.Maven3Builder.call(Maven3Builder.java:98)
	at hudson.maven.Maven3Builder.call(Maven3Builder.java:64)
	at hudson.remoting.UserRequest.perform(UserRequest.java:118)
	at hudson.remoting.UserRequest.perform(UserRequest.java:48)
	at hudson.remoting.Request$2.run(Request.java:326)
	at hudson.remoting.InterceptingExecutorService$1.call(InterceptingExecutorService.java:72)
	at java.util.concurrent.FutureTask$Sync.innerRun(FutureTask.java:303)
	at java.util.concurrent.FutureTask.run(FutureTask.java:138)
	at java.util.concurrent.ThreadPoolExecutor$Worker.runTask(ThreadPoolExecutor.java:886)
	at java.util.concurrent.ThreadPoolExecutor$Worker.run(ThreadPoolExecutor.java:908)
	at java.lang.Thread.run(Thread.java:662)
Caused by: org.apache.maven.plugin.CompilationFailureException: Compilation failure
	at org.apache.maven.plugin.AbstractCompilerMojo.execute(AbstractCompilerMojo.java:656)
	at org.apache.maven.plugin.TestCompilerMojo.execute(TestCompilerMojo.java:161)
	at org.apache.maven.plugin.DefaultBuildPluginManager.executeMojo(DefaultBuildPluginManager.java:101)
	at org.apache.maven.lifecycle.internal.MojoExecutor.execute(MojoExecutor.java:209)
	... 27 more
Maven failed with error.
Sending e-mails to: airavata-dev@incubator.apache.org
Sending e-mails to: airavata-dev@incubator.apache.org
Sending e-mails to: airavata-dev@incubator.apache.org
channel stopped

Mime
View raw message