airavata-dev mailing list archives

Site index · List index
Message view « Date » · « Thread »
Top « Date » · « Thread »
From Apache Jenkins Server <jenk...@builds.apache.org>
Subject Build failed in Jenkins: Apache Airavata #710
Date Thu, 13 Sep 2012 20:30:34 GMT
See <https://builds.apache.org/job/Apache%20Airavata/710/changes>

Changes:

[lahiru] updating existing resources to the database

[lahiru] applying AIRAVATA-562.13.patch for AIRAVATA-562

------------------------------------------
[...truncated 2293 lines...]
9462 [main] INFO org.apache.jackrabbit.core.RepositoryImpl - created system workspace: security
9488 [main] INFO org.apache.jackrabbit.core.RepositoryImpl - SecurityManager = class org.apache.jackrabbit.core.security.simple.SimpleSecurityManager
9489 [main] INFO org.apache.jackrabbit.core.RepositoryImpl - initializing workspace 'security'...
9489 [main] INFO org.apache.jackrabbit.core.fs.local.LocalFileSystem - LocalFileSystem initialized
at path target/jackrabbit1/workspaces/security
10269 [main] INFO org.apache.jackrabbit.core.query.lucene.SearchIndex - Index initialized:
target/jackrabbit1/workspaces/security/index Version: 3
10269 [main] INFO org.apache.jackrabbit.core.RepositoryImpl - workspace 'security' initialized
10283 [main] INFO org.apache.jackrabbit.core.security.simple.SimpleSecurityManager - init:
using Repository LoginModule configuration for Jackrabbit
10298 [main] INFO org.apache.jackrabbit.core.RepositoryImpl - Repository started (7739ms)
10298 [main] INFO org.apache.jackrabbit.core.TransientRepository - Transient repository initialized
10346 [main] INFO org.apache.jackrabbit.core.TransientRepository - Session opened
10715 [main] INFO org.apache.jackrabbit.core.TransientRepository - Session closed
10715 [main] INFO org.apache.jackrabbit.core.RepositoryImpl - Shutting down repository...
10783 [main] INFO org.apache.jackrabbit.core.query.lucene.SearchIndex - Index closed: target/jackrabbit1/repository/index
10784 [main] INFO org.apache.jackrabbit.core.RepositoryImpl - shutting down workspace 'default'...
10784 [main] INFO org.apache.jackrabbit.core.observation.ObservationDispatcher - Notification
of EventListeners stopped.
10792 [main] INFO org.apache.jackrabbit.core.query.lucene.SearchIndex - Index closed: target/jackrabbit1/workspaces/default/index
11222 [main] INFO org.apache.jackrabbit.core.util.db.DerbyConnectionHelper - Database 'target/jackrabbit1/workspaces/default/db'
shutdown.
11224 [main] INFO org.apache.jackrabbit.core.RepositoryImpl - workspace 'default' has been
shutdown
11224 [main] INFO org.apache.jackrabbit.core.RepositoryImpl - shutting down workspace 'security'...
11224 [main] INFO org.apache.jackrabbit.core.observation.ObservationDispatcher - Notification
of EventListeners stopped.
11231 [main] INFO org.apache.jackrabbit.core.query.lucene.SearchIndex - Index closed: target/jackrabbit1/workspaces/security/index
11264 [main] INFO org.apache.jackrabbit.core.util.db.DerbyConnectionHelper - Database 'target/jackrabbit1/workspaces/security/db'
shutdown.
11264 [main] INFO org.apache.jackrabbit.core.RepositoryImpl - workspace 'security' has been
shutdown
11530 [main] INFO org.apache.jackrabbit.core.util.db.DerbyConnectionHelper - Database 'target/jackrabbit1/version/db'
shutdown.
11532 [main] INFO org.apache.jackrabbit.core.RepositoryImpl - Repository has been shutdown
11532 [main] INFO org.apache.jackrabbit.core.TransientRepository - Transient repository shut
down
<https://builds.apache.org/job/Apache%20Airavata/ws/modules/commons/registry-api/target/test-classes/./target/jackrabbit1>
12052 [main] INFO org.apache.jackrabbit.core.config.RepositoryConfig - Creating repository
directory target/jackrabbit2
12052 [main] INFO org.apache.jackrabbit.core.config.RepositoryConfig - Copying configuration
from jar:file:/export/home/hudson/hudson-slave/maven-repositories/0/org/apache/jackrabbit/jackrabbit-core/2.2.7/jackrabbit-core-2.2.7.jar!/org/apache/jackrabbit/core/repository.xml
to target/jackrabbit2/repository.xml
12061 [main] INFO org.apache.jackrabbit.core.RepositoryImpl - Starting repository...
12061 [main] INFO org.apache.jackrabbit.core.fs.local.LocalFileSystem - LocalFileSystem initialized
at path target/jackrabbit2/repository
12086 [main] INFO org.apache.jackrabbit.core.nodetype.NodeTypeRegistry - no custom node type
definitions found
12087 [main] INFO org.apache.jackrabbit.core.fs.local.LocalFileSystem - LocalFileSystem initialized
at path target/jackrabbit2/version
12943 [main] INFO org.apache.jackrabbit.core.RepositoryImpl - initializing workspace 'default'...
12944 [main] INFO org.apache.jackrabbit.core.fs.local.LocalFileSystem - LocalFileSystem initialized
at path target/jackrabbit2/workspaces/default
14090 [main] INFO org.apache.jackrabbit.core.query.lucene.MultiIndex - indexing... /jcr:system/jcr:nodeTypes/rep:Activities/jcr:childNodeDefinition
(100)
14180 [main] INFO org.apache.jackrabbit.core.query.lucene.SearchIndex - Index initialized:
target/jackrabbit2/repository/index Version: 3
14228 [main] INFO org.apache.jackrabbit.core.query.lucene.SearchIndex - Index initialized:
target/jackrabbit2/workspaces/default/index Version: 3
14228 [main] INFO org.apache.jackrabbit.core.RepositoryImpl - workspace 'default' initialized
14257 [main] INFO org.apache.jackrabbit.core.RepositoryImpl - created system workspace: security
14257 [main] INFO org.apache.jackrabbit.core.RepositoryImpl - SecurityManager = class org.apache.jackrabbit.core.security.simple.SimpleSecurityManager
14258 [main] INFO org.apache.jackrabbit.core.RepositoryImpl - initializing workspace 'security'...
14258 [main] INFO org.apache.jackrabbit.core.fs.local.LocalFileSystem - LocalFileSystem initialized
at path target/jackrabbit2/workspaces/security
14735 [main] INFO org.apache.jackrabbit.core.query.lucene.SearchIndex - Index initialized:
target/jackrabbit2/workspaces/security/index Version: 3
14735 [main] INFO org.apache.jackrabbit.core.RepositoryImpl - workspace 'security' initialized
14735 [main] INFO org.apache.jackrabbit.core.security.simple.SimpleSecurityManager - init:
using Repository LoginModule configuration for Jackrabbit
14736 [main] INFO org.apache.jackrabbit.core.RepositoryImpl - Repository started (2675ms)
14736 [main] INFO org.apache.jackrabbit.core.TransientRepository - Transient repository initialized
14737 [main] INFO org.apache.jackrabbit.core.TransientRepository - Session opened
14774 [main] INFO org.apache.jackrabbit.core.TransientRepository - Session closed
14775 [main] INFO org.apache.jackrabbit.core.RepositoryImpl - Shutting down repository...
14793 [main] INFO org.apache.jackrabbit.core.query.lucene.SearchIndex - Index closed: target/jackrabbit2/repository/index
14793 [main] INFO org.apache.jackrabbit.core.RepositoryImpl - shutting down workspace 'default'...
14793 [main] INFO org.apache.jackrabbit.core.observation.ObservationDispatcher - Notification
of EventListeners stopped.
14803 [main] INFO org.apache.jackrabbit.core.query.lucene.SearchIndex - Index closed: target/jackrabbit2/workspaces/default/index
15098 [main] INFO org.apache.jackrabbit.core.util.db.DerbyConnectionHelper - Database 'target/jackrabbit2/workspaces/default/db'
shutdown.
15098 [main] INFO org.apache.jackrabbit.core.RepositoryImpl - workspace 'default' has been
shutdown
15098 [main] INFO org.apache.jackrabbit.core.RepositoryImpl - shutting down workspace 'security'...
15099 [main] INFO org.apache.jackrabbit.core.observation.ObservationDispatcher - Notification
of EventListeners stopped.
15105 [main] INFO org.apache.jackrabbit.core.query.lucene.SearchIndex - Index closed: target/jackrabbit2/workspaces/security/index
15150 [main] INFO org.apache.jackrabbit.core.util.db.DerbyConnectionHelper - Database 'target/jackrabbit2/workspaces/security/db'
shutdown.
15150 [main] INFO org.apache.jackrabbit.core.RepositoryImpl - workspace 'security' has been
shutdown
15256 [main] INFO org.apache.jackrabbit.core.util.db.DerbyConnectionHelper - Database 'target/jackrabbit2/version/db'
shutdown.
15258 [main] INFO org.apache.jackrabbit.core.RepositoryImpl - Repository has been shutdown
15258 [main] INFO org.apache.jackrabbit.core.TransientRepository - Transient repository shut
down
Tests run: 2, Failures: 0, Errors: 0, Skipped: 0, Time elapsed: 15.766 sec
Running org.apache.airavata.registry.api.impl.JCRRegistryTest
15496 [main] INFO org.apache.jackrabbit.core.config.RepositoryConfig - Creating repository
directory target/jackrabbit4
15497 [main] INFO org.apache.jackrabbit.core.config.RepositoryConfig - Copying configuration
from jar:file:/export/home/hudson/hudson-slave/maven-repositories/0/org/apache/jackrabbit/jackrabbit-core/2.2.7/jackrabbit-core-2.2.7.jar!/org/apache/jackrabbit/core/repository.xml
to target/jackrabbit4/repository.xml
15505 [main] INFO org.apache.jackrabbit.core.RepositoryImpl - Starting repository...
15505 [main] INFO org.apache.jackrabbit.core.fs.local.LocalFileSystem - LocalFileSystem initialized
at path target/jackrabbit4/repository
15594 [main] INFO org.apache.jackrabbit.core.nodetype.NodeTypeRegistry - no custom node type
definitions found
15595 [main] INFO org.apache.jackrabbit.core.fs.local.LocalFileSystem - LocalFileSystem initialized
at path target/jackrabbit4/version
16033 [main] INFO org.apache.jackrabbit.core.RepositoryImpl - initializing workspace 'default'...
16034 [main] INFO org.apache.jackrabbit.core.fs.local.LocalFileSystem - LocalFileSystem initialized
at path target/jackrabbit4/workspaces/default
17713 [main] INFO org.apache.jackrabbit.core.query.lucene.MultiIndex - indexing... /jcr:system/jcr:nodeTypes/rep:Activities/jcr:childNodeDefinition
(100)
17799 [main] INFO org.apache.jackrabbit.core.query.lucene.SearchIndex - Index initialized:
target/jackrabbit4/repository/index Version: 3
20207 [main] INFO org.apache.jackrabbit.core.query.lucene.SearchIndex - Index initialized:
target/jackrabbit4/workspaces/default/index Version: 3
20209 [main] INFO org.apache.jackrabbit.core.RepositoryImpl - workspace 'default' initialized
20270 [main] INFO org.apache.jackrabbit.core.RepositoryImpl - created system workspace: security
20270 [main] INFO org.apache.jackrabbit.core.RepositoryImpl - SecurityManager = class org.apache.jackrabbit.core.security.simple.SimpleSecurityManager
20270 [main] INFO org.apache.jackrabbit.core.RepositoryImpl - initializing workspace 'security'...
20270 [main] INFO org.apache.jackrabbit.core.fs.local.LocalFileSystem - LocalFileSystem initialized
at path target/jackrabbit4/workspaces/security
20940 [main] INFO org.apache.jackrabbit.core.query.lucene.SearchIndex - Index initialized:
target/jackrabbit4/workspaces/security/index Version: 3
20940 [main] INFO org.apache.jackrabbit.core.RepositoryImpl - workspace 'security' initialized
20940 [main] INFO org.apache.jackrabbit.core.security.simple.SimpleSecurityManager - init:
using Repository LoginModule configuration for Jackrabbit
20941 [main] INFO org.apache.jackrabbit.core.RepositoryImpl - Repository started (5436ms)
20941 [main] INFO org.apache.jackrabbit.core.TransientRepository - Transient repository initialized
20942 [main] INFO org.apache.jackrabbit.core.TransientRepository - Session opened
<https://builds.apache.org/job/Apache%20Airavata/ws/modules/commons/registry-api/target/test-classes/./target/jackrabbit4>
21858 [main] INFO org.apache.jackrabbit.core.TransientRepository - Session opened
21882 [main] INFO org.apache.jackrabbit.core.config.RepositoryConfig - Creating repository
directory target/jackrabbit5
21882 [main] INFO org.apache.jackrabbit.core.config.RepositoryConfig - Copying configuration
from jar:file:/export/home/hudson/hudson-slave/maven-repositories/0/org/apache/jackrabbit/jackrabbit-core/2.2.7/jackrabbit-core-2.2.7.jar!/org/apache/jackrabbit/core/repository.xml
to target/jackrabbit5/repository.xml
21925 [main] INFO org.apache.jackrabbit.core.RepositoryImpl - Starting repository...
21925 [main] INFO org.apache.jackrabbit.core.fs.local.LocalFileSystem - LocalFileSystem initialized
at path target/jackrabbit5/repository
21949 [main] INFO org.apache.jackrabbit.core.nodetype.NodeTypeRegistry - no custom node type
definitions found
21950 [main] INFO org.apache.jackrabbit.core.fs.local.LocalFileSystem - LocalFileSystem initialized
at path target/jackrabbit5/version
22302 [main] INFO org.apache.jackrabbit.core.RepositoryImpl - initializing workspace 'default'...
22302 [main] INFO org.apache.jackrabbit.core.fs.local.LocalFileSystem - LocalFileSystem initialized
at path target/jackrabbit5/workspaces/default
24601 [Timer-4] WARN org.apache.jackrabbit.core.query.lucene.IndexHistory - Unable to delete:
org.apache.jackrabbit.core.query.lucene.directory.FSDirectoryManager$FSDir@org.apache.lucene.store.FSDirectory@/zonestorage/hudson_solaris/home/hudson/hudson-slave/workspace/Apache
Airavata/modules/commons/registry-api/target/test-classes/target/jackrabbit4/workspaces/security/index/indexes_1
25618 [Timer-4] WARN org.apache.jackrabbit.core.query.lucene.IndexHistory - Unable to delete:
org.apache.jackrabbit.core.query.lucene.directory.FSDirectoryManager$FSDir@org.apache.lucene.store.FSDirectory@/zonestorage/hudson_solaris/home/hudson/hudson-slave/workspace/Apache
Airavata/modules/commons/registry-api/target/test-classes/target/jackrabbit4/workspaces/default/index/indexes_1
27442 [main] INFO org.apache.jackrabbit.core.query.lucene.MultiIndex - indexing... /jcr:system/jcr:nodeTypes/rep:Activities/jcr:childNodeDefinition
(100)
27561 [main] INFO org.apache.jackrabbit.core.query.lucene.SearchIndex - Index initialized:
target/jackrabbit5/repository/index Version: 3
27715 [main] INFO org.apache.jackrabbit.core.query.lucene.SearchIndex - Index initialized:
target/jackrabbit5/workspaces/default/index Version: 3
27716 [main] INFO org.apache.jackrabbit.core.RepositoryImpl - workspace 'default' initialized
27832 [main] INFO org.apache.jackrabbit.core.RepositoryImpl - created system workspace: security
27832 [main] INFO org.apache.jackrabbit.core.RepositoryImpl - SecurityManager = class org.apache.jackrabbit.core.security.simple.SimpleSecurityManager
27832 [main] INFO org.apache.jackrabbit.core.RepositoryImpl - initializing workspace 'security'...
27834 [main] INFO org.apache.jackrabbit.core.fs.local.LocalFileSystem - LocalFileSystem initialized
at path target/jackrabbit5/workspaces/security
#
# A fatal error has been detected by the Java Runtime Environment:
#
#  SIGBUS (0xa) at pc=0xfb2091c2, pid=1529, tid=62
#
# JRE version: 6.0_22-b04
# Java VM: Java HotSpot(TM) Server VM (17.1-b03 mixed mode solaris-x86 )
# Problematic frame:
# j  java.io.FileNotFoundException.<init>(Ljava/lang/String;Ljava/lang/String;)V+0
#
# An error report file with more information is saved as:
# /zonestorage/hudson_solaris/home/hudson/hudson-slave/workspace/Apache Airavata/modules/commons/registry-api/target/test-classes/hs_err_pid1529.log
#
# If you would like to submit a bug report, please visit:
#   http://java.sun.com/webapps/bugreport/crash.jsp
#
Abort - core dumped

Results :

Tests run: 2, Failures: 0, Errors: 0, Skipped: 0

mojoFailed org.apache.maven.plugins:maven-surefire-plugin:2.12(default-test)
[JENKINS] Recording test results
projectFailed org.apache.airavata:airavata-registry-api:0.5-incubating-SNAPSHOT
sessionEnded
[INFO] ------------------------------------------------------------------------
[INFO] Reactor Summary:
[INFO] 
[INFO] Airavata .......................................... SUCCESS [1:54.403s]
[INFO] Airavata Commons .................................. SUCCESS [14.426s]
[INFO] Airavata Common Utilities ......................... SUCCESS [2:25.280s]
[INFO] Airavata Common Registry API ...................... SUCCESS [38.671s]
[INFO] Airavata Registry API ............................. FAILURE [2:00.166s]
[INFO] Airavata Registry ................................. SKIPPED
[INFO] Airavata JPA Registry ............................. SKIPPED
[INFO] Airavata GFac Core ................................ SKIPPED
[INFO] Airavata GFac Axis2 Interface ..................... SKIPPED
[INFO] Airavata WS Messenger ............................. SKIPPED
[INFO] Airavata Messenger Commons ........................ SKIPPED
[INFO] Airavata Messenger Client ......................... SKIPPED
[INFO] Airavata Message Box .............................. SKIPPED
[INFO] Airavata Message Broker ........................... SKIPPED
[INFO] Airavata Workflow Model Parent .................... SKIPPED
[INFO] Airavata Workflow Model Core ...................... SKIPPED
[INFO] Airavata XBaya .................................... SKIPPED
[INFO] Airavata Provenance Registry ...................... SKIPPED
[INFO] Airavata Registry Service ......................... SKIPPED
[INFO] Airavata Client ................................... SKIPPED
[INFO] Simple Math Service ............................... SKIPPED
[INFO] Complex Math Service .............................. SKIPPED
[INFO] Levenshtein Distance Service ...................... SKIPPED
[INFO] distribution ...................................... SKIPPED
[INFO] Airavata Test Suite ............................... SKIPPED
[INFO] ------------------------------------------------------------------------
[INFO] BUILD FAILURE
[INFO] ------------------------------------------------------------------------
[INFO] Total time: 7:41.047s
[INFO] Finished at: Thu Sep 13 20:29:26 GMT+00:00 2012
[INFO] Final Memory: 42M/139M
[INFO] ------------------------------------------------------------------------
Projects to build: [MavenProject: org.apache.airavata:airavata:0.5-incubating-SNAPSHOT @ <https://builds.apache.org/job/Apache%20Airavata/ws/pom.xml,>
MavenProject: org.apache.airavata:commons:0.5-incubating-SNAPSHOT @ <https://builds.apache.org/job/Apache%20Airavata/ws/modules/commons/pom.xml,>
MavenProject: org.apache.airavata:airavata-common-utils:0.5-incubating-SNAPSHOT @ <https://builds.apache.org/job/Apache%20Airavata/ws/modules/commons/utils/pom.xml,>
MavenProject: org.apache.airavata:airavata-common-registry-api:0.5-incubating-SNAPSHOT @ <https://builds.apache.org/job/Apache%20Airavata/ws/modules/commons/common-registry-api/pom.xml,>
MavenProject: org.apache.airavata:airavata-registry-api:0.5-incubating-SNAPSHOT @ <https://builds.apache.org/job/Apache%20Airavata/ws/modules/commons/registry-api/pom.xml,>
MavenProject: org.apache.airavata:registry:0.5-incubating-SNAPSHOT @ <https://builds.apache.org/job/Apache%20Airavata/ws/modules/registry/pom.xml,>
MavenProject: org.apache.airavata:airavata-jpa-registry:0.5-incubating-SNAPSHOT @ <https://builds.apache.org/job/Apache%20Airavata/ws/modules/registry/airavata-jpa-registry/pom.xml,>
MavenProject: org.apache.airavata:airavata-gfac-core:0.5-incubating-SNAPSHOT @ <https://builds.apache.org/job/Apache%20Airavata/ws/modules/gfac-core/pom.xml,>
MavenProject: org.apache.airavata:airavata-gfac-axis2-interface:0.5-incubating-SNAPSHOT @
<https://builds.apache.org/job/Apache%20Airavata/ws/modules/gfac-axis2/pom.xml,> MavenProject:
org.apache.airavata:airavata-ws-messenger:0.5-incubating-SNAPSHOT @ <https://builds.apache.org/job/Apache%20Airavata/ws/modules/ws-messenger/pom.xml,>
MavenProject: org.apache.airavata:airavata-messenger-commons:0.5-incubating-SNAPSHOT @ <https://builds.apache.org/job/Apache%20Airavata/ws/modules/ws-messenger/commons/pom.xml,>
MavenProject: org.apache.airavata:airavata-messenger-client:0.5-incubating-SNAPSHOT @ <https://builds.apache.org/job/Apache%20Airavata/ws/modules/ws-messenger/client/pom.xml,>
MavenProject: org.apache.airavata:airavata-message-box:0.5-incubating-SNAPSHOT @ <https://builds.apache.org/job/Apache%20Airavata/ws/modules/ws-messenger/messagebox/pom.xml,>
MavenProject: org.apache.airavata:airavata-message-broker:0.5-incubating-SNAPSHOT @ <https://builds.apache.org/job/Apache%20Airavata/ws/modules/ws-messenger/messagebroker/pom.xml,>
MavenProject: org.apache.airavata:airavata-workflow-model-parent:0.5-incubating-SNAPSHOT @
<https://builds.apache.org/job/Apache%20Airavata/ws/modules/workflow-model/pom.xml,>
MavenProject: org.apache.airavata:airavata-workflow-model-core:0.5-incubating-SNAPSHOT @ <https://builds.apache.org/job/Apache%20Airavata/ws/modules/workflow-model/workflow-model-core/pom.xml,>
MavenProject: org.apache.airavata:airavata-xbaya-gui:0.5-incubating-SNAPSHOT @ <https://builds.apache.org/job/Apache%20Airavata/ws/modules/xbaya-gui/pom.xml,>
MavenProject: org.apache.airavata:airavata-provenance-registry:0.5-incubating-SNAPSHOT @ <https://builds.apache.org/job/Apache%20Airavata/ws/modules/commons/provenance-registry/pom.xml,>
MavenProject: org.apache.airavata:airavata-registry-service:0.5-incubating-SNAPSHOT @ <https://builds.apache.org/job/Apache%20Airavata/ws/modules/registry/airavata-registry-service/pom.xml,>
MavenProject: org.apache.airavata:airavata-client-api:0.5-incubating-SNAPSHOT @ <https://builds.apache.org/job/Apache%20Airavata/ws/modules/airavata-client/pom.xml,>
MavenProject: org.apache.airavata:airavata-simple-math-service:0.5-incubating-SNAPSHOT @ <https://builds.apache.org/job/Apache%20Airavata/ws/samples/simple-math-service/pom.xml,>
MavenProject: org.apache.airavata:airavata-complex-math-service:0.5-incubating-SNAPSHOT @
<https://builds.apache.org/job/Apache%20Airavata/ws/samples/complex-math-service/pom.xml,>
MavenProject: org.apache.airavata:airavata-levenshtein-distance-service:0.5-incubating-SNAPSHOT
@ <https://builds.apache.org/job/Apache%20Airavata/ws/samples/levenshtein-distance-service/pom.xml,>
MavenProject: org.apache.airavata:distribution:0.5-incubating-SNAPSHOT @ <https://builds.apache.org/job/Apache%20Airavata/ws/modules/distribution/pom.xml,>
MavenProject: org.apache.airavata:test-suite:0.5-incubating-SNAPSHOT @ <https://builds.apache.org/job/Apache%20Airavata/ws/modules/test-suite/pom.xml]>
[JENKINS] Archiving <https://builds.apache.org/job/Apache%20Airavata/ws/samples/complex-math-service/pom.xml>
to /home/hudson/hudson/jobs/Apache Airavata/modules/org.apache.airavata$airavata-complex-math-service/builds/2012-09-13_20-19-42/archive/org.apache.airavata/airavata-complex-math-service/0.5-incubating-SNAPSHOT/airavata-complex-math-service-0.5-incubating-SNAPSHOT.pom
[JENKINS] Archiving <https://builds.apache.org/job/Apache%20Airavata/ws/samples/simple-math-service/pom.xml>
to /home/hudson/hudson/jobs/Apache Airavata/modules/org.apache.airavata$airavata-simple-math-service/builds/2012-09-13_20-19-42/archive/org.apache.airavata/airavata-simple-math-service/0.5-incubating-SNAPSHOT/airavata-simple-math-service-0.5-incubating-SNAPSHOT.pom
[JENKINS] Archiving <https://builds.apache.org/job/Apache%20Airavata/ws/modules/distribution/pom.xml>
to /home/hudson/hudson/jobs/Apache Airavata/modules/org.apache.airavata$distribution/builds/2012-09-13_20-19-43/archive/org.apache.airavata/distribution/0.5-incubating-SNAPSHOT/distribution-0.5-incubating-SNAPSHOT.pom
[JENKINS] Archiving <https://builds.apache.org/job/Apache%20Airavata/ws/modules/commons/registry-api/pom.xml>
to /home/hudson/hudson/jobs/Apache Airavata/modules/org.apache.airavata$airavata-registry-api/builds/2012-09-13_20-19-41/archive/org.apache.airavata/airavata-registry-api/0.5-incubating-SNAPSHOT/airavata-registry-api-0.5-incubating-SNAPSHOT.pom
[JENKINS] Archiving <https://builds.apache.org/job/Apache%20Airavata/ws/modules/xbaya-gui/pom.xml>
to /home/hudson/hudson/jobs/Apache Airavata/modules/org.apache.airavata$airavata-xbaya-gui/builds/2012-09-13_20-19-40/archive/org.apache.airavata/airavata-xbaya-gui/0.5-incubating-SNAPSHOT/airavata-xbaya-gui-0.5-incubating-SNAPSHOT.pom
[JENKINS] Archiving <https://builds.apache.org/job/Apache%20Airavata/ws/modules/ws-messenger/messagebox/pom.xml>
to /home/hudson/hudson/jobs/Apache Airavata/modules/org.apache.airavata$airavata-message-box/builds/2012-09-13_20-19-38/archive/org.apache.airavata/airavata-message-box/0.5-incubating-SNAPSHOT/airavata-message-box-0.5-incubating-SNAPSHOT.pom
[JENKINS] Archiving <https://builds.apache.org/job/Apache%20Airavata/ws/modules/gfac-core/pom.xml>
to /home/hudson/hudson/jobs/Apache Airavata/modules/org.apache.airavata$airavata-gfac-core/builds/2012-09-13_20-19-35/archive/org.apache.airavata/airavata-gfac-core/0.5-incubating-SNAPSHOT/airavata-gfac-core-0.5-incubating-SNAPSHOT.pom
[JENKINS] Archiving <https://builds.apache.org/job/Apache%20Airavata/ws/modules/gfac-axis2/pom.xml>
to /home/hudson/hudson/jobs/Apache Airavata/modules/org.apache.airavata$airavata-gfac-axis2-interface/builds/2012-09-13_20-19-36/archive/org.apache.airavata/airavata-gfac-axis2-interface/0.5-incubating-SNAPSHOT/airavata-gfac-axis2-interface-0.5-incubating-SNAPSHOT.pom
[JENKINS] Archiving <https://builds.apache.org/job/Apache%20Airavata/ws/modules/commons/pom.xml>
to /home/hudson/hudson/jobs/Apache Airavata/modules/org.apache.airavata$commons/builds/2012-09-13_20-19-40/archive/org.apache.airavata/commons/0.5-incubating-SNAPSHOT/commons-0.5-incubating-SNAPSHOT.pom
[JENKINS] Archiving <https://builds.apache.org/job/Apache%20Airavata/ws/modules/registry/pom.xml>
to /home/hudson/hudson/jobs/Apache Airavata/modules/org.apache.airavata$registry/builds/2012-09-13_20-19-41/archive/org.apache.airavata/registry/0.5-incubating-SNAPSHOT/registry-0.5-incubating-SNAPSHOT.pom
[JENKINS] Archiving <https://builds.apache.org/job/Apache%20Airavata/ws/modules/ws-messenger/pom.xml>
to /home/hudson/hudson/jobs/Apache Airavata/modules/org.apache.airavata$airavata-ws-messenger/builds/2012-09-13_20-19-36/archive/org.apache.airavata/airavata-ws-messenger/0.5-incubating-SNAPSHOT/airavata-ws-messenger-0.5-incubating-SNAPSHOT.pom
[JENKINS] Archiving <https://builds.apache.org/job/Apache%20Airavata/ws/samples/levenshtein-distance-service/pom.xml>
to /home/hudson/hudson/jobs/Apache Airavata/modules/org.apache.airavata$airavata-levenshtein-distance-service/builds/2012-09-13_20-19-43/archive/org.apache.airavata/airavata-levenshtein-distance-service/0.5-incubating-SNAPSHOT/airavata-levenshtein-distance-service-0.5-incubating-SNAPSHOT.pom
[JENKINS] Archiving <https://builds.apache.org/job/Apache%20Airavata/ws/modules/registry/airavata-jpa-registry/pom.xml>
to /home/hudson/hudson/jobs/Apache Airavata/modules/org.apache.airavata$airavata-jpa-registry/builds/2012-09-13_20-19-41/archive/org.apache.airavata/airavata-jpa-registry/0.5-incubating-SNAPSHOT/airavata-jpa-registry-0.5-incubating-SNAPSHOT.pom
[JENKINS] Archiving <https://builds.apache.org/job/Apache%20Airavata/ws/modules/commons/utils/pom.xml>
to /home/hudson/hudson/jobs/Apache Airavata/modules/org.apache.airavata$airavata-common-utils/builds/2012-09-13_20-19-40/archive/org.apache.airavata/airavata-common-utils/0.5-incubating-SNAPSHOT/airavata-common-utils-0.5-incubating-SNAPSHOT.pom
[JENKINS] Archiving <https://builds.apache.org/job/Apache%20Airavata/ws/modules/commons/utils/target/airavata-common-utils-0.5-incubating-SNAPSHOT.jar>
to /home/hudson/hudson/jobs/Apache Airavata/modules/org.apache.airavata$airavata-common-utils/builds/2012-09-13_20-19-40/archive/org.apache.airavata/airavata-common-utils/0.5-incubating-SNAPSHOT/airavata-common-utils-0.5-incubating-SNAPSHOT.jar
[JENKINS] Archiving <https://builds.apache.org/job/Apache%20Airavata/ws/modules/airavata-client/pom.xml>
to /home/hudson/hudson/jobs/Apache Airavata/modules/org.apache.airavata$airavata-client-api/builds/2012-09-13_20-19-42/archive/org.apache.airavata/airavata-client-api/0.5-incubating-SNAPSHOT/airavata-client-api-0.5-incubating-SNAPSHOT.pom
[JENKINS] Archiving <https://builds.apache.org/job/Apache%20Airavata/ws/modules/ws-messenger/messagebroker/pom.xml>
to /home/hudson/hudson/jobs/Apache Airavata/modules/org.apache.airavata$airavata-message-broker/builds/2012-09-13_20-19-38/archive/org.apache.airavata/airavata-message-broker/0.5-incubating-SNAPSHOT/airavata-message-broker-0.5-incubating-SNAPSHOT.pom
[JENKINS] Archiving <https://builds.apache.org/job/Apache%20Airavata/ws/modules/workflow-model/pom.xml>
to /home/hudson/hudson/jobs/Apache Airavata/modules/org.apache.airavata$airavata-workflow-model-parent/builds/2012-09-13_20-19-39/archive/org.apache.airavata/airavata-workflow-model-parent/0.5-incubating-SNAPSHOT/airavata-workflow-model-parent-0.5-incubating-SNAPSHOT.pom
[JENKINS] Archiving <https://builds.apache.org/job/Apache%20Airavata/ws/modules/registry/airavata-registry-service/pom.xml>
to /home/hudson/hudson/jobs/Apache Airavata/modules/org.apache.airavata$airavata-registry-service/builds/2012-09-13_20-19-42/archive/org.apache.airavata/airavata-registry-service/0.5-incubating-SNAPSHOT/airavata-registry-service-0.5-incubating-SNAPSHOT.pom
[JENKINS] Archiving <https://builds.apache.org/job/Apache%20Airavata/ws/modules/commons/common-registry-api/pom.xml>
to /home/hudson/hudson/jobs/Apache Airavata/modules/org.apache.airavata$airavata-common-registry-api/builds/2012-09-13_20-19-40/archive/org.apache.airavata/airavata-common-registry-api/0.5-incubating-SNAPSHOT/airavata-common-registry-api-0.5-incubating-SNAPSHOT.pom
[JENKINS] Archiving <https://builds.apache.org/job/Apache%20Airavata/ws/modules/commons/common-registry-api/target/airavata-common-registry-api-0.5-incubating-SNAPSHOT.jar>
to /home/hudson/hudson/jobs/Apache Airavata/modules/org.apache.airavata$airavata-common-registry-api/builds/2012-09-13_20-19-40/archive/org.apache.airavata/airavata-common-registry-api/0.5-incubating-SNAPSHOT/airavata-common-registry-api-0.5-incubating-SNAPSHOT.jar
[JENKINS] Archiving <https://builds.apache.org/job/Apache%20Airavata/ws/modules/ws-messenger/client/pom.xml>
to /home/hudson/hudson/jobs/Apache Airavata/modules/org.apache.airavata$airavata-messenger-client/builds/2012-09-13_20-19-38/archive/org.apache.airavata/airavata-messenger-client/0.5-incubating-SNAPSHOT/airavata-messenger-client-0.5-incubating-SNAPSHOT.pom
[JENKINS] Archiving <https://builds.apache.org/job/Apache%20Airavata/ws/modules/ws-messenger/commons/pom.xml>
to /home/hudson/hudson/jobs/Apache Airavata/modules/org.apache.airavata$airavata-messenger-commons/builds/2012-09-13_20-19-37/archive/org.apache.airavata/airavata-messenger-commons/0.5-incubating-SNAPSHOT/airavata-messenger-commons-0.5-incubating-SNAPSHOT.pom
[JENKINS] Archiving <https://builds.apache.org/job/Apache%20Airavata/ws/modules/workflow-model/workflow-model-core/pom.xml>
to /home/hudson/hudson/jobs/Apache Airavata/modules/org.apache.airavata$airavata-workflow-model-core/builds/2012-09-13_20-19-39/archive/org.apache.airavata/airavata-workflow-model-core/0.5-incubating-SNAPSHOT/airavata-workflow-model-core-0.5-incubating-SNAPSHOT.pom
[JENKINS] Archiving <https://builds.apache.org/job/Apache%20Airavata/ws/modules/test-suite/pom.xml>
to /home/hudson/hudson/jobs/Apache Airavata/modules/org.apache.airavata$test-suite/builds/2012-09-13_20-19-43/archive/org.apache.airavata/test-suite/0.5-incubating-SNAPSHOT/test-suite-0.5-incubating-SNAPSHOT.pom
[JENKINS] Archiving <https://builds.apache.org/job/Apache%20Airavata/ws/modules/commons/provenance-registry/pom.xml>
to /home/hudson/hudson/jobs/Apache Airavata/modules/org.apache.airavata$airavata-provenance-registry/builds/2012-09-13_20-19-41/archive/org.apache.airavata/airavata-provenance-registry/0.5-incubating-SNAPSHOT/airavata-provenance-registry-0.5-incubating-SNAPSHOT.pom
[JENKINS] Archiving <https://builds.apache.org/job/Apache%20Airavata/ws/pom.xml> to
/home/hudson/hudson/jobs/Apache Airavata/modules/org.apache.airavata$airavata/builds/2012-09-13_20-19-35/archive/org.apache.airavata/airavata/0.5-incubating-SNAPSHOT/airavata-0.5-incubating-SNAPSHOT.pom
Waiting for Jenkins to finish collecting data
mavenExecutionResult exceptions not empty
message : Failed to execute goal org.apache.maven.plugins:maven-surefire-plugin:2.12:test
(default-test) on project airavata-registry-api: Error occurred in starting fork, check output
in log
cause : Error occurred in starting fork, check output in log
Stack trace : 
org.apache.maven.lifecycle.LifecycleExecutionException: Failed to execute goal org.apache.maven.plugins:maven-surefire-plugin:2.12:test
(default-test) on project airavata-registry-api: Error occurred in starting fork, check output
in log
	at org.apache.maven.lifecycle.internal.MojoExecutor.execute(MojoExecutor.java:217)
	at org.apache.maven.lifecycle.internal.MojoExecutor.execute(MojoExecutor.java:153)
	at org.apache.maven.lifecycle.internal.MojoExecutor.execute(MojoExecutor.java:145)
	at org.apache.maven.lifecycle.internal.LifecycleModuleBuilder.buildProject(LifecycleModuleBuilder.java:84)
	at org.apache.maven.lifecycle.internal.LifecycleModuleBuilder.buildProject(LifecycleModuleBuilder.java:59)
	at org.apache.maven.lifecycle.internal.LifecycleStarter.singleThreadedBuild(LifecycleStarter.java:183)
	at org.apache.maven.lifecycle.internal.LifecycleStarter.execute(LifecycleStarter.java:161)
	at org.apache.maven.DefaultMaven.doExecute(DefaultMaven.java:319)
	at org.apache.maven.DefaultMaven.execute(DefaultMaven.java:156)
	at org.jvnet.hudson.maven3.launcher.Maven3Launcher.main(Maven3Launcher.java:79)
	at sun.reflect.NativeMethodAccessorImpl.invoke0(Native Method)
	at sun.reflect.NativeMethodAccessorImpl.invoke(NativeMethodAccessorImpl.java:39)
	at sun.reflect.DelegatingMethodAccessorImpl.invoke(DelegatingMethodAccessorImpl.java:25)
	at java.lang.reflect.Method.invoke(Method.java:597)
	at org.codehaus.plexus.classworlds.launcher.Launcher.launchStandard(Launcher.java:329)
	at org.codehaus.plexus.classworlds.launcher.Launcher.launch(Launcher.java:239)
	at org.jvnet.hudson.maven3.agent.Maven3Main.launch(Maven3Main.java:158)
	at hudson.maven.Maven3Builder.call(Maven3Builder.java:98)
	at hudson.maven.Maven3Builder.call(Maven3Builder.java:64)
	at hudson.remoting.UserRequest.perform(UserRequest.java:118)
	at hudson.remoting.UserRequest.perform(UserRequest.java:48)
	at hudson.remoting.Request$2.run(Request.java:326)
	at hudson.remoting.InterceptingExecutorService$1.call(InterceptingExecutorService.java:72)
	at java.util.concurrent.FutureTask$Sync.innerRun(FutureTask.java:303)
	at java.util.concurrent.FutureTask.run(FutureTask.java:138)
	at java.util.concurrent.ThreadPoolExecutor$Worker.runTask(ThreadPoolExecutor.java:886)
	at java.util.concurrent.ThreadPoolExecutor$Worker.run(ThreadPoolExecutor.java:908)
	at java.lang.Thread.run(Thread.java:662)
Caused by: org.apache.maven.plugin.MojoExecutionException: Error occurred in starting fork,
check output in log
	at org.apache.maven.plugin.surefire.SurefirePlugin.assertNoException(SurefirePlugin.java:656)
	at org.apache.maven.plugin.surefire.SurefirePlugin.handleSummary(SurefirePlugin.java:645)
	at org.apache.maven.plugin.surefire.AbstractSurefireMojo.executeAfterPreconditionsChecked(AbstractSurefireMojo.java:137)
	at org.apache.maven.plugin.surefire.AbstractSurefireMojo.execute(AbstractSurefireMojo.java:98)
	at org.apache.maven.plugin.DefaultBuildPluginManager.executeMojo(DefaultBuildPluginManager.java:101)
	at org.apache.maven.lifecycle.internal.MojoExecutor.execute(MojoExecutor.java:209)
	... 27 more
Caused by: org.apache.maven.surefire.booter.SurefireBooterForkException: Error occurred in
starting fork, check output in log
	at org.apache.maven.plugin.surefire.booterclient.ForkStarter.fork(ForkStarter.java:281)
	at org.apache.maven.plugin.surefire.booterclient.ForkStarter.run(ForkStarter.java:113)
	at org.apache.maven.plugin.surefire.AbstractSurefireMojo.executeProvider(AbstractSurefireMojo.java:199)
	at org.apache.maven.plugin.surefire.AbstractSurefireMojo.executeAllProviders(AbstractSurefireMojo.java:176)
	at org.apache.maven.plugin.surefire.AbstractSurefireMojo.executeAfterPreconditionsChecked(AbstractSurefireMojo.java:135)
	... 30 more
Sending e-mails to: airavata-dev@incubator.apache.org
channel stopped

Mime
View raw message