airavata-dev mailing list archives

Site index · List index
Message view « Date » · « Thread »
Top « Date » · « Thread »
From Apache Jenkins Server <jenk...@builds.apache.org>
Subject Build failed in Jenkins: Apache Airavata #693
Date Mon, 10 Sep 2012 16:27:36 GMT
See <https://builds.apache.org/job/Apache%20Airavata/693/changes>

Changes:

[lahiru] using new AiravataRegistry2 in gfac-axi2.

[lahiru] using new registry implementation in gfac-core

[lahiru] adding Util method to registry.

[lahiru] applying patch from chathuri for AIRAVATA-562

------------------------------------------
[...truncated 2839 lines...]
55857 [main] INFO org.apache.jackrabbit.core.config.RepositoryConfig - Copying configuration
from jar:file:/export/home/hudson/hudson-slave/maven-repositories/0/org/apache/jackrabbit/jackrabbit-core/2.2.7/jackrabbit-core-2.2.7.jar!/org/apache/jackrabbit/core/repository.xml
to target/jackrabbit14/repository.xml
55864 [main] INFO org.apache.jackrabbit.core.RepositoryImpl - Starting repository...
55864 [main] INFO org.apache.jackrabbit.core.fs.local.LocalFileSystem - LocalFileSystem initialized
at path target/jackrabbit14/repository
55873 [main] INFO org.apache.jackrabbit.core.nodetype.NodeTypeRegistry - no custom node type
definitions found
55873 [main] INFO org.apache.jackrabbit.core.fs.local.LocalFileSystem - LocalFileSystem initialized
at path target/jackrabbit14/version
56519 [main] INFO org.apache.jackrabbit.core.RepositoryImpl - initializing workspace 'default'...
56520 [main] INFO org.apache.jackrabbit.core.fs.local.LocalFileSystem - LocalFileSystem initialized
at path target/jackrabbit14/workspaces/default
56928 [main] INFO org.apache.jackrabbit.core.query.lucene.MultiIndex - indexing... /jcr:system/jcr:nodeTypes/rep:Activities/jcr:childNodeDefinition
(100)
56972 [main] INFO org.apache.jackrabbit.core.query.lucene.SearchIndex - Index initialized:
target/jackrabbit14/repository/index Version: 3
56993 [main] INFO org.apache.jackrabbit.core.query.lucene.SearchIndex - Index initialized:
target/jackrabbit14/workspaces/default/index Version: 3
56993 [main] INFO org.apache.jackrabbit.core.RepositoryImpl - workspace 'default' initialized
56995 [main] INFO org.apache.jackrabbit.core.RepositoryImpl - created system workspace: security
56996 [main] INFO org.apache.jackrabbit.core.RepositoryImpl - SecurityManager = class org.apache.jackrabbit.core.security.simple.SimpleSecurityManager
56996 [main] INFO org.apache.jackrabbit.core.RepositoryImpl - initializing workspace 'security'...
56996 [main] INFO org.apache.jackrabbit.core.fs.local.LocalFileSystem - LocalFileSystem initialized
at path target/jackrabbit14/workspaces/security
57735 [main] INFO org.apache.jackrabbit.core.query.lucene.SearchIndex - Index initialized:
target/jackrabbit14/workspaces/security/index Version: 3
57735 [main] INFO org.apache.jackrabbit.core.RepositoryImpl - workspace 'security' initialized
57735 [main] INFO org.apache.jackrabbit.core.security.simple.SimpleSecurityManager - init:
using Repository LoginModule configuration for Jackrabbit
57735 [main] INFO org.apache.jackrabbit.core.RepositoryImpl - Repository started (1871ms)
57735 [main] INFO org.apache.jackrabbit.core.TransientRepository - Transient repository initialized
57736 [main] INFO org.apache.jackrabbit.core.TransientRepository - Session opened
57750 [ObservationManager] WARN org.apache.jackrabbit.core.observation.ObservationDispatcher
- EventConsumer threw exception: java.util.ConcurrentModificationException
57761 [ObservationManager] WARN org.apache.jackrabbit.core.observation.ObservationDispatcher
- EventConsumer threw exception: java.util.ConcurrentModificationException
57766 [ObservationManager] WARN org.apache.jackrabbit.core.observation.ObservationDispatcher
- EventConsumer threw exception: java.util.ConcurrentModificationException
57770 [ObservationManager] WARN org.apache.jackrabbit.core.observation.ObservationDispatcher
- EventConsumer threw exception: java.util.ConcurrentModificationException
57773 [ObservationManager] WARN org.apache.jackrabbit.core.observation.ObservationDispatcher
- EventConsumer threw exception: java.util.ConcurrentModificationException
57785 [main] INFO org.apache.jackrabbit.core.TransientRepository - Session closed
57785 [main] INFO org.apache.jackrabbit.core.RepositoryImpl - Shutting down repository...
57795 [main] INFO org.apache.jackrabbit.core.query.lucene.SearchIndex - Index closed: target/jackrabbit14/repository/index
57795 [main] INFO org.apache.jackrabbit.core.RepositoryImpl - shutting down workspace 'default'...
57795 [main] INFO org.apache.jackrabbit.core.observation.ObservationDispatcher - Notification
of EventListeners stopped.
57806 [main] INFO org.apache.jackrabbit.core.query.lucene.SearchIndex - Index closed: target/jackrabbit14/workspaces/default/index
57906 [main] INFO org.apache.jackrabbit.core.util.db.DerbyConnectionHelper - Database 'target/jackrabbit14/workspaces/default/db'
shutdown.
57906 [main] INFO org.apache.jackrabbit.core.RepositoryImpl - workspace 'default' has been
shutdown
57906 [main] INFO org.apache.jackrabbit.core.RepositoryImpl - shutting down workspace 'security'...
57906 [main] INFO org.apache.jackrabbit.core.observation.ObservationDispatcher - Notification
of EventListeners stopped.
57911 [main] INFO org.apache.jackrabbit.core.query.lucene.SearchIndex - Index closed: target/jackrabbit14/workspaces/security/index
57946 [main] INFO org.apache.jackrabbit.core.util.db.DerbyConnectionHelper - Database 'target/jackrabbit14/workspaces/security/db'
shutdown.
57946 [main] INFO org.apache.jackrabbit.core.RepositoryImpl - workspace 'security' has been
shutdown
58071 [main] INFO org.apache.jackrabbit.core.util.db.DerbyConnectionHelper - Database 'target/jackrabbit14/version/db'
shutdown.
58071 [main] INFO org.apache.jackrabbit.core.RepositoryImpl - Repository has been shutdown
58072 [main] INFO org.apache.jackrabbit.core.TransientRepository - Transient repository shut
down
Tests run: 5, Failures: 0, Errors: 0, Skipped: 0, Time elapsed: 33.311 sec

Results :

Tests run: 11, Failures: 0, Errors: 0, Skipped: 0

mojoSucceeded org.apache.maven.plugins:maven-surefire-plugin:2.12(default-test)
[JENKINS] Recording test results
mojoStarted org.apache.maven.plugins:maven-jar-plugin:2.3.1(default-jar)
[INFO] [INFO] Building jar: <https://builds.apache.org/job/Apache%20Airavata/ws/modules/commons/registry-api/target/airavata-registry-api-0.5-incubating-SNAPSHOT.jar>

[INFO] --- maven-jar-plugin:2.3.1:jar (default-jar) @ airavata-registry-api ---
mojoSucceeded org.apache.maven.plugins:maven-jar-plugin:2.3.1(default-jar)
mojoStarted org.apache.maven.plugins:maven-site-plugin:3.0(attach-descriptor)
[INFO] 
[INFO] --- maven-site-plugin:3.0:attach-descriptor (attach-descriptor) @ airavata-registry-api
---
mojoSucceeded org.apache.maven.plugins:maven-site-plugin:3.0(attach-descriptor)
mojoStarted org.apache.maven.plugins:maven-install-plugin:2.3.1(default-install)
[INFO] 
[INFO] Installing <https://builds.apache.org/job/Apache%20Airavata/ws/modules/commons/registry-api/target/airavata-registry-api-0.5-incubating-SNAPSHOT.jar>
to /export/home/hudson/hudson-slave/maven-repositories/0/org/apache/airavata/airavata-registry-api/0.5-incubating-SNAPSHOT/airavata-registry-api-0.5-incubating-SNAPSHOT.jar
[INFO] Installing <https://builds.apache.org/job/Apache%20Airavata/ws/modules/commons/registry-api/pom.xml>
to /export/home/hudson/hudson-slave/maven-repositories/0/org/apache/airavata/airavata-registry-api/0.5-incubating-SNAPSHOT/airavata-registry-api-0.5-incubating-SNAPSHOT.pom
[INFO] --- maven-install-plugin:2.3.1:install (default-install) @ airavata-registry-api ---
mojoSucceeded org.apache.maven.plugins:maven-install-plugin:2.3.1(default-install)
projectSucceeded org.apache.airavata:airavata-registry-api:0.5-incubating-SNAPSHOT
projectStarted org.apache.airavata:registry:0.5-incubating-SNAPSHOT
[INFO]                                                                         
[INFO] ------------------------------------------------------------------------
[INFO] Building Airavata Registry 0.5-incubating-SNAPSHOT
[INFO] ------------------------------------------------------------------------
mojoStarted org.apache.maven.plugins:maven-clean-plugin:2.4.1(default-clean)
[INFO] 
[INFO] --- maven-clean-plugin:2.4.1:clean (default-clean) @ registry ---
mojoSucceeded org.apache.maven.plugins:maven-clean-plugin:2.4.1(default-clean)
mojoStarted org.apache.maven.plugins:maven-resources-plugin:2.5(copy-resources)[debug] execute
contextualize

[INFO] 
[INFO] Using 'UTF-8' encoding to copy filtered resources.
[INFO] skip non existing resourceDirectory <https://builds.apache.org/job/Apache%20Airavata/ws/modules/registry/src/main/assembly/dist>
[INFO] --- maven-resources-plugin:2.5:copy-resources (copy-resources) @ registry ---
mojoSucceeded org.apache.maven.plugins:maven-resources-plugin:2.5(copy-resources)
mojoStarted org.apache.maven.plugins:maven-remote-resources-plugin:1.2.1(default)
[INFO] 
[INFO] --- maven-remote-resources-plugin:1.2.1:process (default) @ registry ---
mojoSucceeded org.apache.maven.plugins:maven-remote-resources-plugin:1.2.1(default)
mojoStarted org.apache.maven.plugins:maven-site-plugin:3.0(attach-descriptor)
[INFO] 
[INFO] --- maven-site-plugin:3.0:attach-descriptor (attach-descriptor) @ registry ---
mojoSucceeded org.apache.maven.plugins:maven-site-plugin:3.0(attach-descriptor)
mojoStarted org.apache.maven.plugins:maven-install-plugin:2.3.1(default-install)
[INFO] 
[INFO] Installing <https://builds.apache.org/job/Apache%20Airavata/ws/modules/registry/pom.xml>
to /export/home/hudson/hudson-slave/maven-repositories/0/org/apache/airavata/registry/0.5-incubating-SNAPSHOT/registry-0.5-incubating-SNAPSHOT.pom
[INFO] --- maven-install-plugin:2.3.1:install (default-install) @ registry ---
mojoSucceeded org.apache.maven.plugins:maven-install-plugin:2.3.1(default-install)
projectSucceeded org.apache.airavata:registry:0.5-incubating-SNAPSHOT
projectStarted org.apache.airavata:airavata-jpa-registry:0.5-incubating-SNAPSHOT
[INFO]                                                                         
[INFO] ------------------------------------------------------------------------
[INFO] Building Airavata JPA Registry 0.5-incubating-SNAPSHOT
[INFO] ------------------------------------------------------------------------
mojoStarted org.apache.maven.plugins:maven-clean-plugin:2.4.1(default-clean)
[INFO] 
[INFO] --- maven-clean-plugin:2.4.1:clean (default-clean) @ airavata-jpa-registry ---
mojoSucceeded org.apache.maven.plugins:maven-clean-plugin:2.4.1(default-clean)
mojoStarted org.apache.maven.plugins:maven-resources-plugin:2.5(copy-resources)
[INFO] 
[debug] execute contextualize
[INFO] Using 'UTF-8' encoding to copy filtered resources.
[INFO] skip non existing resourceDirectory <https://builds.apache.org/job/Apache%20Airavata/ws/modules/registry/airavata-jpa-registry/src/main/assembly/dist>
[INFO] --- maven-resources-plugin:2.5:copy-resources (copy-resources) @ airavata-jpa-registry
---
mojoSucceeded org.apache.maven.plugins:maven-resources-plugin:2.5(copy-resources)
mojoStarted org.apache.maven.plugins:maven-remote-resources-plugin:1.2.1(default)
[INFO] 
[INFO] --- maven-remote-resources-plugin:1.2.1:process (default) @ airavata-jpa-registry ---
mojoSucceeded org.apache.maven.plugins:maven-remote-resources-plugin:1.2.1(default)
mojoStarted org.apache.maven.plugins:maven-resources-plugin:2.5(default-resources)
[INFO] 
[debug] execute contextualize
[INFO] Using 'UTF-8' encoding to copy filtered resources.
[INFO] Copying 2 resources
[INFO] Copying 4 resources
[INFO] --- maven-resources-plugin:2.5:resources (default-resources) @ airavata-jpa-registry
---
mojoSucceeded org.apache.maven.plugins:maven-resources-plugin:2.5(default-resources)
mojoStarted org.apache.maven.plugins:maven-compiler-plugin:2.3.2(default-compile)[INFO] Compiling
35 source files to <https://builds.apache.org/job/Apache%20Airavata/ws/modules/registry/airavata-jpa-registry/target/classes>

[INFO] 
[INFO] [INFO] -------------------------------------------------------------
--- maven-compiler-plugin:2.3.2:compile (default-compile) @ airavata-jpa-registry ---
[ERROR] COMPILATION ERROR : 
[INFO] -------------------------------------------------------------
[ERROR] <https://builds.apache.org/job/Apache%20Airavata/ws/modules/registry/airavata-jpa-registry/src/main/java/org/apache/airavata/persistance/registry/jpa/impl/AiravataJPARegistry.java>:[85,7]
org.apache.airavata.persistance.registry.jpa.impl.AiravataJPARegistry is not abstract and
does not override abstract method closeConnection() in org.apache.airavata.registry.api.AiravataRegistry2
[INFO] 1 error
[INFO] -------------------------------------------------------------
mojoFailed org.apache.maven.plugins:maven-compiler-plugin:2.3.2(default-compile)
projectFailed org.apache.airavata:airavata-jpa-registry:0.5-incubating-SNAPSHOT
sessionEnded
[INFO] ------------------------------------------------------------------------
[INFO] Reactor Summary:
[INFO] 
[INFO] Airavata .......................................... SUCCESS [4:25.258s]
[INFO] Airavata Commons .................................. SUCCESS [7.488s]
[INFO] Airavata Common Utilities ......................... SUCCESS [2:37.311s]
[INFO] Airavata Common Registry API ...................... SUCCESS [58.187s]
[INFO] Airavata Registry API ............................. SUCCESS [2:08.553s]
[INFO] Airavata Registry ................................. SUCCESS [15.391s]
[INFO] Airavata JPA Registry ............................. FAILURE [28.802s]
[INFO] Airavata GFac Core ................................ SKIPPED
[INFO] Airavata GFac Axis2 Interface ..................... SKIPPED
[INFO] Airavata WS Messenger ............................. SKIPPED
[INFO] Airavata Messenger Commons ........................ SKIPPED
[INFO] Airavata Messenger Client ......................... SKIPPED
[INFO] Airavata Message Box .............................. SKIPPED
[INFO] Airavata Message Broker ........................... SKIPPED
[INFO] Airavata Workflow Model Parent .................... SKIPPED
[INFO] Airavata Workflow Model Core ...................... SKIPPED
[INFO] Airavata XBaya .................................... SKIPPED
[INFO] Airavata Provenance Registry ...................... SKIPPED
[INFO] Airavata Client ................................... SKIPPED
[INFO] Simple Math Service ............................... SKIPPED
[INFO] Complex Math Service .............................. SKIPPED
[INFO] Levenshtein Distance Service ...................... SKIPPED
[INFO] distribution ...................................... SKIPPED
[INFO] Airavata Test Suite ............................... SKIPPED
[INFO] ------------------------------------------------------------------------
[INFO] BUILD FAILURE
[INFO] ------------------------------------------------------------------------
[INFO] Total time: 12:17.238s
[INFO] Finished at: Mon Sep 10 16:18:20 GMT+00:00 2012
[INFO] Final Memory: 48M/113M
[INFO] ------------------------------------------------------------------------
Projects to build: [MavenProject: org.apache.airavata:airavata:0.5-incubating-SNAPSHOT @ <https://builds.apache.org/job/Apache%20Airavata/ws/pom.xml,>
MavenProject: org.apache.airavata:commons:0.5-incubating-SNAPSHOT @ <https://builds.apache.org/job/Apache%20Airavata/ws/modules/commons/pom.xml,>
MavenProject: org.apache.airavata:airavata-common-utils:0.5-incubating-SNAPSHOT @ <https://builds.apache.org/job/Apache%20Airavata/ws/modules/commons/utils/pom.xml,>
MavenProject: org.apache.airavata:airavata-common-registry-api:0.5-incubating-SNAPSHOT @ <https://builds.apache.org/job/Apache%20Airavata/ws/modules/commons/common-registry-api/pom.xml,>
MavenProject: org.apache.airavata:airavata-registry-api:0.5-incubating-SNAPSHOT @ <https://builds.apache.org/job/Apache%20Airavata/ws/modules/commons/registry-api/pom.xml,>
MavenProject: org.apache.airavata:registry:0.5-incubating-SNAPSHOT @ <https://builds.apache.org/job/Apache%20Airavata/ws/modules/registry/pom.xml,>
MavenProject: org.apache.airavata:airavata-jpa-registry:0.5-incubating-SNAPSHOT @ <https://builds.apache.org/job/Apache%20Airavata/ws/modules/registry/airavata-jpa-registry/pom.xml,>
MavenProject: org.apache.airavata:airavata-gfac-core:0.5-incubating-SNAPSHOT @ <https://builds.apache.org/job/Apache%20Airavata/ws/modules/gfac-core/pom.xml,>
MavenProject: org.apache.airavata:airavata-gfac-axis2-interface:0.5-incubating-SNAPSHOT @
<https://builds.apache.org/job/Apache%20Airavata/ws/modules/gfac-axis2/pom.xml,> MavenProject:
org.apache.airavata:airavata-ws-messenger:0.5-incubating-SNAPSHOT @ <https://builds.apache.org/job/Apache%20Airavata/ws/modules/ws-messenger/pom.xml,>
MavenProject: org.apache.airavata:airavata-messenger-commons:0.5-incubating-SNAPSHOT @ <https://builds.apache.org/job/Apache%20Airavata/ws/modules/ws-messenger/commons/pom.xml,>
MavenProject: org.apache.airavata:airavata-messenger-client:0.5-incubating-SNAPSHOT @ <https://builds.apache.org/job/Apache%20Airavata/ws/modules/ws-messenger/client/pom.xml,>
MavenProject: org.apache.airavata:airavata-message-box:0.5-incubating-SNAPSHOT @ <https://builds.apache.org/job/Apache%20Airavata/ws/modules/ws-messenger/messagebox/pom.xml,>
MavenProject: org.apache.airavata:airavata-message-broker:0.5-incubating-SNAPSHOT @ <https://builds.apache.org/job/Apache%20Airavata/ws/modules/ws-messenger/messagebroker/pom.xml,>
MavenProject: org.apache.airavata:airavata-workflow-model-parent:0.5-incubating-SNAPSHOT @
<https://builds.apache.org/job/Apache%20Airavata/ws/modules/workflow-model/pom.xml,>
MavenProject: org.apache.airavata:airavata-workflow-model-core:0.5-incubating-SNAPSHOT @ <https://builds.apache.org/job/Apache%20Airavata/ws/modules/workflow-model/workflow-model-core/pom.xml,>
MavenProject: org.apache.airavata:airavata-xbaya-gui:0.5-incubating-SNAPSHOT @ <https://builds.apache.org/job/Apache%20Airavata/ws/modules/xbaya-gui/pom.xml,>
MavenProject: org.apache.airavata:airavata-provenance-registry:0.5-incubating-SNAPSHOT @ <https://builds.apache.org/job/Apache%20Airavata/ws/modules/commons/provenance-registry/pom.xml,>
MavenProject: org.apache.airavata:airavata-client-api:0.5-incubating-SNAPSHOT @ <https://builds.apache.org/job/Apache%20Airavata/ws/modules/airavata-client/pom.xml,>
MavenProject: org.apache.airavata:airavata-simple-math-service:0.5-incubating-SNAPSHOT @ <https://builds.apache.org/job/Apache%20Airavata/ws/samples/simple-math-service/pom.xml,>
MavenProject: org.apache.airavata:airavata-complex-math-service:0.5-incubating-SNAPSHOT @
<https://builds.apache.org/job/Apache%20Airavata/ws/samples/complex-math-service/pom.xml,>
MavenProject: org.apache.airavata:airavata-levenshtein-distance-service:0.5-incubating-SNAPSHOT
@ <https://builds.apache.org/job/Apache%20Airavata/ws/samples/levenshtein-distance-service/pom.xml,>
MavenProject: org.apache.airavata:distribution:0.5-incubating-SNAPSHOT @ <https://builds.apache.org/job/Apache%20Airavata/ws/modules/distribution/pom.xml,>
MavenProject: org.apache.airavata:test-suite:0.5-incubating-SNAPSHOT @ <https://builds.apache.org/job/Apache%20Airavata/ws/modules/test-suite/pom.xml]>
[JENKINS] Archiving <https://builds.apache.org/job/Apache%20Airavata/ws/samples/complex-math-service/pom.xml>
to /home/hudson/hudson/jobs/Apache Airavata/modules/org.apache.airavata$airavata-complex-math-service/builds/2012-09-10_16-02-58/archive/org.apache.airavata/airavata-complex-math-service/0.5-incubating-SNAPSHOT/airavata-complex-math-service-0.5-incubating-SNAPSHOT.pom
[JENKINS] Archiving <https://builds.apache.org/job/Apache%20Airavata/ws/samples/simple-math-service/pom.xml>
to /home/hudson/hudson/jobs/Apache Airavata/modules/org.apache.airavata$airavata-simple-math-service/builds/2012-09-10_16-02-57/archive/org.apache.airavata/airavata-simple-math-service/0.5-incubating-SNAPSHOT/airavata-simple-math-service-0.5-incubating-SNAPSHOT.pom
[JENKINS] Archiving <https://builds.apache.org/job/Apache%20Airavata/ws/modules/commons/registry-api/pom.xml>
to /home/hudson/hudson/jobs/Apache Airavata/modules/org.apache.airavata$airavata-registry-api/builds/2012-09-10_16-02-55/archive/org.apache.airavata/airavata-registry-api/0.5-incubating-SNAPSHOT/airavata-registry-api-0.5-incubating-SNAPSHOT.pom
[JENKINS] Archiving <https://builds.apache.org/job/Apache%20Airavata/ws/modules/commons/registry-api/target/airavata-registry-api-0.5-incubating-SNAPSHOT.jar>
to /home/hudson/hudson/jobs/Apache Airavata/modules/org.apache.airavata$airavata-registry-api/builds/2012-09-10_16-02-55/archive/org.apache.airavata/airavata-registry-api/0.5-incubating-SNAPSHOT/airavata-registry-api-0.5-incubating-SNAPSHOT.jar
[JENKINS] Archiving <https://builds.apache.org/job/Apache%20Airavata/ws/modules/distribution/pom.xml>
to /home/hudson/hudson/jobs/Apache Airavata/modules/org.apache.airavata$distribution/builds/2012-09-10_16-02-58/archive/org.apache.airavata/distribution/0.5-incubating-SNAPSHOT/distribution-0.5-incubating-SNAPSHOT.pom
[JENKINS] Archiving <https://builds.apache.org/job/Apache%20Airavata/ws/modules/xbaya-gui/pom.xml>
to /home/hudson/hudson/jobs/Apache Airavata/modules/org.apache.airavata$airavata-xbaya-gui/builds/2012-09-10_16-02-51/archive/org.apache.airavata/airavata-xbaya-gui/0.5-incubating-SNAPSHOT/airavata-xbaya-gui-0.5-incubating-SNAPSHOT.pom
[JENKINS] Archiving <https://builds.apache.org/job/Apache%20Airavata/ws/modules/gfac-core/pom.xml>
to /home/hudson/hudson/jobs/Apache Airavata/modules/org.apache.airavata$airavata-gfac-core/builds/2012-09-10_16-02-49/archive/org.apache.airavata/airavata-gfac-core/0.5-incubating-SNAPSHOT/airavata-gfac-core-0.5-incubating-SNAPSHOT.pom
[JENKINS] Archiving <https://builds.apache.org/job/Apache%20Airavata/ws/modules/ws-messenger/messagebox/pom.xml>
to /home/hudson/hudson/jobs/Apache Airavata/modules/org.apache.airavata$airavata-message-box/builds/2012-09-10_16-02-50/archive/org.apache.airavata/airavata-message-box/0.5-incubating-SNAPSHOT/airavata-message-box-0.5-incubating-SNAPSHOT.pom
[JENKINS] Archiving <https://builds.apache.org/job/Apache%20Airavata/ws/modules/gfac-axis2/pom.xml>
to /home/hudson/hudson/jobs/Apache Airavata/modules/org.apache.airavata$airavata-gfac-axis2-interface/builds/2012-09-10_16-02-49/archive/org.apache.airavata/airavata-gfac-axis2-interface/0.5-incubating-SNAPSHOT/airavata-gfac-axis2-interface-0.5-incubating-SNAPSHOT.pom
[JENKINS] Archiving <https://builds.apache.org/job/Apache%20Airavata/ws/modules/commons/pom.xml>
to /home/hudson/hudson/jobs/Apache Airavata/modules/org.apache.airavata$commons/builds/2012-09-10_16-02-52/archive/org.apache.airavata/commons/0.5-incubating-SNAPSHOT/commons-0.5-incubating-SNAPSHOT.pom
[JENKINS] Archiving <https://builds.apache.org/job/Apache%20Airavata/ws/modules/registry/pom.xml>
to /home/hudson/hudson/jobs/Apache Airavata/modules/org.apache.airavata$registry/builds/2012-09-10_16-02-56/archive/org.apache.airavata/registry/0.5-incubating-SNAPSHOT/registry-0.5-incubating-SNAPSHOT.pom
[JENKINS] Archiving <https://builds.apache.org/job/Apache%20Airavata/ws/modules/ws-messenger/pom.xml>
to /home/hudson/hudson/jobs/Apache Airavata/modules/org.apache.airavata$airavata-ws-messenger/builds/2012-09-10_16-02-49/archive/org.apache.airavata/airavata-ws-messenger/0.5-incubating-SNAPSHOT/airavata-ws-messenger-0.5-incubating-SNAPSHOT.pom
[JENKINS] Archiving <https://builds.apache.org/job/Apache%20Airavata/ws/samples/levenshtein-distance-service/pom.xml>
to /home/hudson/hudson/jobs/Apache Airavata/modules/org.apache.airavata$airavata-levenshtein-distance-service/builds/2012-09-10_16-02-58/archive/org.apache.airavata/airavata-levenshtein-distance-service/0.5-incubating-SNAPSHOT/airavata-levenshtein-distance-service-0.5-incubating-SNAPSHOT.pom
[JENKINS] Archiving <https://builds.apache.org/job/Apache%20Airavata/ws/modules/commons/utils/pom.xml>
to /home/hudson/hudson/jobs/Apache Airavata/modules/org.apache.airavata$airavata-common-utils/builds/2012-09-10_16-02-55/archive/org.apache.airavata/airavata-common-utils/0.5-incubating-SNAPSHOT/airavata-common-utils-0.5-incubating-SNAPSHOT.pom
[JENKINS] Archiving <https://builds.apache.org/job/Apache%20Airavata/ws/modules/commons/utils/target/airavata-common-utils-0.5-incubating-SNAPSHOT.jar>
to /home/hudson/hudson/jobs/Apache Airavata/modules/org.apache.airavata$airavata-common-utils/builds/2012-09-10_16-02-55/archive/org.apache.airavata/airavata-common-utils/0.5-incubating-SNAPSHOT/airavata-common-utils-0.5-incubating-SNAPSHOT.jar
[JENKINS] Archiving <https://builds.apache.org/job/Apache%20Airavata/ws/modules/registry/airavata-jpa-registry/pom.xml>
to /home/hudson/hudson/jobs/Apache Airavata/modules/org.apache.airavata$airavata-jpa-registry/builds/2012-09-10_16-02-56/archive/org.apache.airavata/airavata-jpa-registry/0.5-incubating-SNAPSHOT/airavata-jpa-registry-0.5-incubating-SNAPSHOT.pom
[JENKINS] Archiving <https://builds.apache.org/job/Apache%20Airavata/ws/modules/airavata-client/pom.xml>
to /home/hudson/hudson/jobs/Apache Airavata/modules/org.apache.airavata$airavata-client-api/builds/2012-09-10_16-02-57/archive/org.apache.airavata/airavata-client-api/0.5-incubating-SNAPSHOT/airavata-client-api-0.5-incubating-SNAPSHOT.pom
[JENKINS] Archiving <https://builds.apache.org/job/Apache%20Airavata/ws/modules/ws-messenger/messagebroker/pom.xml>
to /home/hudson/hudson/jobs/Apache Airavata/modules/org.apache.airavata$airavata-message-broker/builds/2012-09-10_16-02-50/archive/org.apache.airavata/airavata-message-broker/0.5-incubating-SNAPSHOT/airavata-message-broker-0.5-incubating-SNAPSHOT.pom
[JENKINS] Archiving <https://builds.apache.org/job/Apache%20Airavata/ws/modules/workflow-model/pom.xml>
to /home/hudson/hudson/jobs/Apache Airavata/modules/org.apache.airavata$airavata-workflow-model-parent/builds/2012-09-10_16-02-51/archive/org.apache.airavata/airavata-workflow-model-parent/0.5-incubating-SNAPSHOT/airavata-workflow-model-parent-0.5-incubating-SNAPSHOT.pom
[JENKINS] Archiving <https://builds.apache.org/job/Apache%20Airavata/ws/modules/commons/common-registry-api/pom.xml>
to /home/hudson/hudson/jobs/Apache Airavata/modules/org.apache.airavata$airavata-common-registry-api/builds/2012-09-10_16-02-55/archive/org.apache.airavata/airavata-common-registry-api/0.5-incubating-SNAPSHOT/airavata-common-registry-api-0.5-incubating-SNAPSHOT.pom
[JENKINS] Archiving <https://builds.apache.org/job/Apache%20Airavata/ws/modules/commons/common-registry-api/target/airavata-common-registry-api-0.5-incubating-SNAPSHOT.jar>
to /home/hudson/hudson/jobs/Apache Airavata/modules/org.apache.airavata$airavata-common-registry-api/builds/2012-09-10_16-02-55/archive/org.apache.airavata/airavata-common-registry-api/0.5-incubating-SNAPSHOT/airavata-common-registry-api-0.5-incubating-SNAPSHOT.jar
[JENKINS] Archiving <https://builds.apache.org/job/Apache%20Airavata/ws/modules/ws-messenger/client/pom.xml>
to /home/hudson/hudson/jobs/Apache Airavata/modules/org.apache.airavata$airavata-messenger-client/builds/2012-09-10_16-02-49/archive/org.apache.airavata/airavata-messenger-client/0.5-incubating-SNAPSHOT/airavata-messenger-client-0.5-incubating-SNAPSHOT.pom
[JENKINS] Archiving <https://builds.apache.org/job/Apache%20Airavata/ws/modules/ws-messenger/commons/pom.xml>
to /home/hudson/hudson/jobs/Apache Airavata/modules/org.apache.airavata$airavata-messenger-commons/builds/2012-09-10_16-02-49/archive/org.apache.airavata/airavata-messenger-commons/0.5-incubating-SNAPSHOT/airavata-messenger-commons-0.5-incubating-SNAPSHOT.pom
[JENKINS] Archiving <https://builds.apache.org/job/Apache%20Airavata/ws/modules/workflow-model/workflow-model-core/pom.xml>
to /home/hudson/hudson/jobs/Apache Airavata/modules/org.apache.airavata$airavata-workflow-model-core/builds/2012-09-10_16-02-51/archive/org.apache.airavata/airavata-workflow-model-core/0.5-incubating-SNAPSHOT/airavata-workflow-model-core-0.5-incubating-SNAPSHOT.pom
[JENKINS] Archiving <https://builds.apache.org/job/Apache%20Airavata/ws/modules/test-suite/pom.xml>
to /home/hudson/hudson/jobs/Apache Airavata/modules/org.apache.airavata$test-suite/builds/2012-09-10_16-02-59/archive/org.apache.airavata/test-suite/0.5-incubating-SNAPSHOT/test-suite-0.5-incubating-SNAPSHOT.pom
[JENKINS] Archiving <https://builds.apache.org/job/Apache%20Airavata/ws/modules/commons/provenance-registry/pom.xml>
to /home/hudson/hudson/jobs/Apache Airavata/modules/org.apache.airavata$airavata-provenance-registry/builds/2012-09-10_16-02-56/archive/org.apache.airavata/airavata-provenance-registry/0.5-incubating-SNAPSHOT/airavata-provenance-registry-0.5-incubating-SNAPSHOT.pom
[JENKINS] Archiving <https://builds.apache.org/job/Apache%20Airavata/ws/pom.xml> to
/home/hudson/hudson/jobs/Apache Airavata/modules/org.apache.airavata$airavata/builds/2012-09-10_16-02-48/archive/org.apache.airavata/airavata/0.5-incubating-SNAPSHOT/airavata-0.5-incubating-SNAPSHOT.pom
Waiting for Jenkins to finish collecting data
mavenExecutionResult exceptions not empty
message : Failed to execute goal org.apache.maven.plugins:maven-compiler-plugin:2.3.2:compile
(default-compile) on project airavata-jpa-registry: Compilation failure
<https://builds.apache.org/job/Apache%20Airavata/ws/modules/registry/airavata-jpa-registry/src/main/java/org/apache/airavata/persistance/registry/jpa/impl/AiravataJPARegistry.java>:[85,7]
org.apache.airavata.persistance.registry.jpa.impl.AiravataJPARegistry is not abstract and
does not override abstract method closeConnection() in org.apache.airavata.registry.api.AiravataRegistry2

cause : Compilation failure
<https://builds.apache.org/job/Apache%20Airavata/ws/modules/registry/airavata-jpa-registry/src/main/java/org/apache/airavata/persistance/registry/jpa/impl/AiravataJPARegistry.java>:[85,7]
org.apache.airavata.persistance.registry.jpa.impl.AiravataJPARegistry is not abstract and
does not override abstract method closeConnection() in org.apache.airavata.registry.api.AiravataRegistry2

Stack trace : 
org.apache.maven.lifecycle.LifecycleExecutionException: Failed to execute goal org.apache.maven.plugins:maven-compiler-plugin:2.3.2:compile
(default-compile) on project airavata-jpa-registry: Compilation failure
<https://builds.apache.org/job/Apache%20Airavata/ws/modules/registry/airavata-jpa-registry/src/main/java/org/apache/airavata/persistance/registry/jpa/impl/AiravataJPARegistry.java>:[85,7]
org.apache.airavata.persistance.registry.jpa.impl.AiravataJPARegistry is not abstract and
does not override abstract method closeConnection() in org.apache.airavata.registry.api.AiravataRegistry2

	at org.apache.maven.lifecycle.internal.MojoExecutor.execute(MojoExecutor.java:213)
	at org.apache.maven.lifecycle.internal.MojoExecutor.execute(MojoExecutor.java:153)
	at org.apache.maven.lifecycle.internal.MojoExecutor.execute(MojoExecutor.java:145)
	at org.apache.maven.lifecycle.internal.LifecycleModuleBuilder.buildProject(LifecycleModuleBuilder.java:84)
	at org.apache.maven.lifecycle.internal.LifecycleModuleBuilder.buildProject(LifecycleModuleBuilder.java:59)
	at org.apache.maven.lifecycle.internal.LifecycleStarter.singleThreadedBuild(LifecycleStarter.java:183)
	at org.apache.maven.lifecycle.internal.LifecycleStarter.execute(LifecycleStarter.java:161)
	at org.apache.maven.DefaultMaven.doExecute(DefaultMaven.java:319)
	at org.apache.maven.DefaultMaven.execute(DefaultMaven.java:156)
	at org.jvnet.hudson.maven3.launcher.Maven3Launcher.main(Maven3Launcher.java:79)
	at sun.reflect.NativeMethodAccessorImpl.invoke0(Native Method)
	at sun.reflect.NativeMethodAccessorImpl.invoke(NativeMethodAccessorImpl.java:39)
	at sun.reflect.DelegatingMethodAccessorImpl.invoke(DelegatingMethodAccessorImpl.java:25)
	at java.lang.reflect.Method.invoke(Method.java:597)
	at org.codehaus.plexus.classworlds.launcher.Launcher.launchStandard(Launcher.java:329)
	at org.codehaus.plexus.classworlds.launcher.Launcher.launch(Launcher.java:239)
	at org.jvnet.hudson.maven3.agent.Maven3Main.launch(Maven3Main.java:158)
	at hudson.maven.Maven3Builder.call(Maven3Builder.java:98)
	at hudson.maven.Maven3Builder.call(Maven3Builder.java:64)
	at hudson.remoting.UserRequest.perform(UserRequest.java:118)
	at hudson.remoting.UserRequest.perform(UserRequest.java:48)
	at hudson.remoting.Request$2.run(Request.java:326)
	at hudson.remoting.InterceptingExecutorService$1.call(InterceptingExecutorService.java:72)
	at java.util.concurrent.FutureTask$Sync.innerRun(FutureTask.java:303)
	at java.util.concurrent.FutureTask.run(FutureTask.java:138)
	at java.util.concurrent.ThreadPoolExecutor$Worker.runTask(ThreadPoolExecutor.java:886)
	at java.util.concurrent.ThreadPoolExecutor$Worker.run(ThreadPoolExecutor.java:908)
	at java.lang.Thread.run(Thread.java:662)
Caused by: org.apache.maven.plugin.CompilationFailureException: Compilation failure
<https://builds.apache.org/job/Apache%20Airavata/ws/modules/registry/airavata-jpa-registry/src/main/java/org/apache/airavata/persistance/registry/jpa/impl/AiravataJPARegistry.java>:[85,7]
org.apache.airavata.persistance.registry.jpa.impl.AiravataJPARegistry is not abstract and
does not override abstract method closeConnection() in org.apache.airavata.registry.api.AiravataRegistry2

	at org.apache.maven.plugin.AbstractCompilerMojo.execute(AbstractCompilerMojo.java:656)
	at org.apache.maven.plugin.CompilerMojo.execute(CompilerMojo.java:128)
	at org.apache.maven.plugin.DefaultBuildPluginManager.executeMojo(DefaultBuildPluginManager.java:101)
	at org.apache.maven.lifecycle.internal.MojoExecutor.execute(MojoExecutor.java:209)
	... 27 more
Sending e-mails to: airavata-dev@incubator.apache.org glahiru@gmail.com
channel stopped

Mime
View raw message