airavata-dev mailing list archives

Site index · List index
Message view « Date » · « Thread »
Top « Date » · « Thread »
From Apache Jenkins Server <jenk...@builds.apache.org>
Subject Build failed in Jenkins: Apache Airavata » Airavata Test Suite #707
Date Thu, 13 Sep 2012 15:14:46 GMT
See <https://builds.apache.org/job/Apache%20Airavata/org.apache.airavata$test-suite/707/>

------------------------------------------
projectStarted org.apache.airavata:test-suite:0.5-incubating-SNAPSHOT
[INFO]                                                                         
[INFO] ------------------------------------------------------------------------
[INFO] Building Airavata Test Suite 0.5-incubating-SNAPSHOT
[INFO] ------------------------------------------------------------------------
mojoStarted org.apache.maven.plugins:maven-clean-plugin:2.4.1(default-clean)
[INFO] 
[INFO] --- maven-clean-plugin:2.4.1:clean (default-clean) @ test-suite ---
mojoSucceeded org.apache.maven.plugins:maven-clean-plugin:2.4.1(default-clean)
mojoStarted org.apache.maven.plugins:maven-resources-plugin:2.5(copy-resources)[debug] execute
contextualize
[INFO] Using 'UTF-8' encoding to copy filtered resources.
[INFO] skip non existing resourceDirectory <https://builds.apache.org/job/Apache%20Airavata/org.apache.airavata$test-suite/ws/src/main/assembly/dist>

[INFO] 
[INFO] --- maven-resources-plugin:2.5:copy-resources (copy-resources) @ test-suite ---
mojoSucceeded org.apache.maven.plugins:maven-resources-plugin:2.5(copy-resources)
mojoStarted org.apache.maven.plugins:maven-remote-resources-plugin:1.2.1(default)
[INFO] 
[INFO] --- maven-remote-resources-plugin:1.2.1:process (default) @ test-suite ---
mojoSucceeded org.apache.maven.plugins:maven-remote-resources-plugin:1.2.1(default)
mojoStarted org.apache.maven.plugins:maven-resources-plugin:2.5(default-resources)[debug]
execute contextualize
[INFO] Using 'UTF-8' encoding to copy filtered resources.
[INFO] Copying 0 resource
[INFO] Copying 4 resources

[INFO] 
[INFO] --- maven-resources-plugin:2.5:resources (default-resources) @ test-suite ---
mojoSucceeded org.apache.maven.plugins:maven-resources-plugin:2.5(default-resources)
mojoStarted org.apache.maven.plugins:maven-compiler-plugin:2.3.2(default-compile)[INFO] Nothing
to compile - all classes are up to date

[INFO] 
[INFO] --- maven-compiler-plugin:2.3.2:compile (default-compile) @ test-suite ---
mojoSucceeded org.apache.maven.plugins:maven-compiler-plugin:2.3.2(default-compile)
[debug] execute contextualize
mojoStarted org.apache.maven.plugins:maven-resources-plugin:2.5(default-testResources)[INFO]
Using 'UTF-8' encoding to copy filtered resources.
[INFO] Copying 2 resources
[INFO] Copying 4 resources

[INFO] 
[INFO] --- maven-resources-plugin:2.5:testResources (default-testResources) @ test-suite ---
mojoSucceeded org.apache.maven.plugins:maven-resources-plugin:2.5(default-testResources)
mojoStarted org.apache.maven.plugins:maven-compiler-plugin:2.3.2(default-testCompile)[INFO]
Compiling 23 source files to <https://builds.apache.org/job/Apache%20Airavata/org.apache.airavata$test-suite/ws/target/test-classes>

[INFO] 
[INFO] --- maven-compiler-plugin:2.3.2:testCompile (default-testCompile) @ test-suite ---
[INFO] -------------------------------------------------------------
[ERROR] COMPILATION ERROR : 
[INFO] -------------------------------------------------------------
[ERROR] <https://builds.apache.org/job/Apache%20Airavata/org.apache.airavata$test-suite/ws/src/test/java/org/apache/airavata/test/suite/gfac/GramProviderPwscfRangerTest.java>:[124,14]
setRegistryService(org.apache.airavata.registry.api.AiravataRegistry2) in org.apache.airavata.core.gfac.context.invocation.impl.DefaultExecutionContext
cannot be applied to (org.apache.airavata.registry.api.impl.AiravataJCRRegistry)
[ERROR] <https://builds.apache.org/job/Apache%20Airavata/org.apache.airavata$test-suite/ws/src/test/java/org/apache/airavata/test/suite/gfac/GramProviderMPIRangerTest.java>:[124,14]
setRegistryService(org.apache.airavata.registry.api.AiravataRegistry2) in org.apache.airavata.core.gfac.context.invocation.impl.DefaultExecutionContext
cannot be applied to (org.apache.airavata.registry.api.impl.AiravataJCRRegistry)
[ERROR] <https://builds.apache.org/job/Apache%20Airavata/org.apache.airavata$test-suite/ws/src/test/java/org/apache/airavata/test/suite/gfac/FileBreedGramTest.java>:[142,14]
setRegistryService(org.apache.airavata.registry.api.AiravataRegistry2) in org.apache.airavata.core.gfac.context.invocation.impl.DefaultExecutionContext
cannot be applied to (org.apache.airavata.registry.api.impl.AiravataJCRRegistry)
[ERROR] <https://builds.apache.org/job/Apache%20Airavata/org.apache.airavata$test-suite/ws/src/test/java/org/apache/airavata/test/suite/gfac/GramProviderTest.java>:[138,14]
setRegistryService(org.apache.airavata.registry.api.AiravataRegistry2) in org.apache.airavata.core.gfac.context.invocation.impl.DefaultExecutionContext
cannot be applied to (org.apache.airavata.registry.api.impl.AiravataJCRRegistry)
mojoFailed org.apache.maven.plugins:maven-compiler-plugin:2.3.2(default-testCompile)[INFO]
4 errors 
[INFO] -------------------------------------------------------------

projectFailed org.apache.airavata:test-suite:0.5-incubating-SNAPSHOT

Mime
View raw message