activemq-users mailing list archives

Site index · List index
Message view « Date » · « Thread »
Top « Date » · « Thread »
From Christian Posta <christian.po...@gmail.com>
Subject Re: Unable to Compile ActiveQ 5.2
Date Fri, 10 Jan 2014 15:05:36 GMT
maybe try comment that module out of the pom.xml? i dunno where to get
that missing dependency if not in maven. could try google for it and
put it into your local repo if you find it.

On Thu, Jan 9, 2014 at 1:38 PM, CuriousMind <alice.yang@ngc.com> wrote:
> it failed on the User Guide
>
> 1. can I skip that?
> 2. where can I download the plugin?
>
> INFO] ActiveMQ User Guide ............................... FAILURE [0.018s]
> [INFO] ActiveMQ :: File Server ........................... SKIPPED
> [INFO] ActiveMQ :: RAR ................................... SKIPPED
> [INFO] ActiveMQ :: Run Jar ............................... SKIPPED
> [INFO] ActiveMQ :: Atomikos System Test .................. SKIPPED
> [INFO] ActiveMQ Tooling .................................. SKIPPED
> [INFO] ActiveMQ :: Memory Usage Test Plugin .............. SKIPPED
> [INFO] ActiveMQ :: Performance Test Plugin ............... SKIPPED
> [INFO] ActiveMQ :: StartUp Plugin ........................ SKIPPED
> [INFO] ActiveMQ :: Web ................................... SKIPPED
> [INFO] ActiveMQ :: Web Demo .............................. SKIPPED
> [INFO] ActiveMQ :: XMPP .................................. SKIPPED
> [INFO] ActiveMQ :: Web Console ........................... SKIPPED
> [INFO] ActiveMQ :: Assembly .............................. SKIPPED
> [INFO]
> ------------------------------------------------------------------------
> [INFO] BUILD FAILURE
> [INFO]
> ------------------------------------------------------------------------
> [INFO] Total time: 33.050s
> [INFO] Finished at: Thu Jan 09 13:30:30 PST 2014
> [INFO] Final Memory: 28M/174M
> [INFO]
> ------------------------------------------------------------------------
> [ERROR] Plugin com.agilejava.docbkx:docbkx-maven-plugin:2.0.3 or one of its
> dependencies could not be resolved: Failure to find
> com.agilejava.docbkx:docbkx-maven-plugin:jar:2.0.3 in
> http://agilejava.com/maven/ was cached in the local repository, resolution
> will not be reattempted until the update interval of agilejava has elapsed
> or updates are forced -> [Help 1]
>
>
>
>
> --
> View this message in context: http://activemq.2283324.n4.nabble.com/Unable-to-Compile-ActiveQ-5-2-tp4676139p4676185.html
> Sent from the ActiveMQ - User mailing list archive at Nabble.com.



-- 
Christian Posta
http://www.christianposta.com/blog
twitter: @christianposta

Mime
View raw message