activemq-users mailing list archives

Site index · List index
Message view « Date » · « Thread »
Top « Date » · « Thread »
From Peter....@gmx.net
Subject Make check fails when building activemq-cpp-2.2 on SUES 10
Date Wed, 05 Aug 2009 11:29:53 GMT
Hi,

I'm trying to build activemq-cpp-2.2 on SUES 10 64bit. 
autogen.sh, configure, 'make' and 'make install' works fine. When I try to run 'make check'
I get an error (details see below). 

Any ideas what's wrong?

Cheers,
Pete

activemq/connector/stomp/StompConnectorTest.cpp: In member function 'void active         
           mq::connector::stomp::StompConnectorTest::testConsumers()':
activemq/connector/stomp/StompConnectorTest.cpp:99: error: expected primary-expr         
           ession before ')' token
activemq/connector/stomp/StompConnectorTest.cpp:99: error: 'CPPUNIT_ASSERT_THROW         
           _MESSAGE' was not declared in this scope
make[2]: *** [activemq/connector/stomp/activemq_test-StompConnectorTest.o] Error         
            1
make[2]: Leaving directory `/root/develop/apr-stuff/activemq-cpp-library-2.2/src         
           /test'
make[1]: *** [check-am] Error 2
make[1]: Leaving directory `/root/develop/apr-stuff/activemq-cpp-library-2.2/src         
           /test'
make: *** [check-recursive] Error 1

-- 
Neu: GMX Doppel-FLAT mit Internet-Flatrate + Telefon-Flatrate
für nur 19,99 Euro/mtl.!* http://portal.gmx.net/de/go/dsl02

Mime
View raw message