activemq-users mailing list archives

Site index · List index
Message view « Date » · « Thread »
Top « Date » · « Thread »
From Tom Lynema <tlyn...@ftdi.com>
Subject Re: Async error occurred: java.lang.IllegalStateException: With Pure Master/Slave
Date Fri, 14 Mar 2008 13:46:32 GMT

I have gotten the ActiveMQ source downloaded and run the test cases that are
included.  Here are the results:

Tests run: 1767, Failures: 7, Errors: 51, Skipped: 0


It doesn't look good.  Most of the failures appear to be network related
though.  Here are the tests that failed:

Running org.apache.activemq.TimeStampTest
Tests run: 1, Failures: 0, Errors: 1, Skipped: 0, Time elapsed: 0.345 sec
<<< FAILURE!
--
Running org.apache.activemq.usecases.MultiBrokersMultiClientsTest
Tests run: 2, Failures: 1, Errors: 0, Skipped: 0, Time elapsed: 70.14 sec
<<< FAILURE!
--
Running org.apache.activemq.transport.tcp.TransportUriTest
Tests run: 3, Failures: 0, Errors: 3, Skipped: 0, Time elapsed: 0.063 sec
<<< FAILURE!
--
Running org.apache.activemq.network.DuplexNetworkTest
Tests run: 2, Failures: 0, Errors: 2, Skipped: 0, Time elapsed: 0.358 sec
<<< FAILURE!
--
        at
org.apache.maven.surefire.booter.SurefireBooter.main(SurefireBooter.java:743)
Tests run: 3, Failures: 0, Errors: 2, Skipped: 0, Time elapsed: 9,396.564
sec <<< FAILURE!
--
Running org.apache.activemq.usecases.ThreeBrokerTempQueueNetworkTest
Tests run: 3, Failures: 0, Errors: 3, Skipped: 0, Time elapsed: 1.033 sec
<<< FAILURE!
--
Running org.apache.activemq.broker.ReconnectWithJMXEnabledTest
Tests run: 1, Failures: 0, Errors: 1, Skipped: 0, Time elapsed: 0.134 sec
<<< FAILURE!
--
Running
org.apache.activemq.usecases.TwoMulticastDiscoveryBrokerTopicSendReceiveTest
Tests run: 1, Failures: 1, Errors: 0, Skipped: 0, Time elapsed: 71.272 sec
<<< FAILURE!
--
Running org.apache.activemq.network.NetworkReconnectTest
Tests run: 6, Failures: 0, Errors: 6, Skipped: 0, Time elapsed: 0.78 sec <<<
FAILURE!
--
Running org.apache.activemq.usecases.CreateTemporaryQueueBeforeStartTest
Tests run: 3, Failures: 0, Errors: 1, Skipped: 0, Time elapsed: 10.426 sec
<<< FAILURE!
Running org.apache.activemq.test.message.NestedMapAndListPropertyTest
Tests run: 1, Failures: 0, Errors: 1, Skipped: 0, Time elapsed: 0.315 sec
<<< FAILURE!
--
Running org.apache.activemq.ReconnectWithSameClientIDTest
Tests run: 1, Failures: 0, Errors: 1, Skipped: 0, Time elapsed: 0.324 sec
<<< FAILURE!
--
Running org.apache.activemq.bugs.QueueWorkerPrefetchTest
Tests run: 1, Failures: 0, Errors: 1, Skipped: 0, Time elapsed: 0.464 sec
<<< FAILURE!
--
Running org.apache.activemq.transport.tcp.WireformatNegociationTest
Tests run: 3, Failures: 0, Errors: 3, Skipped: 0, Time elapsed: 0.032 sec
<<< FAILURE!
--
Running
org.apache.activemq.usecases.PublishOnTopicConsumerMessageUsingActivemqXMLTest
Tests run: 1, Failures: 0, Errors: 1, Skipped: 0, Time elapsed: 11.292 sec
<<< FAILURE!
--
Running org.apache.activemq.transport.stomp.StompSubscriptionRemoveTest
Tests run: 1, Failures: 0, Errors: 1, Skipped: 0, Time elapsed: 0.66 sec <<<
FAILURE!
--
Running org.apache.activemq.config.ConfigTest
Tests run: 6, Failures: 0, Errors: 5, Skipped: 0, Time elapsed: 28.354 sec
<<< FAILURE!
--
Running
org.apache.activemq.test.JmsTopicSendReceiveWithTwoConnectionsAndEmbeddedBrokerTest
Tests run: 1, Failures: 0, Errors: 1, Skipped: 0, Time elapsed: 0.53 sec <<<
FAILURE!
Running org.apache.activemq.broker.ft.QueueMasterSlaveTest
Tests run: 1, Failures: 0, Errors: 1, Skipped: 0, Time elapsed: 0.427 sec
<<< FAILURE!
--
Running org.apache.activemq.usecases.MultiBrokersMultiClientsUsingTcpTest
Tests run: 2, Failures: 0, Errors: 2, Skipped: 0, Time elapsed: 0.074 sec
<<< FAILURE!
--
Running org.apache.activemq.transport.failover.FailoverUriTest
Tests run: 3, Failures: 0, Errors: 3, Skipped: 0, Time elapsed: 0.168 sec
<<< FAILURE!
--
Running org.apache.activemq.broker.jmx.MBeanTest
Tests run: 3, Failures: 0, Errors: 3, Skipped: 0, Time elapsed: 0.109 sec
<<< FAILURE!
--
Running
org.apache.activemq.test.JmsTopicSendReceiveWithEmbeddedBrokerAndUserIDTest
Tests run: 1, Failures: 0, Errors: 1, Skipped: 0, Time elapsed: 1.36 sec <<<
FAILURE!
--
Running org.apache.activemq.broker.ft.TransactedTopicMasterSlaveTest
Tests run: 13, Failures: 0, Errors: 13, Skipped: 0, Time elapsed: 0.164 sec
<<< FAILURE!
--
Running org.apache.activemq.bugs.SlowConsumerTest

Tests run: 1, Failures: 0, Errors: 1, Skipped: 0, Time elapsed: 0.394 sec
<<< FAILURE!
--
Running org.apache.activemq.bugs.CraigsBugTest
Tests run: 1, Failures: 0, Errors: 1, Skipped: 0, Time elapsed: 0.087 sec
<<< FAILURE!
--
Running org.apache.activemq.transport.tcp.InactivityMonitorTest
Tests run: 3, Failures: 0, Errors: 2, Skipped: 0, Time elapsed: 0.215 sec
<<< FAILURE!
--
Running org.apache.activemq.transport.TopicClusterTest
Tests run: 1, Failures: 0, Errors: 1, Skipped: 0, Time elapsed: 0.05 sec <<<
FAILURE!
--
Running org.apache.activemq.usecases.DurableConsumerCloseAndReconnectTest
Tests run: 1, Failures: 0, Errors: 1, Skipped: 0, Time elapsed: 0.162 sec
<<< FAILURE!
--
Running org.apache.activemq.bugs.DurableConsumerTest
Tests run: 1, Failures: 0, Errors: 1, Skipped: 0, Time elapsed: 0.054 sec
<<< FAILURE!
--
Running org.apache.activemq.broker.MessageExpirationTest
Tests run: 20, Failures: 2, Errors: 0, Skipped: 0, Time elapsed: 52.809 sec
<<< FAILURE!
--
Running org.apache.activemq.usecases.AMQStackOverFlowTest
Tests run: 1, Failures: 0, Errors: 1, Skipped: 0, Time elapsed: 0.315 sec
<<< FAILURE!
--
Running org.apache.activemq.broker.SpringTest
Tests run: 1, Failures: 0, Errors: 1, Skipped: 0, Time elapsed: 0.757 sec
<<< FAILURE!
--
Running org.apache.activemq.broker.jmx.PurgeTest
Tests run: 1, Failures: 0, Errors: 1, Skipped: 0, Time elapsed: 0.128 sec
<<< FAILURE!
--
Running
org.apache.activemq.usecases.PublishOnQueueConsumedMessageUsingActivemqXMLTest
Tests run: 1, Failures: 0, Errors: 1, Skipped: 0, Time elapsed: 8.497 sec
<<< FAILURE!
--
Running org.apache.activemq.ZeroPrefetchConsumerTest
Tests run: 6, Failures: 0, Errors: 6, Skipped: 0, Time elapsed: 0.151 sec
<<< FAILURE!
--
Running
org.apache.activemq.JmsQueueSendReceiveTwoConnectionsStartBeforeBrokerTest
Tests run: 1, Failures: 0, Errors: 1, Skipped: 0, Time elapsed: 10.949 sec
<<< FAILURE!
--
Running org.apache.activemq.test.message.NestedMapMessageTest
Tests run: 1, Failures: 0, Errors: 1, Skipped: 0, Time elapsed: 0.745 sec
<<< FAILURE!
Running org.apache.activemq.transport.tcp.SslTransportFactoryTest
Tests run: 2, Failures: 1, Errors: 0, Skipped: 0, Time elapsed: 0.342 sec
<<< FAILURE!
--
[INFO]
------------------------------------------------------------------------
[ERROR] BUILD FAILURE


Most of these appear to be network related.  I am inspecting the hardware to
see if anything is amiss.

~tom



-- 
View this message in context: http://www.nabble.com/Async-error-occurred%3A-java.lang.IllegalStateException%3A-With-Pure-Master-Slave-tp15760909s2354p16048129.html
Sent from the ActiveMQ - User mailing list archive at Nabble.com.


Mime
View raw message