activemq-dev mailing list archives

Site index · List index
Message view « Date » · « Thread »
Top « Date » · « Thread »
From Chalaka Chamupathi Sudusinghe <>
Subject Build error
Date Tue, 21 Jun 2016 19:23:34 GMT

i was trying to build the Activemq artemis project but

i had following error in the test ,
Running org.apache.activemq.ra.MDBTest
Tests run: 10, Failures: 3, Errors: 0, Skipped: 0, Time elapsed:
51.729 sec <<< FAILURE! - in org.apache.activemq.ra.MDBTest
testMessageExceptionReDelivery(org.apache.activemq.ra.MDBTest)  Time
elapsed: 1.022 sec  <<< FAILURE!
java.lang.AssertionError: Delivery policy delay not working
    at org.junit.Assert.assertTrue(
    at org.junit.Assert.assertFalse(
    at org.apache.activemq.ra.MDBTest.testMessageExceptionReDelivery(

Time elapsed: 31.054 sec  <<< FAILURE!
java.lang.AssertionError: Got 5
    at org.junit.Assert.assertTrue(
    at org.apache.activemq.ra.MDBTest.testOrderOfMessageExceptionReDelivery(

testXaTimeoutRedelivery(org.apache.activemq.ra.MDBTest)  Time elapsed:
11.012 sec  <<< FAILURE!
    at org.junit.Assert.assertTrue(
    at org.junit.Assert.assertTrue(
    at org.apache.activemq.ra.MDBTest.testXaTimeoutRedelivery(

Failed tests:
  MDBTest.testMessageExceptionReDelivery:705 Delivery policy delay not working
  MDBTest.testOrderOfMessageExceptionReDelivery:798 Got 5
  MDBTest.testXaTimeoutRedelivery:899 "

i google the error and unable to find solution, i am new to this and
please help me to fix the error.

Thanks and Regards,

Chalaka Chamupathi Sudusinghe

Undergraduate at University of Peradeniya Faculty of Engineering.

Email     :
Linkedin :
Blog       :
Github    :

View raw message