activemq-dev mailing list archives

Site index · List index
Message view « Date » · « Thread »
Top « Date » · « Thread »
From Hadrian Zbarcea <hzbar...@gmail.com>
Subject Re: [VOTE] Apache ActiveMQ 5.11.0
Date Mon, 29 Dec 2014 19:57:12 GMT
-1.

Sigs look good.
Downloaded and started a full build from the source distribution.
Tests fail when run from the source distribution, see below.
Does anybody else experience the same result?

We should consider moving the source distribution to apache-activemq.
The current activemq-parent name is not the best choice.

Happy New Year,
Hadrian


[INFO] Reactor Summary:
[INFO]
[INFO] ActiveMQ .......................................... SUCCESS [1.339s]
[INFO] ActiveMQ :: Openwire Generator .................... SUCCESS [2.083s]
[INFO] ActiveMQ :: Client ................................ SUCCESS 
[1:29.718s]
[INFO] ActiveMQ :: Openwire Legacy Support ............... SUCCESS [0.961s]
[INFO] ActiveMQ :: JAAS .................................. SUCCESS [17.388s]
[INFO] ActiveMQ :: Broker ................................ SUCCESS 
[1:11.509s]
[INFO] ActiveMQ :: KahaDB Store .......................... SUCCESS [58.751s]
[INFO] ActiveMQ :: STOMP Protocol ........................ SUCCESS 
[16:37.557s]
[INFO] ActiveMQ :: MQTT Protocol ......................... SUCCESS 
[12:21.155s]
[INFO] ActiveMQ :: JDBC Store ............................ SUCCESS [0.214s]
[INFO] ActiveMQ :: LevelDB Store ......................... FAILURE 
[3:17.131s]
[INFO] ActiveMQ :: Generic JMS Pool ...................... SUCCESS 
[1:28.535s]
[INFO] ActiveMQ :: Pool .................................. SUCCESS [1.250s]
[INFO] ActiveMQ :: RA .................................... SUCCESS 
[2:15.452s]
[INFO] ActiveMQ :: Spring ................................ SKIPPED
[INFO] ActiveMQ :: AMQP .................................. SKIPPED
[INFO] ActiveMQ :: Console ............................... SUCCESS [0.487s]
[INFO] ActiveMQ :: Partition Management .................. SKIPPED
[INFO] ActiveMQ :: Unit Tests ............................ SKIPPED
[INFO] ActiveMQ :: Camel ................................. SKIPPED
[INFO] ActiveMQ :: HTTP Protocol Support ................. SKIPPED
[INFO] ActiveMQ :: All JAR bundle ........................ SKIPPED
[INFO] ActiveMQ :: File Server ........................... SKIPPED
[INFO] ActiveMQ :: Log4j Appender ........................ SUCCESS [2.656s]
[INFO] ActiveMQ :: Apache Karaf .......................... SKIPPED
[INFO] ActiveMQ :: RAR ................................... SKIPPED
[INFO] ActiveMQ :: Run Jar ............................... SUCCESS [0.224s]
[INFO] ActiveMQ :: Shiro ................................. SKIPPED
[INFO] ActiveMQ :: Runtime Configuration ................. SKIPPED
[INFO] ActiveMQ :: Tooling ............................... SUCCESS [0.011s]
[INFO] ActiveMQ :: Memory Usage Test Plugin .............. SUCCESS [0.896s]
[INFO] ActiveMQ :: Performance Test Plugin ............... SKIPPED
[INFO] ActiveMQ :: StartUp/Stop Plugin ................... SKIPPED
[INFO] ActiveMQ :: Web ................................... SKIPPED
[INFO] ActiveMQ :: OSGi bundle ........................... SKIPPED
[INFO] ActiveMQ :: Blueprint ............................. SUCCESS [0.599s]
[INFO] ActiveMQ :: Web Demo .............................. SKIPPED
[INFO] ActiveMQ :: Web Console ........................... SKIPPED
[INFO] ActiveMQ :: Karaf Integration Tests ............... SKIPPED
[INFO] ActiveMQ :: Integration Test :: Spring 3.1 ........ SKIPPED
[INFO] ActiveMQ :: Assembly .............................. SKIPPED
[INFO] 
------------------------------------------------------------------------
[INFO] BUILD FAILURE
[INFO] 
------------------------------------------------------------------------
[INFO] Total time: 40:09.096s
[INFO] Finished at: Mon Dec 29 12:30:47 EST 2014
[INFO] Final Memory: 69M/472M
[INFO] 
------------------------------------------------------------------------
[ERROR] Failed to execute goal 
org.apache.maven.plugins:maven-surefire-plugin:2.16:test (default-test) 
on project activemq-leveldb-store: There are test failure
[ERROR]
[ERROR] Please refer to 
/home/hadrian/dev/apache/release/activemq-parent-5.11.0/activemq-leveldb-store/target/surefire-reports

for the individual test results.
[ERROR] -> [Help 1]


On 12/29/2014 09:26 AM, Dejan Bosanac wrote:
> Hi folks,
>
> I've just cut a release candidate for the long-awaited 5.11.0 release. This
> release has
> 127 bug fixes and improvements.
>
> Could you review the artifacts and vote? Especially, it would be great if
> you could test unix shell script and make sure there's no any regressions
> on the platform you're using.
>
> The list of resolved issues is here:
> https://issues.apache.org/jira/secure/ReleaseNote.jspa?projectId=12311210&version=12324951
>
> You can get binary distributions here:
> https://repository.apache.org/content/repositories/orgapacheactivemq-1012/org/apache/activemq/apache-activemq/5.11.0/
>
> Source archives are here:
> https://repository.apache.org/content/repositories/orgapacheactivemq-1012/org/apache/activemq/activemq-parent/5.11.0/
>
> Maven2 repository is at:
> https://repository.apache.org/content/repositories/orgapacheactivemq-1012/
>
> Source tag:
> https://git-wip-us.apache.org/repos/asf?p=activemq.git;a=commit;h=48b0cf396c18216899ceb94ee57c01685104223d
>
>
> Please vote to approve this release. As it's the holiday season, I'll let
> this vote open for longer time than usual, so everybody get the chance to
> review it.
>
> [ ] +1 Release the binary as Apache ActiveMQ 5.11.0
> [ ] -1 Veto the release (provide specific comments)
>
> Here's my +1
>
> Regards
> --
> Dejan Bosanac
> ----------------------
> Red Hat, Inc.
> dbosanac@redhat.com
> Twitter: @dejanb
> Blog: http://sensatic.net
> ActiveMQ in Action: http://www.manning.com/snyder/
>


Mime
View raw message