activemq-dev mailing list archives

Site index · List index
Message view « Date » · « Thread »
Top « Date » · « Thread »
From Apache Jenkins Server <jenk...@builds.apache.org>
Subject Build failed in Jenkins: ActiveMQ » ActiveMQ :: Unit Tests #1565
Date Thu, 11 Dec 2014 05:59:22 GMT
See <https://builds.apache.org/job/ActiveMQ/org.apache.activemq$activemq-unit-tests/1565/>

------------------------------------------
[...truncated 1097 lines...]
[04:24:35] Tests run: 1, Failures: 0, Errors: 0, Skipped: 0, Time elapsed: 3.115 sec - in
org.apache.activemq.bugs.AMQ3145Test
[04:24:35] Running org.apache.activemq.bugs.AMQ3157Test
[04:24:47] Tests run: 1, Failures: 0, Errors: 0, Skipped: 0, Time elapsed: 11.184 sec - in
org.apache.activemq.bugs.AMQ3157Test
[04:24:47] Running org.apache.activemq.bugs.AMQ3167Test
[04:25:04] Tests run: 1, Failures: 0, Errors: 0, Skipped: 0, Time elapsed: 16.811 sec - in
org.apache.activemq.bugs.AMQ3167Test
[04:25:04] Running org.apache.activemq.bugs.AMQ3274Test
[04:25:06] Tests run: 1, Failures: 0, Errors: 0, Skipped: 0, Time elapsed: 1.684 sec - in
org.apache.activemq.bugs.AMQ3274Test
[04:25:06] Running org.apache.activemq.bugs.AMQ3324Test
[04:25:11] Tests run: 1, Failures: 0, Errors: 0, Skipped: 0, Time elapsed: 4.372 sec - in
org.apache.activemq.bugs.AMQ3324Test
[04:25:11] Running org.apache.activemq.bugs.AMQ3352Test
[04:25:17] Tests run: 1, Failures: 0, Errors: 0, Skipped: 0, Time elapsed: 5.157 sec - in
org.apache.activemq.bugs.AMQ3352Test
[04:25:17] Running org.apache.activemq.bugs.AMQ3405Test
[04:25:21] Tests run: 1, Failures: 0, Errors: 0, Skipped: 0, Time elapsed: 3.315 sec - in
org.apache.activemq.bugs.AMQ3405Test
[04:25:21] Running org.apache.activemq.bugs.AMQ3436Test
[04:35:21] Running org.apache.activemq.bugs.AMQ3445Test
[04:35:31] Tests run: 1, Failures: 0, Errors: 1, Skipped: 0, Time elapsed: 9.823 sec <<<
FAILURE! - in org.apache.activemq.bugs.AMQ3445Test
[04:35:31] testJDBCRetiansDestinationAfterRestart(org.apache.activemq.bugs.AMQ3445Test)  Time
elapsed: 9.741 sec  <<< ERROR!
[04:35:31] java.lang.reflect.UndeclaredThrowableException: null
[04:35:31] 	at com.sun.jmx.interceptor.DefaultMBeanServerInterceptor.getMBean(DefaultMBeanServerInterceptor.java:1095)
[04:35:31] 	at com.sun.jmx.interceptor.DefaultMBeanServerInterceptor.getAttribute(DefaultMBeanServerInterceptor.java:643)
[04:35:31] 	at com.sun.jmx.mbeanserver.JmxMBeanServer.getAttribute(JmxMBeanServer.java:678)
[04:35:31] 	at javax.management.MBeanServerInvocationHandler.invoke(MBeanServerInvocationHandler.java:267)
[04:35:31] 	at com.sun.proxy.$Proxy8.getQueueSize(Unknown Source)
[04:35:31] 	at org.apache.activemq.bugs.AMQ3445Test.testJDBCRetiansDestinationAfterRestart(AMQ3445Test.java:96)
[04:35:31] 
[04:35:32] Running org.apache.activemq.bugs.AMQ3454Test
[04:35:38] Tests run: 1, Failures: 0, Errors: 0, Skipped: 0, Time elapsed: 6.001 sec - in
org.apache.activemq.bugs.AMQ3454Test
[04:35:39] Running org.apache.activemq.bugs.AMQ3465Test
[04:35:40] Tests run: 2, Failures: 0, Errors: 0, Skipped: 0, Time elapsed: 1.074 sec - in
org.apache.activemq.bugs.AMQ3465Test
[04:35:41] Running org.apache.activemq.bugs.AMQ3529Test
[04:35:49] Tests run: 1, Failures: 0, Errors: 0, Skipped: 0, Time elapsed: 7.763 sec - in
org.apache.activemq.bugs.AMQ3529Test
[04:35:49] Running org.apache.activemq.bugs.AMQ3537Test
[04:35:49] Tests run: 1, Failures: 0, Errors: 0, Skipped: 0, Time elapsed: 0.239 sec - in
org.apache.activemq.bugs.AMQ3537Test
[04:35:49] Running org.apache.activemq.bugs.AMQ3567Test
[04:37:32] Tests run: 1, Failures: 0, Errors: 0, Skipped: 0, Time elapsed: 102.567 sec - in
org.apache.activemq.bugs.AMQ3567Test
[04:37:33] Running org.apache.activemq.bugs.AMQ3622Test
[04:37:36] Tests run: 1, Failures: 0, Errors: 0, Skipped: 0, Time elapsed: 3.112 sec - in
org.apache.activemq.bugs.AMQ3622Test
[04:37:36] Running org.apache.activemq.bugs.AMQ3625Test
[04:37:50] Tests run: 1, Failures: 0, Errors: 0, Skipped: 0, Time elapsed: 13.214 sec - in
org.apache.activemq.bugs.AMQ3625Test
[04:37:50] Running org.apache.activemq.bugs.AMQ3674Test
[04:37:51] Tests run: 1, Failures: 0, Errors: 0, Skipped: 0, Time elapsed: 1.133 sec - in
org.apache.activemq.bugs.AMQ3674Test
[04:37:52] Running org.apache.activemq.bugs.AMQ3675Test
[04:37:54] Tests run: 1, Failures: 0, Errors: 0, Skipped: 0, Time elapsed: 2.158 sec - in
org.apache.activemq.bugs.AMQ3675Test
[04:37:55] Running org.apache.activemq.bugs.AMQ3678Test
[04:37:56] Tests run: 1, Failures: 0, Errors: 0, Skipped: 0, Time elapsed: 1.266 sec - in
org.apache.activemq.bugs.AMQ3678Test
[04:37:57] Running org.apache.activemq.bugs.AMQ3732Test
[04:39:57] Tests run: 1, Failures: 0, Errors: 0, Skipped: 0, Time elapsed: 120.061 sec - in
org.apache.activemq.bugs.AMQ3732Test
[04:39:57] Running org.apache.activemq.bugs.AMQ3779Test
[04:39:59] Tests run: 1, Failures: 0, Errors: 0, Skipped: 0, Time elapsed: 1.66 sec - in org.apache.activemq.bugs.AMQ3779Test
[04:40:00] Running org.apache.activemq.bugs.AMQ3841Test
[04:40:03] Tests run: 1, Failures: 0, Errors: 0, Skipped: 0, Time elapsed: 3.233 sec - in
org.apache.activemq.bugs.AMQ3841Test
[04:40:04] Running org.apache.activemq.bugs.AMQ3879Test
[04:40:05] Tests run: 1, Failures: 0, Errors: 0, Skipped: 0, Time elapsed: 1.459 sec - in
org.apache.activemq.bugs.AMQ3879Test
[04:40:05] Running org.apache.activemq.bugs.AMQ3903Test
[04:40:06] Tests run: 2, Failures: 0, Errors: 0, Skipped: 0, Time elapsed: 0.938 sec - in
org.apache.activemq.bugs.AMQ3903Test
[04:40:07] Running org.apache.activemq.bugs.AMQ3932Test
[04:40:28] Tests run: 3, Failures: 0, Errors: 0, Skipped: 0, Time elapsed: 21.114 sec - in
org.apache.activemq.bugs.AMQ3932Test
[04:40:28] Running org.apache.activemq.bugs.AMQ3934Test
[04:40:29] Tests run: 1, Failures: 0, Errors: 0, Skipped: 0, Time elapsed: 1.186 sec - in
org.apache.activemq.bugs.AMQ3934Test
[04:40:30] Running org.apache.activemq.bugs.AMQ3961Test
[04:40:35] Tests run: 1, Failures: 0, Errors: 0, Skipped: 0, Time elapsed: 5.015 sec - in
org.apache.activemq.bugs.AMQ3961Test
[04:40:36] Running org.apache.activemq.bugs.AMQ3992Test
[04:40:40] Tests run: 1, Failures: 0, Errors: 0, Skipped: 0, Time elapsed: 4.21 sec - in org.apache.activemq.bugs.AMQ3992Test
[04:40:41] Running org.apache.activemq.bugs.AMQ4062Test
[04:40:47] Tests run: 1, Failures: 0, Errors: 0, Skipped: 0, Time elapsed: 6.142 sec - in
org.apache.activemq.bugs.AMQ4062Test
[04:40:47] Running org.apache.activemq.bugs.AMQ4083Test
[04:41:43] Tests run: 6, Failures: 1, Errors: 0, Skipped: 0, Time elapsed: 55.75 sec <<<
FAILURE! - in org.apache.activemq.bugs.AMQ4083Test
[04:41:43] testExpiredMsgsBeforeNonExpiredWithTX(org.apache.activemq.bugs.AMQ4083Test)  Time
elapsed: 10.147 sec  <<< FAILURE!
[04:41:43] java.lang.AssertionError: expected:<0> but was:<-100>
[04:41:43] 	at org.junit.Assert.fail(Assert.java:88)
[04:41:43] 	at org.junit.Assert.failNotEquals(Assert.java:743)
[04:41:43] 	at org.junit.Assert.assertEquals(Assert.java:118)
[04:41:43] 	at org.junit.Assert.assertEquals(Assert.java:555)
[04:41:43] 	at org.junit.Assert.assertEquals(Assert.java:542)
[04:41:43] 	at org.apache.activemq.bugs.AMQ4083Test.testExpiredMsgsBeforeNonExpiredWithTX(AMQ4083Test.java:185)
[04:41:43] 
[04:41:44] Running org.apache.activemq.bugs.AMQ4116Test
[04:41:45] Tests run: 2, Failures: 0, Errors: 0, Skipped: 0, Time elapsed: 1.358 sec - in
org.apache.activemq.bugs.AMQ4116Test
[04:41:46] Running org.apache.activemq.bugs.AMQ4126Test
[04:41:59] Tests run: 9, Failures: 0, Errors: 0, Skipped: 0, Time elapsed: 13.08 sec - in
org.apache.activemq.bugs.AMQ4126Test
[04:41:59] Running org.apache.activemq.bugs.AMQ4133Test
[04:42:10] Tests run: 4, Failures: 0, Errors: 0, Skipped: 0, Time elapsed: 10.191 sec - in
org.apache.activemq.bugs.AMQ4133Test
[04:42:10] Running org.apache.activemq.bugs.AMQ4147Test
[04:42:20] Tests run: 2, Failures: 0, Errors: 0, Skipped: 0, Time elapsed: 10.563 sec - in
org.apache.activemq.bugs.AMQ4147Test
[04:42:21] Running org.apache.activemq.bugs.AMQ4148Test
[04:42:32] Tests run: 1, Failures: 0, Errors: 0, Skipped: 0, Time elapsed: 11.147 sec - in
org.apache.activemq.bugs.AMQ4148Test
[04:42:33] Running org.apache.activemq.bugs.AMQ4157Test
[04:42:42] Tests run: 1, Failures: 0, Errors: 0, Skipped: 0, Time elapsed: 9.456 sec - in
org.apache.activemq.bugs.AMQ4157Test
[04:42:43] Running org.apache.activemq.bugs.AMQ4160Test
[04:43:27] Tests run: 3, Failures: 0, Errors: 0, Skipped: 0, Time elapsed: 44.328 sec - in
org.apache.activemq.bugs.AMQ4160Test
[04:43:28] Running org.apache.activemq.bugs.AMQ4212Test
[04:53:28] Running org.apache.activemq.bugs.AMQ4213Test
[04:53:29] Tests run: 1, Failures: 0, Errors: 0, Skipped: 0, Time elapsed: 1.062 sec - in
org.apache.activemq.bugs.AMQ4213Test
[04:53:30] Running org.apache.activemq.bugs.AMQ4220Test
[04:53:32] Tests run: 1, Failures: 0, Errors: 0, Skipped: 0, Time elapsed: 2.377 sec - in
org.apache.activemq.bugs.AMQ4220Test
[04:53:33] Running org.apache.activemq.bugs.AMQ4221Test
[04:54:05] Running org.apache.activemq.bugs.AMQ4222Test
[04:54:06] Tests run: 1, Failures: 0, Errors: 0, Skipped: 0, Time elapsed: 1.117 sec - in
org.apache.activemq.bugs.AMQ4222Test
[04:54:07] Running org.apache.activemq.bugs.AMQ4323Test
[04:54:34] Tests run: 1, Failures: 0, Errors: 0, Skipped: 0, Time elapsed: 26.678 sec - in
org.apache.activemq.bugs.AMQ4323Test
[04:54:34] Running org.apache.activemq.bugs.AMQ4356Test
[04:54:38] Tests run: 1, Failures: 0, Errors: 0, Skipped: 0, Time elapsed: 3.829 sec - in
org.apache.activemq.bugs.AMQ4356Test
[04:54:39] Running org.apache.activemq.bugs.AMQ4361Test
[04:54:43] Tests run: 1, Failures: 0, Errors: 0, Skipped: 0, Time elapsed: 4.096 sec - in
org.apache.activemq.bugs.AMQ4361Test
[04:54:43] Running org.apache.activemq.bugs.AMQ4368Test
[05:04:43] Running org.apache.activemq.bugs.AMQ4407Test
[05:04:46] Tests run: 1, Failures: 0, Errors: 0, Skipped: 0, Time elapsed: 3.395 sec - in
org.apache.activemq.bugs.AMQ4407Test
[05:04:47] Running org.apache.activemq.bugs.AMQ4413Test
[05:04:54] Tests run: 1, Failures: 0, Errors: 0, Skipped: 0, Time elapsed: 7.042 sec - in
org.apache.activemq.bugs.AMQ4413Test
[05:04:54] Running org.apache.activemq.bugs.AMQ4469Test
[05:05:00] Tests run: 1, Failures: 0, Errors: 0, Skipped: 0, Time elapsed: 5.843 sec - in
org.apache.activemq.bugs.AMQ4469Test
[05:05:01] Running org.apache.activemq.bugs.AMQ4472Test
[05:05:03] Tests run: 1, Failures: 0, Errors: 0, Skipped: 0, Time elapsed: 1.965 sec - in
org.apache.activemq.bugs.AMQ4472Test
[05:05:03] Running org.apache.activemq.bugs.AMQ4475Test
[05:05:08] Tests run: 1, Failures: 0, Errors: 0, Skipped: 0, Time elapsed: 4.648 sec - in
org.apache.activemq.bugs.AMQ4475Test
[05:05:08] Running org.apache.activemq.bugs.AMQ4485LowLimitLevelDBTest
[05:06:22] Tests run: 1, Failures: 0, Errors: 0, Skipped: 0, Time elapsed: 73.046 sec - in
org.apache.activemq.bugs.AMQ4485LowLimitLevelDBTest
[05:06:22] Running org.apache.activemq.bugs.AMQ4485LowLimitTest
[05:09:42] Tests run: 1, Failures: 0, Errors: 0, Skipped: 0, Time elapsed: 199.992 sec - in
org.apache.activemq.bugs.AMQ4485LowLimitTest
[05:09:43] Running org.apache.activemq.bugs.AMQ4485NetworkOfXBrokersWithNDestsFanoutTransactionTest
[05:11:35] Tests run: 1, Failures: 0, Errors: 0, Skipped: 0, Time elapsed: 112.411 sec - in
org.apache.activemq.bugs.AMQ4485NetworkOfXBrokersWithNDestsFanoutTransactionTest
[05:11:35] Running org.apache.activemq.bugs.AMQ4485Test
[05:11:47] Tests run: 1, Failures: 0, Errors: 0, Skipped: 0, Time elapsed: 11.183 sec - in
org.apache.activemq.bugs.AMQ4485Test
[05:11:47] Running org.apache.activemq.bugs.AMQ4487Test
[05:12:04] Tests run: 2, Failures: 0, Errors: 0, Skipped: 0, Time elapsed: 17.088 sec - in
org.apache.activemq.bugs.AMQ4487Test
[05:12:05] Running org.apache.activemq.bugs.AMQ4504Test
[05:12:07] Tests run: 1, Failures: 0, Errors: 0, Skipped: 0, Time elapsed: 2.32 sec - in org.apache.activemq.bugs.AMQ4504Test
[05:12:08] Running org.apache.activemq.bugs.AMQ4513Test
[05:12:33] Tests run: 1, Failures: 0, Errors: 0, Skipped: 0, Time elapsed: 25.23 sec - in
org.apache.activemq.bugs.AMQ4513Test
[05:12:34] Running org.apache.activemq.bugs.AMQ4517Test
[05:12:35] Tests run: 1, Failures: 0, Errors: 0, Skipped: 0, Time elapsed: 1.683 sec - in
org.apache.activemq.bugs.AMQ4517Test
[05:12:36] Running org.apache.activemq.bugs.AMQ4518Test
[05:12:38] Tests run: 1, Failures: 0, Errors: 0, Skipped: 0, Time elapsed: 1.719 sec - in
org.apache.activemq.bugs.AMQ4518Test
[05:12:38] Running org.apache.activemq.bugs.AMQ4530Test
[05:12:39] Tests run: 1, Failures: 0, Errors: 0, Skipped: 0, Time elapsed: 1.19 sec - in org.apache.activemq.bugs.AMQ4530Test
[05:12:40] Running org.apache.activemq.bugs.AMQ4531Test
[05:12:41] Tests run: 1, Failures: 0, Errors: 0, Skipped: 0, Time elapsed: 1.045 sec - in
org.apache.activemq.bugs.AMQ4531Test
[05:12:42] Running org.apache.activemq.bugs.AMQ4554Test
[05:12:43] Tests run: 1, Failures: 0, Errors: 0, Skipped: 0, Time elapsed: 1.109 sec - in
org.apache.activemq.bugs.AMQ4554Test
[05:12:44] Running org.apache.activemq.bugs.AMQ4582Test
[05:12:45] Tests run: 1, Failures: 0, Errors: 0, Skipped: 0, Time elapsed: 1.147 sec - in
org.apache.activemq.bugs.AMQ4582Test
[05:12:45] Running org.apache.activemq.bugs.AMQ4595Test
[05:20:29] Tests run: 3, Failures: 0, Errors: 2, Skipped: 0, Time elapsed: 464.059 sec <<<
FAILURE! - in org.apache.activemq.bugs.AMQ4595Test
[05:20:29] testBrowsingLargeBatch(org.apache.activemq.bugs.AMQ4595Test)  Time elapsed: 300.93
sec  <<< ERROR!
[05:20:29] java.lang.Exception: test timed out after 300000 milliseconds
[05:20:29] 	at java.lang.Object.wait(Native Method)
[05:20:29] 	at org.apache.activemq.ActiveMQQueueBrowser.waitForMessage(ActiveMQQueueBrowser.java:237)
[05:20:29] 	at org.apache.activemq.ActiveMQQueueBrowser.hasMoreElements(ActiveMQQueueBrowser.java:169)
[05:20:29] 	at org.apache.activemq.bugs.AMQ4595Test.doTestBrowsing(AMQ4595Test.java:122)
[05:20:29] 	at org.apache.activemq.bugs.AMQ4595Test.testBrowsingLargeBatch(AMQ4595Test.java:89)
[05:20:29] 
[05:20:29] testBrowsingMediumBatch(org.apache.activemq.bugs.AMQ4595Test)  Time elapsed: 160.923
sec  <<< ERROR!
[05:20:29] java.lang.Exception: test timed out after 160000 milliseconds
[05:20:29] 	at java.lang.Object.wait(Native Method)
[05:20:29] 	at org.apache.activemq.ActiveMQQueueBrowser.waitForMessage(ActiveMQQueueBrowser.java:237)
[05:20:29] 	at org.apache.activemq.ActiveMQQueueBrowser.hasMoreElements(ActiveMQQueueBrowser.java:169)
[05:20:29] 	at org.apache.activemq.bugs.AMQ4595Test.doTestBrowsing(AMQ4595Test.java:122)
[05:20:29] 	at org.apache.activemq.bugs.AMQ4595Test.testBrowsingMediumBatch(AMQ4595Test.java:84)
[05:20:29] 
[05:20:30] Running org.apache.activemq.bugs.AMQ4636Test
[05:20:53] Tests run: 3, Failures: 0, Errors: 0, Skipped: 0, Time elapsed: 23.542 sec - in
org.apache.activemq.bugs.AMQ4636Test
[05:20:54] Running org.apache.activemq.bugs.AMQ4656Test
[05:21:01] Tests run: 2, Failures: 0, Errors: 0, Skipped: 0, Time elapsed: 7.359 sec - in
org.apache.activemq.bugs.AMQ4656Test
[05:21:02] Running org.apache.activemq.bugs.AMQ4671Test
[05:21:03] Tests run: 1, Failures: 0, Errors: 0, Skipped: 0, Time elapsed: 0.855 sec - in
org.apache.activemq.bugs.AMQ4671Test
[05:21:04] Running org.apache.activemq.bugs.AMQ4677Test
[05:21:05] Tests run: 1, Failures: 0, Errors: 1, Skipped: 0, Time elapsed: 1.766 sec <<<
FAILURE! - in org.apache.activemq.bugs.AMQ4677Test
[05:21:05] testSendAndReceiveAllMessages(org.apache.activemq.bugs.AMQ4677Test)  Time elapsed:
1.609 sec  <<< ERROR!
[05:21:05] java.lang.IllegalStateException: Can't find levelDB store name.
[05:21:05] 	at org.apache.activemq.bugs.AMQ4677Test.getLevelDBStoreMBean(AMQ4677Test.java:177)
[05:21:05] 	at org.apache.activemq.bugs.AMQ4677Test.testSendAndReceiveAllMessages(AMQ4677Test.java:94)
[05:21:05] 
[05:21:06] Running org.apache.activemq.bugs.AMQ4853Test
[05:21:07] Tests run: 3, Failures: 0, Errors: 0, Skipped: 2, Time elapsed: 0.749 sec - in
org.apache.activemq.bugs.AMQ4853Test
[05:21:07] Running org.apache.activemq.bugs.AMQ4887Test
[05:21:10] Tests run: 4, Failures: 0, Errors: 0, Skipped: 0, Time elapsed: 3.322 sec - in
org.apache.activemq.bugs.AMQ4887Test
[05:21:11] Running org.apache.activemq.bugs.AMQ4893Test
[05:21:11] Tests run: 4, Failures: 0, Errors: 0, Skipped: 0, Time elapsed: 0.206 sec - in
org.apache.activemq.bugs.AMQ4893Test
[05:21:12] Running org.apache.activemq.bugs.AMQ4899Test
[05:21:18] Tests run: 1, Failures: 0, Errors: 0, Skipped: 0, Time elapsed: 6.602 sec - in
org.apache.activemq.bugs.AMQ4899Test
[05:21:19] Running org.apache.activemq.bugs.AMQ4930Test
[05:21:43] Tests run: 3, Failures: 0, Errors: 0, Skipped: 0, Time elapsed: 23.961 sec - in
org.apache.activemq.bugs.AMQ4930Test
[05:21:44] Running org.apache.activemq.bugs.AMQ4950Test
[05:21:46] Tests run: 1, Failures: 0, Errors: 0, Skipped: 0, Time elapsed: 2.051 sec - in
org.apache.activemq.bugs.AMQ4950Test
[05:21:46] Running org.apache.activemq.bugs.AMQ4952Test
[05:22:31] Tests run: 2, Failures: 0, Errors: 0, Skipped: 0, Time elapsed: 45.106 sec - in
org.apache.activemq.bugs.AMQ4952Test
[05:22:31] Running org.apache.activemq.bugs.AMQ5035Test
[05:22:35] Tests run: 1, Failures: 0, Errors: 0, Skipped: 0, Time elapsed: 3.55 sec - in org.apache.activemq.bugs.AMQ5035Test
[05:22:35] Running org.apache.activemq.bugs.AMQ5136Test
[05:22:37] Tests run: 2, Failures: 0, Errors: 0, Skipped: 0, Time elapsed: 1.171 sec - in
org.apache.activemq.bugs.AMQ5136Test
[05:22:37] Running org.apache.activemq.bugs.AMQ5212Test
[05:23:04] Tests run: 8, Failures: 0, Errors: 0, Skipped: 0, Time elapsed: 26.707 sec - in
org.apache.activemq.bugs.AMQ5212Test
[05:23:05] Running org.apache.activemq.bugs.AMQ5266SingleDestTest
[05:33:05] Running org.apache.activemq.bugs.AMQ5266StarvedConsumerTest
[05:43:05] Running org.apache.activemq.bugs.AMQ5266Test
[05:53:05] Running org.apache.activemq.bugs.AMQ5274Test
[05:53:20] Tests run: 1, Failures: 0, Errors: 0, Skipped: 0, Time elapsed: 15.28 sec - in
org.apache.activemq.bugs.AMQ5274Test
[05:53:21] Running org.apache.activemq.bugs.AMQ5381Test
[05:53:22] Tests run: 1, Failures: 0, Errors: 0, Skipped: 0, Time elapsed: 0.934 sec - in
org.apache.activemq.bugs.AMQ5381Test
[05:53:22] Running org.apache.activemq.bugs.AMQ5421Test
[05:53:34] Tests run: 1, Failures: 0, Errors: 0, Skipped: 0, Time elapsed: 12.441 sec - in
org.apache.activemq.bugs.AMQ5421Test
[05:53:35] Running org.apache.activemq.bugs.AMQ5450Test
[05:53:40] Tests run: 2, Failures: 0, Errors: 0, Skipped: 0, Time elapsed: 4.707 sec - in
org.apache.activemq.bugs.AMQ5450Test
[05:53:40] Running org.apache.activemq.bugs.ActiveMQSlowConsumerManualTest
[05:53:48] Tests run: 4, Failures: 0, Errors: 0, Skipped: 0, Time elapsed: 7.746 sec - in
org.apache.activemq.bugs.ActiveMQSlowConsumerManualTest
[05:53:48] Running org.apache.activemq.bugs.ConnectionPerMessageTest
[05:53:58] Tests run: 1, Failures: 0, Errors: 0, Skipped: 0, Time elapsed: 9.18 sec - in org.apache.activemq.bugs.ConnectionPerMessageTest
[05:53:58] Running org.apache.activemq.bugs.CraigsBugTest
[05:54:02] Tests run: 1, Failures: 0, Errors: 0, Skipped: 0, Time elapsed: 3.992 sec - in
org.apache.activemq.bugs.CraigsBugTest
[05:54:03] Running org.apache.activemq.bugs.DoubleExpireTest
[05:54:05] 
[05:54:05] Results :
[05:54:05] 
[05:54:05] Failed tests: 
[05:54:05]   QueueMbeanRestartTest.testMBeanPresenceOnRestart:84->verifyPresenceOfQueueMbean:107
expected to find matching queue mbean for: queue://org.apache.activemq.broker.QueueMbeanRestartTest.null
[05:54:05]   QueueMbeanRestartTest.testMBeanPresenceOnRestart:84->verifyPresenceOfQueueMbean:107
expected to find matching queue mbean for: queue://org.apache.activemq.broker.QueueMbeanRestartTest.null
[05:54:05]   QueueMbeanRestartTest.testMBeanPresenceOnRestart:84->verifyPresenceOfQueueMbean:107
expected to find matching queue mbean for: queue://org.apache.activemq.broker.QueueMbeanRestartTest.null
[05:54:05]   DbRestartJDBCQueueMasterSlaveLeaseQuiesceTest>CombinationTestSupport.runBare:113->CombinationTestSupport.runBare:107->QueueMasterSlaveTestSupport.testVirtualTopicFailover:132
slave started
[05:54:05]   DbRestartJDBCQueueTest>CombinationTestSupport.runBare:113->CombinationTestSupport.runBare:107->JmsSendReceiveTestSupport.testSendReceive:103->JmsSendReceiveTestSupport.assertMessagesAreReceived:126->JmsSendReceiveTestSupport.assertMessagesReceivedAreValid:148
Not enough messages received expected:<100> but was:<25>
[05:54:05]   BrokerViewSlowStoreStartupTest.testBrokerViewOnSlowStoreStart:336 null
[05:54:05]   HealthViewMBeanTest>CombinationTestSupport.runBare:113->CombinationTestSupport.runBare:107->testHealthView:97->assertRegisteredObjectName:113
Could not find MBean!: org.apache.activemq:type=Broker,brokerName=localhost,service=Health
[05:54:05]   MBeanTest>CombinationTestSupport.runBare:113->CombinationTestSupport.runBare:107->testDestinationOptionsAreVisible:988->assertRegisteredObjectName:743
Could not find MBean!: org.apache.activemq:type=Broker,brokerName=localhost,destinationType=Queue,destinationName=QueueWithOptions
[05:54:05]   VirtualTopicsAndDurableSubsTest>CombinationTestSupport.runBare:113->CombinationTestSupport.runBare:107->MBeanTest.testDestinationOptionsAreVisible:988->MBeanTest.assertRegisteredObjectName:743
Could not find MBean!: org.apache.activemq:type=Broker,brokerName=localhost,destinationType=Queue,destinationName=QueueWithOptions
[05:54:05]   AMQ2149LevelDBTest>AMQ2149Test.testQueueTransactionalOrderWithRestart:412->AMQ2149Test.doTestTransactionalOrderWithRestart:435->AMQ2149Test.verifyOrderedMessageReceipt:549
No timeout waiting for senders/receivers to complete
[05:54:05]   AMQ4083Test.testExpiredMsgsBeforeNonExpiredWithTX:185 expected:<0> but
was:<-100>
[05:54:05] 
[05:54:05] Tests in error: 
[05:54:05]   JdbcXARecoveryBrokerTest>CombinationTestSupport.runBare:107->XARecoveryBrokerTest.testPreparedJmxView:107
? UndeclaredThrowable
[05:54:05]   JdbcXARecoveryBrokerTest>CombinationTestSupport.runBare:107->XARecoveryBrokerTest.testQueuePersistentPreparedAcksNotLostOnRestart:685
? UndeclaredThrowable
[05:54:05]   XARecoveryBrokerTest>CombinationTestSupport.runBare:107->testQueuePersistentPreparedAcksNotLostOnRestart:685
? UndeclaredThrowable
[05:54:05]   XARecoveryBrokerTest>CombinationTestSupport.runBare:107->testPreparedJmxView:87
? UndeclaredThrowable
[05:54:05]   mKahaDBXARecoveryBrokerTest>CombinationTestSupport.runBare:107->XARecoveryBrokerTest.testPreparedJmxView:107
? UndeclaredThrowable
[05:54:05]   mKahaDBXARecoveryBrokerTest>CombinationTestSupport.runBare:107->XARecoveryBrokerTest.testQueuePersistentPreparedAcksNotLostOnRestart:685
? UndeclaredThrowable
[05:54:05]   mLevelDBXARecoveryBrokerTest>CombinationTestSupport.runBare:107->XARecoveryBrokerTest.testPreparedJmxView:107
? UndeclaredThrowable
[05:54:05]   mLevelDBXARecoveryBrokerTest>CombinationTestSupport.runBare:107->XARecoveryBrokerTest.testQueuePersistentPreparedAcksNotLostOnRestart:685
? UndeclaredThrowable
[05:54:05]   AMQ2149Test.testQueueTransactionalOrderWithRestart:412->doTestTransactionalOrderWithRestart:425->createBroker:99
? IO
[05:54:05]   AMQ2149Test.testOrderWithRestart:369->createBroker:99 ? IO Failed to bind
to s...
[05:54:05]   AMQ2149Test.testTopicOrderWithRestart:392->createBroker:99 ? IO Failed to
bind...
[05:54:05]   AMQ2149Test.testTopicTransactionalOrderWithRestart:417->doTestTransactionalOrderWithRestart:425->createBroker:99
? IO
[05:54:05]   AMQ2870Test.testSize:120->sendMessage:169 ?  test timed out after 300000 milli...
[05:54:05]   AMQ3445Test.testJDBCRetiansDestinationAfterRestart:96 ? UndeclaredThrowable
[05:54:05]   AMQ4595Test.testBrowsingLargeBatch:89->doTestBrowsing:122->Object.wait:-2
?  t...
[05:54:05]   AMQ4595Test.testBrowsingMediumBatch:84->doTestBrowsing:122->Object.wait:-2
?  ...
[05:54:05]   AMQ4677Test.testSendAndReceiveAllMessages:94->getLevelDBStoreMBean:177 IllegalState
[05:54:05] 
[05:54:05] Tests run: 1609, Failures: 10, Errors: 16, Skipped: 6
[05:54:05] 
[JENKINS] Recording test results
[05:54:09] 

Mime
View raw message