activemq-dev mailing list archives

Site index · List index
Message view « Date » · « Thread »
Top « Date » · « Thread »
From Apache Jenkins Server <jenk...@builds.apache.org>
Subject Build failed in Jenkins: ActiveMQ » ActiveMQ :: Unit Tests #1553
Date Tue, 25 Nov 2014 06:25:09 GMT
See <https://builds.apache.org/job/ActiveMQ/org.apache.activemq$activemq-unit-tests/1553/changes>

Changes:

[gtully] https://issues.apache.org/jira/browse/AMQ-5450 - ensure default any destination is
not chosen in favour of wildcard matches for mKahadb

------------------------------------------
[...truncated 814 lines...]
[05:18:43] Tests run: 1, Failures: 0, Errors: 0, Skipped: 0, Time elapsed: 2.35 sec - in org.apache.activemq.bugs.AMQ4220Test
[05:18:44] Running org.apache.activemq.bugs.AMQ4221Test
[05:19:16] Running org.apache.activemq.bugs.AMQ4222Test
[05:19:17] Tests run: 1, Failures: 0, Errors: 0, Skipped: 0, Time elapsed: 1.13 sec - in org.apache.activemq.bugs.AMQ4222Test
[05:19:18] Running org.apache.activemq.bugs.AMQ4323Test
[05:19:43] Tests run: 1, Failures: 0, Errors: 0, Skipped: 0, Time elapsed: 24.722 sec - in
org.apache.activemq.bugs.AMQ4323Test
[05:19:43] Running org.apache.activemq.bugs.AMQ4356Test
[05:19:47] Tests run: 1, Failures: 0, Errors: 0, Skipped: 0, Time elapsed: 3.583 sec - in
org.apache.activemq.bugs.AMQ4356Test
[05:19:47] Running org.apache.activemq.bugs.AMQ4361Test
[05:19:51] Tests run: 1, Failures: 0, Errors: 0, Skipped: 0, Time elapsed: 4.049 sec - in
org.apache.activemq.bugs.AMQ4361Test
[05:19:52] Running org.apache.activemq.bugs.AMQ4368Test
[05:20:04] Tests run: 1, Failures: 0, Errors: 0, Skipped: 0, Time elapsed: 12.199 sec - in
org.apache.activemq.bugs.AMQ4368Test
[05:20:04] Running org.apache.activemq.bugs.AMQ4407Test
[05:20:07] Tests run: 1, Failures: 0, Errors: 0, Skipped: 0, Time elapsed: 3.16 sec - in org.apache.activemq.bugs.AMQ4407Test
[05:20:08] Running org.apache.activemq.bugs.AMQ4413Test
[05:20:15] Tests run: 1, Failures: 0, Errors: 0, Skipped: 0, Time elapsed: 6.911 sec - in
org.apache.activemq.bugs.AMQ4413Test
[05:20:15] Running org.apache.activemq.bugs.AMQ4469Test
[05:20:21] Tests run: 1, Failures: 0, Errors: 0, Skipped: 0, Time elapsed: 5.877 sec - in
org.apache.activemq.bugs.AMQ4469Test
[05:20:22] Running org.apache.activemq.bugs.AMQ4472Test
[05:20:24] Tests run: 1, Failures: 0, Errors: 0, Skipped: 0, Time elapsed: 1.961 sec - in
org.apache.activemq.bugs.AMQ4472Test
[05:20:24] Running org.apache.activemq.bugs.AMQ4475Test
[05:20:29] Tests run: 1, Failures: 0, Errors: 0, Skipped: 0, Time elapsed: 4.648 sec - in
org.apache.activemq.bugs.AMQ4475Test
[05:20:29] Running org.apache.activemq.bugs.AMQ4485LowLimitLevelDBTest
[05:21:42] Tests run: 1, Failures: 0, Errors: 0, Skipped: 0, Time elapsed: 72.921 sec - in
org.apache.activemq.bugs.AMQ4485LowLimitLevelDBTest
[05:21:43] Running org.apache.activemq.bugs.AMQ4485LowLimitTest
[05:24:42] Tests run: 1, Failures: 0, Errors: 0, Skipped: 0, Time elapsed: 178.914 sec - in
org.apache.activemq.bugs.AMQ4485LowLimitTest
[05:24:42] Running org.apache.activemq.bugs.AMQ4485NetworkOfXBrokersWithNDestsFanoutTransactionTest
[05:26:34] Tests run: 1, Failures: 0, Errors: 0, Skipped: 0, Time elapsed: 111.272 sec - in
org.apache.activemq.bugs.AMQ4485NetworkOfXBrokersWithNDestsFanoutTransactionTest
[05:26:34] Running org.apache.activemq.bugs.AMQ4485Test
[05:26:45] Tests run: 1, Failures: 0, Errors: 0, Skipped: 0, Time elapsed: 11.262 sec - in
org.apache.activemq.bugs.AMQ4485Test
[05:26:46] Running org.apache.activemq.bugs.AMQ4487Test
[05:27:03] Tests run: 2, Failures: 0, Errors: 0, Skipped: 0, Time elapsed: 17.414 sec - in
org.apache.activemq.bugs.AMQ4487Test
[05:27:04] Running org.apache.activemq.bugs.AMQ4504Test
[05:27:06] Tests run: 1, Failures: 0, Errors: 0, Skipped: 0, Time elapsed: 2.324 sec - in
org.apache.activemq.bugs.AMQ4504Test
[05:27:07] Running org.apache.activemq.bugs.AMQ4513Test
[05:27:32] Tests run: 1, Failures: 0, Errors: 0, Skipped: 0, Time elapsed: 25.257 sec - in
org.apache.activemq.bugs.AMQ4513Test
[05:27:33] Running org.apache.activemq.bugs.AMQ4517Test
[05:27:34] Tests run: 1, Failures: 0, Errors: 0, Skipped: 0, Time elapsed: 1.726 sec - in
org.apache.activemq.bugs.AMQ4517Test
[05:27:35] Running org.apache.activemq.bugs.AMQ4518Test
[05:27:37] Tests run: 1, Failures: 0, Errors: 0, Skipped: 0, Time elapsed: 1.728 sec - in
org.apache.activemq.bugs.AMQ4518Test
[05:27:37] Running org.apache.activemq.bugs.AMQ4530Test
[05:27:38] Tests run: 1, Failures: 0, Errors: 0, Skipped: 0, Time elapsed: 1.169 sec - in
org.apache.activemq.bugs.AMQ4530Test
[05:27:39] Running org.apache.activemq.bugs.AMQ4531Test
[05:27:40] Tests run: 1, Failures: 0, Errors: 0, Skipped: 0, Time elapsed: 1.151 sec - in
org.apache.activemq.bugs.AMQ4531Test
[05:27:41] Running org.apache.activemq.bugs.AMQ4554Test
[05:27:42] Tests run: 1, Failures: 0, Errors: 0, Skipped: 0, Time elapsed: 1.095 sec - in
org.apache.activemq.bugs.AMQ4554Test
[05:27:43] Running org.apache.activemq.bugs.AMQ4582Test
[05:27:44] Tests run: 1, Failures: 0, Errors: 0, Skipped: 0, Time elapsed: 1.022 sec - in
org.apache.activemq.bugs.AMQ4582Test
[05:27:44] Running org.apache.activemq.bugs.AMQ4595Test
[05:28:50] Tests run: 3, Failures: 0, Errors: 0, Skipped: 0, Time elapsed: 66.162 sec - in
org.apache.activemq.bugs.AMQ4595Test
[05:28:51] Running org.apache.activemq.bugs.AMQ4636Test
[05:29:12] Tests run: 3, Failures: 0, Errors: 0, Skipped: 0, Time elapsed: 21.161 sec - in
org.apache.activemq.bugs.AMQ4636Test
[05:29:13] Running org.apache.activemq.bugs.AMQ4656Test
[05:29:20] Tests run: 2, Failures: 0, Errors: 0, Skipped: 0, Time elapsed: 7.4 sec - in org.apache.activemq.bugs.AMQ4656Test
[05:29:21] Running org.apache.activemq.bugs.AMQ4671Test
[05:29:22] Tests run: 1, Failures: 0, Errors: 0, Skipped: 0, Time elapsed: 0.962 sec - in
org.apache.activemq.bugs.AMQ4671Test
[05:29:23] Running org.apache.activemq.bugs.AMQ4677Test
[05:30:09] Tests run: 1, Failures: 0, Errors: 0, Skipped: 0, Time elapsed: 45.94 sec - in
org.apache.activemq.bugs.AMQ4677Test
[05:30:10] Running org.apache.activemq.bugs.AMQ4853Test
[05:30:10] Tests run: 3, Failures: 0, Errors: 0, Skipped: 2, Time elapsed: 0.735 sec - in
org.apache.activemq.bugs.AMQ4853Test
[05:30:11] Running org.apache.activemq.bugs.AMQ4887Test
[05:30:14] Tests run: 4, Failures: 0, Errors: 0, Skipped: 0, Time elapsed: 3.181 sec - in
org.apache.activemq.bugs.AMQ4887Test
[05:30:15] Running org.apache.activemq.bugs.AMQ4893Test
[05:30:15] Tests run: 4, Failures: 0, Errors: 0, Skipped: 0, Time elapsed: 0.215 sec - in
org.apache.activemq.bugs.AMQ4893Test
[05:30:16] Running org.apache.activemq.bugs.AMQ4899Test
[05:30:21] Tests run: 1, Failures: 0, Errors: 0, Skipped: 0, Time elapsed: 5.652 sec - in
org.apache.activemq.bugs.AMQ4899Test
[05:30:22] Running org.apache.activemq.bugs.AMQ4930Test
[05:30:46] Tests run: 3, Failures: 0, Errors: 0, Skipped: 0, Time elapsed: 24.271 sec - in
org.apache.activemq.bugs.AMQ4930Test
[05:30:47] Running org.apache.activemq.bugs.AMQ4950Test
[05:30:49] Tests run: 1, Failures: 0, Errors: 0, Skipped: 0, Time elapsed: 1.814 sec - in
org.apache.activemq.bugs.AMQ4950Test
[05:30:49] Running org.apache.activemq.bugs.AMQ4952Test
[05:31:30] Tests run: 2, Failures: 0, Errors: 0, Skipped: 0, Time elapsed: 40.51 sec - in
org.apache.activemq.bugs.AMQ4952Test
[05:31:30] Running org.apache.activemq.bugs.AMQ5035Test
[05:31:34] Tests run: 1, Failures: 0, Errors: 0, Skipped: 0, Time elapsed: 3.482 sec - in
org.apache.activemq.bugs.AMQ5035Test
[05:31:34] Running org.apache.activemq.bugs.AMQ5136Test
[05:31:35] Tests run: 2, Failures: 0, Errors: 0, Skipped: 0, Time elapsed: 1.205 sec - in
org.apache.activemq.bugs.AMQ5136Test
[05:31:36] Running org.apache.activemq.bugs.AMQ5212Test
[05:32:01] Tests run: 8, Failures: 0, Errors: 0, Skipped: 0, Time elapsed: 25.073 sec - in
org.apache.activemq.bugs.AMQ5212Test
[05:32:01] Running org.apache.activemq.bugs.AMQ5266SingleDestTest
[05:42:02] Running org.apache.activemq.bugs.AMQ5266StarvedConsumerTest
[05:48:34] Tests run: 6, Failures: 0, Errors: 2, Skipped: 0, Time elapsed: 392.833 sec <<<
FAILURE! - in org.apache.activemq.bugs.AMQ5266StarvedConsumerTest
[05:48:34] test[#1,000,producerThreads:40,consumerThreads:5,mL:1,048,576,useCache:false,store:JDBC,optimizedDispatch:true](org.apache.activemq.bugs.AMQ5266StarvedConsumerTest)
 Time elapsed: 0.427 sec  <<< ERROR!
[05:48:34] java.io.IOException: Failed to start database 'derbydb' with class loader sun.misc.Launcher$AppClassLoader@37153d,
see the next exception for details.
[05:48:34] 	at org.apache.derby.iapi.error.StandardException.newException(Unknown Source)
[05:48:34] 	at org.apache.derby.impl.store.raw.data.BaseDataFileFactory.privGetJBMSLockOnDB(Unknown
Source)
[05:48:34] 	at org.apache.derby.impl.store.raw.data.BaseDataFileFactory.run(Unknown Source)
[05:48:34] 	at java.security.AccessController.doPrivileged(Native Method)
[05:48:34] 	at org.apache.derby.impl.store.raw.data.BaseDataFileFactory.getJBMSLockOnDB(Unknown
Source)
[05:48:34] 	at org.apache.derby.impl.store.raw.data.BaseDataFileFactory.boot(Unknown Source)
[05:48:34] 	at org.apache.derby.impl.services.monitor.BaseMonitor.boot(Unknown Source)
[05:48:34] 	at org.apache.derby.impl.services.monitor.TopService.bootModule(Unknown Source)
[05:48:34] 	at org.apache.derby.impl.services.monitor.BaseMonitor.startModule(Unknown Source)
[05:48:34] 	at org.apache.derby.iapi.services.monitor.Monitor.bootServiceModule(Unknown Source)
[05:48:34] 	at org.apache.derby.impl.store.raw.RawStore.boot(Unknown Source)
[05:48:34] 	at org.apache.derby.impl.services.monitor.BaseMonitor.boot(Unknown Source)
[05:48:34] 	at org.apache.derby.impl.services.monitor.TopService.bootModule(Unknown Source)
[05:48:34] 	at org.apache.derby.impl.services.monitor.BaseMonitor.startModule(Unknown Source)
[05:48:34] 	at org.apache.derby.iapi.services.monitor.Monitor.bootServiceModule(Unknown Source)
[05:48:34] 	at org.apache.derby.impl.store.access.RAMAccessManager.boot(Unknown Source)
[05:48:34] 	at org.apache.derby.impl.services.monitor.BaseMonitor.boot(Unknown Source)
[05:48:34] 	at org.apache.derby.impl.services.monitor.TopService.bootModule(Unknown Source)
[05:48:34] 	at org.apache.derby.impl.services.monitor.BaseMonitor.startModule(Unknown Source)
[05:48:34] 	at org.apache.derby.iapi.services.monitor.Monitor.bootServiceModule(Unknown Source)
[05:48:34] 	at org.apache.derby.impl.db.BasicDatabase.bootStore(Unknown Source)
[05:48:34] 	at org.apache.derby.impl.db.BasicDatabase.boot(Unknown Source)
[05:48:34] 	at org.apache.derby.impl.services.monitor.BaseMonitor.boot(Unknown Source)
[05:48:34] 	at org.apache.derby.impl.services.monitor.TopService.bootModule(Unknown Source)
[05:48:34] 	at org.apache.derby.impl.services.monitor.BaseMonitor.bootService(Unknown Source)
[05:48:34] 	at org.apache.derby.impl.services.monitor.BaseMonitor.startProviderService(Unknown
Source)
[05:48:34] 	at org.apache.derby.impl.services.monitor.BaseMonitor.findProviderAndStartService(Unknown
Source)
[05:48:34] 	at org.apache.derby.impl.services.monitor.BaseMonitor.startPersistentService(Unknown
Source)
[05:48:34] 	at org.apache.derby.iapi.services.monitor.Monitor.startPersistentService(Unknown
Source)
[05:48:34] 	at org.apache.derby.impl.jdbc.EmbedConnection.bootDatabase(Unknown Source)
[05:48:34] 	at org.apache.derby.impl.jdbc.EmbedConnection.<init>(Unknown Source)
[05:48:34] 	at org.apache.derby.impl.jdbc.EmbedConnection40.<init>(Unknown Source)
[05:48:34] 	at org.apache.derby.jdbc.Driver40.getNewEmbedConnection(Unknown Source)
[05:48:34] 	at org.apache.derby.jdbc.InternalDriver.connect(Unknown Source)
[05:48:34] 	at org.apache.derby.jdbc.EmbeddedBaseDataSource.getConnection(Unknown Source)
[05:48:34] 	at org.apache.derby.jdbc.EmbeddedBaseDataSource.getConnection(Unknown Source)
[05:48:34] 	at org.apache.activemq.store.jdbc.TransactionContext.getConnection(TransactionContext.java:59)
[05:48:34] 	at org.apache.activemq.store.jdbc.JDBCPersistenceAdapter.loadAdapter(JDBCPersistenceAdapter.java:453)
[05:48:34] 	at org.apache.activemq.store.jdbc.JDBCPersistenceAdapter.createAdapter(JDBCPersistenceAdapter.java:436)
[05:48:34] 	at org.apache.activemq.store.jdbc.JDBCPersistenceAdapter.getAdapter(JDBCPersistenceAdapter.java:384)
[05:48:34] 	at org.apache.activemq.store.jdbc.JDBCPersistenceAdapter.deleteAllMessages(JDBCPersistenceAdapter.java:557)
[05:48:34] 	at org.apache.activemq.broker.BrokerService.deleteAllMessages(BrokerService.java:1530)
[05:48:34] 	at org.apache.activemq.broker.BrokerService.doStartPersistenceAdapter(BrokerService.java:640)
[05:48:34] 	at org.apache.activemq.broker.BrokerService.startPersistenceAdapter(BrokerService.java:631)
[05:48:34] 	at org.apache.activemq.broker.BrokerService.start(BrokerService.java:596)
[05:48:34] 	at org.apache.activemq.bugs.AMQ5266StarvedConsumerTest.startBroker(AMQ5266StarvedConsumerTest.java:135)
[05:48:34] 
[05:48:34] test[#500,producerThreads:20,consumerThreads:20,mL:1,048,576,useCache:false,store:JDBC,optimizedDispatch:true](org.apache.activemq.bugs.AMQ5266StarvedConsumerTest)
 Time elapsed: 0.143 sec  <<< ERROR!
[05:48:34] java.io.IOException: Failed to start database 'derbydb' with class loader sun.misc.Launcher$AppClassLoader@37153d,
see the next exception for details.
[05:48:34] 	at org.apache.derby.iapi.error.StandardException.newException(Unknown Source)
[05:48:34] 	at org.apache.derby.impl.store.raw.data.BaseDataFileFactory.privGetJBMSLockOnDB(Unknown
Source)
[05:48:34] 	at org.apache.derby.impl.store.raw.data.BaseDataFileFactory.run(Unknown Source)
[05:48:34] 	at java.security.AccessController.doPrivileged(Native Method)
[05:48:34] 	at org.apache.derby.impl.store.raw.data.BaseDataFileFactory.getJBMSLockOnDB(Unknown
Source)
[05:48:34] 	at org.apache.derby.impl.store.raw.data.BaseDataFileFactory.boot(Unknown Source)
[05:48:34] 	at org.apache.derby.impl.services.monitor.BaseMonitor.boot(Unknown Source)
[05:48:34] 	at org.apache.derby.impl.services.monitor.TopService.bootModule(Unknown Source)
[05:48:34] 	at org.apache.derby.impl.services.monitor.BaseMonitor.startModule(Unknown Source)
[05:48:34] 	at org.apache.derby.iapi.services.monitor.Monitor.bootServiceModule(Unknown Source)
[05:48:34] 	at org.apache.derby.impl.store.raw.RawStore.boot(Unknown Source)
[05:48:34] 	at org.apache.derby.impl.services.monitor.BaseMonitor.boot(Unknown Source)
[05:48:34] 	at org.apache.derby.impl.services.monitor.TopService.bootModule(Unknown Source)
[05:48:34] 	at org.apache.derby.impl.services.monitor.BaseMonitor.startModule(Unknown Source)
[05:48:34] 	at org.apache.derby.iapi.services.monitor.Monitor.bootServiceModule(Unknown Source)
[05:48:34] 	at org.apache.derby.impl.store.access.RAMAccessManager.boot(Unknown Source)
[05:48:34] 	at org.apache.derby.impl.services.monitor.BaseMonitor.boot(Unknown Source)
[05:48:34] 	at org.apache.derby.impl.services.monitor.TopService.bootModule(Unknown Source)
[05:48:34] 	at org.apache.derby.impl.services.monitor.BaseMonitor.startModule(Unknown Source)
[05:48:34] 	at org.apache.derby.iapi.services.monitor.Monitor.bootServiceModule(Unknown Source)
[05:48:34] 	at org.apache.derby.impl.db.BasicDatabase.bootStore(Unknown Source)
[05:48:34] 	at org.apache.derby.impl.db.BasicDatabase.boot(Unknown Source)
[05:48:34] 	at org.apache.derby.impl.services.monitor.BaseMonitor.boot(Unknown Source)
[05:48:34] 	at org.apache.derby.impl.services.monitor.TopService.bootModule(Unknown Source)
[05:48:34] 	at org.apache.derby.impl.services.monitor.BaseMonitor.bootService(Unknown Source)
[05:48:34] 	at org.apache.derby.impl.services.monitor.BaseMonitor.startProviderService(Unknown
Source)
[05:48:34] 	at org.apache.derby.impl.services.monitor.BaseMonitor.findProviderAndStartService(Unknown
Source)
[05:48:34] 	at org.apache.derby.impl.services.monitor.BaseMonitor.startPersistentService(Unknown
Source)
[05:48:34] 	at org.apache.derby.iapi.services.monitor.Monitor.startPersistentService(Unknown
Source)
[05:48:34] 	at org.apache.derby.impl.jdbc.EmbedConnection.bootDatabase(Unknown Source)
[05:48:34] 	at org.apache.derby.impl.jdbc.EmbedConnection.<init>(Unknown Source)
[05:48:34] 	at org.apache.derby.impl.jdbc.EmbedConnection40.<init>(Unknown Source)
[05:48:34] 	at org.apache.derby.jdbc.Driver40.getNewEmbedConnection(Unknown Source)
[05:48:34] 	at org.apache.derby.jdbc.InternalDriver.connect(Unknown Source)
[05:48:34] 	at org.apache.derby.jdbc.EmbeddedBaseDataSource.getConnection(Unknown Source)
[05:48:34] 	at org.apache.derby.jdbc.EmbeddedBaseDataSource.getConnection(Unknown Source)
[05:48:34] 	at org.apache.activemq.store.jdbc.TransactionContext.getConnection(TransactionContext.java:59)
[05:48:34] 	at org.apache.activemq.store.jdbc.JDBCPersistenceAdapter.loadAdapter(JDBCPersistenceAdapter.java:453)
[05:48:34] 	at org.apache.activemq.store.jdbc.JDBCPersistenceAdapter.createAdapter(JDBCPersistenceAdapter.java:436)
[05:48:34] 	at org.apache.activemq.store.jdbc.JDBCPersistenceAdapter.getAdapter(JDBCPersistenceAdapter.java:384)
[05:48:34] 	at org.apache.activemq.store.jdbc.JDBCPersistenceAdapter.deleteAllMessages(JDBCPersistenceAdapter.java:557)
[05:48:34] 	at org.apache.activemq.broker.BrokerService.deleteAllMessages(BrokerService.java:1530)
[05:48:34] 	at org.apache.activemq.broker.BrokerService.doStartPersistenceAdapter(BrokerService.java:640)
[05:48:34] 	at org.apache.activemq.broker.BrokerService.startPersistenceAdapter(BrokerService.java:631)
[05:48:34] 	at org.apache.activemq.broker.BrokerService.start(BrokerService.java:596)
[05:48:34] 	at org.apache.activemq.bugs.AMQ5266StarvedConsumerTest.startBroker(AMQ5266StarvedConsumerTest.java:135)
[05:48:34] 
[05:48:35] Running org.apache.activemq.bugs.AMQ5266Test
[05:58:35] Running org.apache.activemq.bugs.AMQ5274Test
[05:58:50] Tests run: 1, Failures: 0, Errors: 0, Skipped: 0, Time elapsed: 15.254 sec - in
org.apache.activemq.bugs.AMQ5274Test
[05:58:51] Running org.apache.activemq.bugs.AMQ5381Test
[05:58:52] Tests run: 1, Failures: 0, Errors: 0, Skipped: 0, Time elapsed: 0.992 sec - in
org.apache.activemq.bugs.AMQ5381Test
[05:58:52] Running org.apache.activemq.bugs.AMQ5421Test
[05:59:08] Tests run: 1, Failures: 0, Errors: 0, Skipped: 0, Time elapsed: 15.632 sec - in
org.apache.activemq.bugs.AMQ5421Test
[05:59:09] Running org.apache.activemq.bugs.AMQ5450Test
[05:59:16] Tests run: 2, Failures: 0, Errors: 0, Skipped: 0, Time elapsed: 7.012 sec - in
org.apache.activemq.bugs.AMQ5450Test
[05:59:16] Running org.apache.activemq.bugs.ActiveMQSlowConsumerManualTest
[05:59:24] Tests run: 4, Failures: 0, Errors: 0, Skipped: 0, Time elapsed: 8.108 sec - in
org.apache.activemq.bugs.ActiveMQSlowConsumerManualTest
[05:59:25] Running org.apache.activemq.bugs.ConnectionPerMessageTest
[05:59:40] Tests run: 1, Failures: 0, Errors: 0, Skipped: 0, Time elapsed: 15.105 sec - in
org.apache.activemq.bugs.ConnectionPerMessageTest
[05:59:41] Running org.apache.activemq.bugs.CraigsBugTest
[05:59:45] Tests run: 1, Failures: 0, Errors: 0, Skipped: 0, Time elapsed: 4.131 sec - in
org.apache.activemq.bugs.CraigsBugTest
[05:59:45] Running org.apache.activemq.bugs.DoubleExpireTest
[06:00:47] Tests run: 1, Failures: 0, Errors: 0, Skipped: 0, Time elapsed: 61.223 sec - in
org.apache.activemq.bugs.DoubleExpireTest
[06:00:47] Running org.apache.activemq.bugs.DurableConsumerTest
[06:03:48] Tests run: 6, Failures: 0, Errors: 0, Skipped: 0, Time elapsed: 180.838 sec - in
org.apache.activemq.bugs.DurableConsumerTest
[06:03:49] Running org.apache.activemq.bugs.JMSDurableTopicNoLocalTest
[06:03:56] Tests run: 1, Failures: 0, Errors: 0, Skipped: 0, Time elapsed: 7.214 sec - in
org.apache.activemq.bugs.JMSDurableTopicNoLocalTest
[06:03:57] Running org.apache.activemq.bugs.JmsDurableTopicSlowReceiveTest
[06:05:47] Tests run: 2, Failures: 0, Errors: 0, Skipped: 0, Time elapsed: 110.618 sec - in
org.apache.activemq.bugs.JmsDurableTopicSlowReceiveTest
[06:05:49] Running org.apache.activemq.bugs.JmsTimeoutTest
[06:06:06] Tests run: 2, Failures: 0, Errors: 0, Skipped: 0, Time elapsed: 17.387 sec - in
org.apache.activemq.bugs.JmsTimeoutTest
[06:06:07] Running org.apache.activemq.bugs.MemoryUsageBlockResumeTest
[06:06:14] Tests run: 1, Failures: 0, Errors: 0, Skipped: 0, Time elapsed: 6.663 sec - in
org.apache.activemq.bugs.MemoryUsageBlockResumeTest
[06:06:14] Running org.apache.activemq.bugs.MemoryUsageBrokerTest
[06:07:12] Tests run: 1, Failures: 0, Errors: 0, Skipped: 0, Time elapsed: 57.803 sec - in
org.apache.activemq.bugs.MemoryUsageBrokerTest
[06:07:13] Running org.apache.activemq.bugs.MemoryUsageCleanupTest
[06:10:46] Tests run: 1, Failures: 0, Errors: 0, Skipped: 0, Time elapsed: 213.427 sec - in
org.apache.activemq.bugs.MemoryUsageCleanupTest
[06:10:47] Running org.apache.activemq.bugs.MessageExpirationReaperTest
[06:10:56] Tests run: 2, Failures: 0, Errors: 0, Skipped: 0, Time elapsed: 9.605 sec - in
org.apache.activemq.bugs.MessageExpirationReaperTest
[06:10:57] Running org.apache.activemq.bugs.MissingDataFileTest
[06:14:47] Tests run: 1, Failures: 0, Errors: 0, Skipped: 0, Time elapsed: 229.624 sec - in
org.apache.activemq.bugs.MissingDataFileTest
[06:14:47] Running org.apache.activemq.bugs.OptimizeAcknowledgeWithExpiredMsgsTest
[06:14:51] Tests run: 3, Failures: 0, Errors: 0, Skipped: 0, Time elapsed: 3.466 sec - in
org.apache.activemq.bugs.OptimizeAcknowledgeWithExpiredMsgsTest
[06:14:51] Running org.apache.activemq.bugs.QueueWorkerPrefetchTest
[06:14:52] Tests run: 1, Failures: 0, Errors: 0, Skipped: 0, Time elapsed: 1.203 sec - in
org.apache.activemq.bugs.QueueWorkerPrefetchTest
[06:14:53] Running org.apache.activemq.bugs.RedeliveryPluginHeaderTest
[06:15:00] Tests run: 1, Failures: 0, Errors: 0, Skipped: 0, Time elapsed: 7.206 sec - in
org.apache.activemq.bugs.RedeliveryPluginHeaderTest
[06:15:01] Running org.apache.activemq.bugs.SlowConsumerTest
[06:19:16] 
[06:19:16] Results :
[06:19:16] 
[06:19:16] Failed tests: 
[06:19:16]   DbRestartJDBCQueueMasterSlaveLeaseQuiesceTest>CombinationTestSupport.runBare:113->CombinationTestSupport.runBare:107->QueueMasterSlaveTestSupport.testVirtualTopicFailover:132
slave started
[06:19:16]   DbRestartJDBCQueueTest>CombinationTestSupport.runBare:113->CombinationTestSupport.runBare:107->JmsSendReceiveTestSupport.testSendReceive:103->JmsSendReceiveTestSupport.assertMessagesAreReceived:126->JmsSendReceiveTestSupport.assertMessagesReceivedAreValid:148
Not enough messages received expected:<100> but was:<25>
[06:19:16]   VirtualTopicsAndDurableSubsTest>CombinationTestSupport.runBare:113->CombinationTestSupport.runBare:107->MBeanTest.testDestinationOptionsAreVisible:986->MBeanTest.assertRegisteredObjectName:741
Could not find MBean!: org.apache.activemq:type=Broker,brokerName=localhost,destinationType=Queue,destinationName=QueueWithOptions
[06:19:16]   AMQ2149LevelDBTest>AMQ2149Test.testQueueTransactionalOrderWithRestart:412->AMQ2149Test.doTestTransactionalOrderWithRestart:435->AMQ2149Test.verifyOrderedMessageReceipt:549
No timeout waiting for senders/receivers to complete
[06:19:16]   AMQ3141Test.testNoMissingMessagesOnShortScheduleDelay:109 expect all messages
received but 5 are missing
[06:19:16] 
[06:19:16] Tests in error: 
[06:19:16]   AMQ2149Test.testQueueTransactionalOrderWithRestart:412->doTestTransactionalOrderWithRestart:425->createBroker:99
? IO
[06:19:16]   AMQ2149Test.testOrderWithRestart:369->createBroker:99 ? IO Failed to bind
to s...
[06:19:16]   AMQ2149Test.testTopicOrderWithRestart:392->createBroker:99 ? IO Failed to
bind...
[06:19:16]   AMQ2149Test.testTopicTransactionalOrderWithRestart:417->doTestTransactionalOrderWithRestart:425->createBroker:99
? IO
[06:19:16]   AMQ2870Test.testSize:120->sendMessage:169 ?  test timed out after 300000 milli...
[06:19:16]   AMQ5266StarvedConsumerTest.startBroker:135 ? IO Failed to start database 'derb...
[06:19:16]   AMQ5266StarvedConsumerTest.startBroker:135 ? IO Failed to start database 'derb...
[06:19:16]   AMQ5266Test.startBroker:140 ? IO Failed to start database 'derbydb' with class...
[06:19:16]   AMQ5266Test.startBroker:140 ? IO Failed to start database 'derbydb' with class...
[06:19:16]   AMQ5266Test.startBroker:140 ? IO Failed to start database 'derbydb' with class...
[06:19:16]   AMQ5266Test.startBroker:140 ? IO Failed to start database 'derbydb' with class...
[06:19:16]   AMQ5266Test.startBroker:140 ? IO Failed to start database 'derbydb' with class...
[06:19:16] 
[06:19:16] Tests run: 1680, Failures: 4, Errors: 6, Skipped: 6
[06:19:16] 
[JENKINS] Recording test results
[06:19:27] 

Mime
View raw message