activemq-dev mailing list archives

Site index · List index
Message view « Date » · « Thread »
Top « Date » · « Thread »
From Apache Jenkins Server <jenk...@builds.apache.org>
Subject Build failed in Jenkins: ActiveMQ » ActiveMQ :: Unit Tests #1540
Date Thu, 23 Oct 2014 06:59:49 GMT
See <https://builds.apache.org/job/ActiveMQ/org.apache.activemq$activemq-unit-tests/1540/changes>

Changes:

[tabish121] https://issues.apache.org/jira/browse/AMQ-5406

------------------------------------------
[...truncated 2257 lines...]
[06:16:39] Tests run: 12, Failures: 0, Errors: 0, Skipped: 0, Time elapsed: 33.524 sec - in
org.apache.activemq.usecases.JournalDurableSubscriptionTest
[06:16:39] Running org.apache.activemq.usecases.KahaDBDurableSubscriptionTest
[06:17:14] Tests run: 12, Failures: 0, Errors: 0, Skipped: 0, Time elapsed: 35.131 sec - in
org.apache.activemq.usecases.KahaDBDurableSubscriptionTest
[06:17:15] Running org.apache.activemq.usecases.LargeQueueSparseDeleteTest
[06:18:00] Tests run: 3, Failures: 1, Errors: 0, Skipped: 0, Time elapsed: 44.712 sec <<<
FAILURE! - in org.apache.activemq.usecases.LargeQueueSparseDeleteTest
[06:18:00] testCopyMessages(org.apache.activemq.usecases.LargeQueueSparseDeleteTest)  Time
elapsed: 15.387 sec  <<< FAILURE!
[06:18:00] java.lang.AssertionError: Copying the message took too long: 12774ms
[06:18:00] 	at org.junit.Assert.fail(Assert.java:88)
[06:18:00] 	at org.junit.Assert.assertTrue(Assert.java:41)
[06:18:00] 	at org.apache.activemq.usecases.LargeQueueSparseDeleteTest.testCopyMessages(LargeQueueSparseDeleteTest.java:151)
[06:18:00] 
[06:18:00] Running org.apache.activemq.usecases.LevelDBDurableSubscriptionTest
[06:18:27] Tests run: 12, Failures: 0, Errors: 0, Skipped: 0, Time elapsed: 26.647 sec - in
org.apache.activemq.usecases.LevelDBDurableSubscriptionTest
[06:18:28] Running org.apache.activemq.usecases.ManagedDurableSubscriptionTest
[06:18:30] Tests run: 1, Failures: 0, Errors: 0, Skipped: 0, Time elapsed: 2.193 sec - in
org.apache.activemq.usecases.ManagedDurableSubscriptionTest
[06:18:31] Running org.apache.activemq.usecases.MemoryLimitTest
[06:19:02] Tests run: 6, Failures: 0, Errors: 0, Skipped: 3, Time elapsed: 31.255 sec - in
org.apache.activemq.usecases.MemoryLimitTest
[06:19:03] Running org.apache.activemq.usecases.MessageGroupCloseTest
[06:19:09] Tests run: 1, Failures: 0, Errors: 0, Skipped: 0, Time elapsed: 6.087 sec - in
org.apache.activemq.usecases.MessageGroupCloseTest
[06:19:09] Running org.apache.activemq.usecases.MessageGroupDelayedTest
[06:19:38] Tests run: 6, Failures: 0, Errors: 0, Skipped: 0, Time elapsed: 29.473 sec - in
org.apache.activemq.usecases.MessageGroupDelayedTest
[06:19:39] Running org.apache.activemq.usecases.MessageGroupLateArrivalsTest
[06:19:41] Tests run: 2, Failures: 0, Errors: 0, Skipped: 0, Time elapsed: 2.583 sec - in
org.apache.activemq.usecases.MessageGroupLateArrivalsTest
[06:19:42] Running org.apache.activemq.usecases.MessageGroupNewConsumerTest
[06:19:47] Tests run: 1, Failures: 0, Errors: 0, Skipped: 0, Time elapsed: 4.709 sec - in
org.apache.activemq.usecases.MessageGroupNewConsumerTest
[06:19:47] Running org.apache.activemq.usecases.MessageReroutingTest
[06:19:59] Tests run: 2, Failures: 0, Errors: 0, Skipped: 0, Time elapsed: 11.632 sec - in
org.apache.activemq.usecases.MessageReroutingTest
[06:19:59] Running org.apache.activemq.usecases.MultiBrokersMultiClientsTest
[06:20:25] Tests run: 2, Failures: 0, Errors: 0, Skipped: 0, Time elapsed: 26.092 sec - in
org.apache.activemq.usecases.MultiBrokersMultiClientsTest
[06:20:26] Running org.apache.activemq.usecases.MultiBrokersMultiClientsUsingTcpTest
[06:20:52] Tests run: 2, Failures: 0, Errors: 0, Skipped: 0, Time elapsed: 26.592 sec - in
org.apache.activemq.usecases.MultiBrokersMultiClientsUsingTcpTest
[06:20:53] Running org.apache.activemq.usecases.MulticastDiscoveryOnFaultyNetworkTest
[06:21:43] Tests run: 4, Failures: 0, Errors: 0, Skipped: 0, Time elapsed: 50.792 sec - in
org.apache.activemq.usecases.MulticastDiscoveryOnFaultyNetworkTest
[06:21:44] Running org.apache.activemq.usecases.NetworkAsyncStartTest
[06:21:49] Tests run: 2, Failures: 0, Errors: 0, Skipped: 0, Time elapsed: 5.169 sec - in
org.apache.activemq.usecases.NetworkAsyncStartTest
[06:21:49] Running org.apache.activemq.usecases.NetworkBridgeProducerFlowControlTest
[06:23:04] Tests run: 6, Failures: 0, Errors: 0, Skipped: 0, Time elapsed: 75.017 sec - in
org.apache.activemq.usecases.NetworkBridgeProducerFlowControlTest
[06:23:05] Running org.apache.activemq.usecases.NetworkOfTwentyBrokersTest
[06:24:02] Tests run: 5, Failures: 0, Errors: 0, Skipped: 0, Time elapsed: 56.637 sec - in
org.apache.activemq.usecases.NetworkOfTwentyBrokersTest
[06:24:02] Running org.apache.activemq.usecases.NewConsumerCreatesDestinationTest
[06:24:03] Tests run: 1, Failures: 0, Errors: 0, Skipped: 0, Time elapsed: 1.357 sec - in
org.apache.activemq.usecases.NewConsumerCreatesDestinationTest
[06:24:04] Running org.apache.activemq.usecases.NoDuplicateOnTopicNetworkTest
[06:25:39] Tests run: 8, Failures: 0, Errors: 0, Skipped: 0, Time elapsed: 94.593 sec - in
org.apache.activemq.usecases.NoDuplicateOnTopicNetworkTest
[06:25:39] Running org.apache.activemq.usecases.NonBlockingConsumerRedeliveryTest
[06:26:15] Tests run: 6, Failures: 0, Errors: 0, Skipped: 0, Time elapsed: 35.656 sec - in
org.apache.activemq.usecases.NonBlockingConsumerRedeliveryTest
[06:26:15] Running org.apache.activemq.usecases.ObjectMessageNotSerializableTest
[06:26:16] Tests run: 2, Failures: 0, Errors: 0, Skipped: 0, Time elapsed: 1.071 sec - in
org.apache.activemq.usecases.ObjectMessageNotSerializableTest
[06:26:16] Running org.apache.activemq.usecases.PublishOnDurableTopicConsumedMessageTest
[06:26:19] Tests run: 1, Failures: 0, Errors: 0, Skipped: 0, Time elapsed: 2.391 sec - in
org.apache.activemq.usecases.PublishOnDurableTopicConsumedMessageTest
[06:26:19] Running org.apache.activemq.usecases.PublishOnQueueConsumedMessageInTransactionTest
[06:26:27] Tests run: 1, Failures: 0, Errors: 0, Skipped: 0, Time elapsed: 7.314 sec - in
org.apache.activemq.usecases.PublishOnQueueConsumedMessageInTransactionTest
[06:26:27] Running org.apache.activemq.usecases.PublishOnQueueConsumedMessageTest
[06:26:30] Tests run: 1, Failures: 0, Errors: 0, Skipped: 0, Time elapsed: 2.497 sec - in
org.apache.activemq.usecases.PublishOnQueueConsumedMessageTest
[06:26:31] Running org.apache.activemq.usecases.PublishOnQueueConsumedMessageUsingActivemqXMLTest
[06:26:36] Tests run: 1, Failures: 0, Errors: 0, Skipped: 0, Time elapsed: 5.548 sec - in
org.apache.activemq.usecases.PublishOnQueueConsumedMessageUsingActivemqXMLTest
[06:26:37] Running org.apache.activemq.usecases.PublishOnTemporaryQueueConsumedMessageTest
[06:26:39] Tests run: 1, Failures: 0, Errors: 0, Skipped: 0, Time elapsed: 2.253 sec - in
org.apache.activemq.usecases.PublishOnTemporaryQueueConsumedMessageTest
[06:26:40] Running org.apache.activemq.usecases.PublishOnTopicConsumedMessageTest
[06:26:42] Tests run: 1, Failures: 0, Errors: 0, Skipped: 0, Time elapsed: 2.164 sec - in
org.apache.activemq.usecases.PublishOnTopicConsumedMessageTest
[06:26:42] Running org.apache.activemq.usecases.PublishOnTopicConsumerMessageUsingActivemqXMLTest
[06:26:48] Tests run: 1, Failures: 0, Errors: 0, Skipped: 0, Time elapsed: 5.3 sec - in org.apache.activemq.usecases.PublishOnTopicConsumerMessageUsingActivemqXMLTest
[06:26:48] Running org.apache.activemq.usecases.QueueBrowsingLevelDBTest
[06:26:54] Tests run: 3, Failures: 0, Errors: 0, Skipped: 0, Time elapsed: 5.63 sec - in org.apache.activemq.usecases.QueueBrowsingLevelDBTest
[06:26:55] Running org.apache.activemq.usecases.QueueBrowsingLimitTest
[06:26:57] Tests run: 1, Failures: 0, Errors: 0, Skipped: 0, Time elapsed: 2.82 sec - in org.apache.activemq.usecases.QueueBrowsingLimitTest
[06:26:58] Running org.apache.activemq.usecases.QueueBrowsingTest
[06:27:05] Tests run: 3, Failures: 0, Errors: 0, Skipped: 0, Time elapsed: 6.732 sec - in
org.apache.activemq.usecases.QueueBrowsingTest
[06:27:06] Running org.apache.activemq.usecases.QueueDuplicatesTest
[06:27:32] Tests run: 1, Failures: 0, Errors: 0, Skipped: 0, Time elapsed: 26.338 sec - in
org.apache.activemq.usecases.QueueDuplicatesTest
[06:27:33] Running org.apache.activemq.usecases.QueueMemoryFullMultiBrokersTest
[06:27:45] Tests run: 1, Failures: 0, Errors: 0, Skipped: 0, Time elapsed: 11.947 sec - in
org.apache.activemq.usecases.QueueMemoryFullMultiBrokersTest
[06:27:45] Running org.apache.activemq.usecases.QueueRedeliverTest
[06:28:10] Tests run: 4, Failures: 0, Errors: 0, Skipped: 0, Time elapsed: 25.382 sec - in
org.apache.activemq.usecases.QueueRedeliverTest
[06:28:11] Running org.apache.activemq.usecases.QueueRepeaterTest
[06:28:12] Tests run: 1, Failures: 0, Errors: 0, Skipped: 0, Time elapsed: 1.197 sec - in
org.apache.activemq.usecases.QueueRepeaterTest
[06:28:13] Running org.apache.activemq.usecases.ReliableReconnectTest
[06:28:17] Tests run: 1, Failures: 0, Errors: 0, Skipped: 0, Time elapsed: 4.115 sec - in
org.apache.activemq.usecases.ReliableReconnectTest
[06:28:17] Running org.apache.activemq.usecases.RequestReplyNoAdvisoryNetworkTest
[06:28:30] Tests run: 3, Failures: 0, Errors: 0, Skipped: 0, Time elapsed: 12.353 sec - in
org.apache.activemq.usecases.RequestReplyNoAdvisoryNetworkTest
[06:28:30] Running org.apache.activemq.usecases.RequestReplyTempDestRemovalAdvisoryRaceTest
[06:30:28] Tests run: 8, Failures: 0, Errors: 0, Skipped: 0, Time elapsed: 118.264 sec - in
org.apache.activemq.usecases.RequestReplyTempDestRemovalAdvisoryRaceTest
[06:30:29] Running org.apache.activemq.usecases.RequestReplyToTopicViaThreeNetworkHopsTest
[06:30:40] Tests run: 1, Failures: 0, Errors: 0, Skipped: 0, Time elapsed: 11.621 sec - in
org.apache.activemq.usecases.RequestReplyToTopicViaThreeNetworkHopsTest
[06:30:41] Running org.apache.activemq.usecases.SingleBrokerVirtualDestinationsWithWildcardLevelDBTest
[06:31:21] Tests run: 4, Failures: 0, Errors: 0, Skipped: 0, Time elapsed: 40.55 sec - in
org.apache.activemq.usecases.SingleBrokerVirtualDestinationsWithWildcardLevelDBTest
[06:31:22] Running org.apache.activemq.usecases.SingleBrokerVirtualDestinationsWithWildcardTest
[06:32:05] Tests run: 4, Failures: 0, Errors: 0, Skipped: 0, Time elapsed: 43.157 sec - in
org.apache.activemq.usecases.SingleBrokerVirtualDestinationsWithWildcardTest
[06:32:05] Running org.apache.activemq.usecases.StartAndStopBrokerTest
[06:32:08] Tests run: 1, Failures: 0, Errors: 0, Skipped: 0, Time elapsed: 2.334 sec - in
org.apache.activemq.usecases.StartAndStopBrokerTest
[06:32:08] Running org.apache.activemq.usecases.StartAndStopClientAndBrokerDoesNotLeaveThreadsRunningTest
[06:32:16] Tests run: 1, Failures: 0, Errors: 0, Skipped: 0, Time elapsed: 7.132 sec - in
org.apache.activemq.usecases.StartAndStopClientAndBrokerDoesNotLeaveThreadsRunningTest
[06:32:16] Running org.apache.activemq.usecases.StaticNetworkTest
[06:32:22] Tests run: 1, Failures: 0, Errors: 0, Skipped: 0, Time elapsed: 5.233 sec - in
org.apache.activemq.usecases.StaticNetworkTest
[06:32:22] Running org.apache.activemq.usecases.SubscribeClosePublishThenConsumeTest
[06:32:23] Tests run: 1, Failures: 0, Errors: 0, Skipped: 0, Time elapsed: 1.438 sec - in
org.apache.activemq.usecases.SubscribeClosePublishThenConsumeTest
[06:32:24] Running org.apache.activemq.usecases.TempTopicProducerFlowControlTest
[06:33:16] Tests run: 1, Failures: 0, Errors: 0, Skipped: 0, Time elapsed: 51.906 sec - in
org.apache.activemq.usecases.TempTopicProducerFlowControlTest
[06:33:16] Running org.apache.activemq.usecases.ThreeBrokerQueueNetworkTest
[06:35:31] Tests run: 13, Failures: 0, Errors: 0, Skipped: 0, Time elapsed: 135.063 sec -
in org.apache.activemq.usecases.ThreeBrokerQueueNetworkTest
[06:35:32] Running org.apache.activemq.usecases.ThreeBrokerQueueNetworkUsingTcpTest
[06:37:48] Tests run: 13, Failures: 0, Errors: 0, Skipped: 0, Time elapsed: 135.511 sec -
in org.apache.activemq.usecases.ThreeBrokerQueueNetworkUsingTcpTest
[06:37:48] Running org.apache.activemq.usecases.ThreeBrokerStompTemporaryQueueTest
[06:38:01] Tests run: 1, Failures: 0, Errors: 0, Skipped: 0, Time elapsed: 12.882 sec - in
org.apache.activemq.usecases.ThreeBrokerStompTemporaryQueueTest
[06:38:02] Running org.apache.activemq.usecases.ThreeBrokerTempDestDemandSubscriptionCleanupTest
[06:38:12] Tests run: 2, Failures: 0, Errors: 0, Skipped: 0, Time elapsed: 10.483 sec - in
org.apache.activemq.usecases.ThreeBrokerTempDestDemandSubscriptionCleanupTest
[06:38:13] Running org.apache.activemq.usecases.ThreeBrokerTempQueueNetworkTest
[06:38:40] Tests run: 3, Failures: 0, Errors: 0, Skipped: 0, Time elapsed: 27.751 sec - in
org.apache.activemq.usecases.ThreeBrokerTempQueueNetworkTest
[06:38:41] Running org.apache.activemq.usecases.ThreeBrokerTopicNetworkTest
[06:39:31] Tests run: 9, Failures: 0, Errors: 0, Skipped: 0, Time elapsed: 50.295 sec - in
org.apache.activemq.usecases.ThreeBrokerTopicNetworkTest
[06:39:32] Running org.apache.activemq.usecases.ThreeBrokerTopicNetworkUsingTcpTest
[06:40:22] Tests run: 9, Failures: 0, Errors: 0, Skipped: 0, Time elapsed: 50.266 sec - in
org.apache.activemq.usecases.ThreeBrokerTopicNetworkUsingTcpTest
[06:40:22] Running org.apache.activemq.usecases.ThreeBrokerVirtualTopicNetworkLevelDBTest
[06:40:45] Tests run: 1, Failures: 0, Errors: 0, Skipped: 0, Time elapsed: 22.258 sec - in
org.apache.activemq.usecases.ThreeBrokerVirtualTopicNetworkLevelDBTest
[06:40:45] Running org.apache.activemq.usecases.ThreeBrokerVirtualTopicNetworkTest
[06:41:09] Tests run: 1, Failures: 0, Errors: 0, Skipped: 0, Time elapsed: 24.179 sec - in
org.apache.activemq.usecases.ThreeBrokerVirtualTopicNetworkTest
[06:41:10] Running org.apache.activemq.usecases.TopicDurableConnectStatsTest
[06:41:12] Tests run: 1, Failures: 0, Errors: 0, Skipped: 0, Time elapsed: 2.577 sec - in
org.apache.activemq.usecases.TopicDurableConnectStatsTest
[06:41:13] Running org.apache.activemq.usecases.TopicProducerFlowControlTest
[06:42:05] Tests run: 1, Failures: 0, Errors: 0, Skipped: 0, Time elapsed: 51.814 sec - in
org.apache.activemq.usecases.TopicProducerFlowControlTest
[06:42:05] Running org.apache.activemq.usecases.TopicRedeliverTest
[06:42:30] Tests run: 4, Failures: 0, Errors: 0, Skipped: 0, Time elapsed: 25.279 sec - in
org.apache.activemq.usecases.TopicRedeliverTest
[06:42:31] Running org.apache.activemq.usecases.TopicReplicationTest
[06:42:37] Tests run: 1, Failures: 0, Errors: 0, Skipped: 0, Time elapsed: 6.036 sec - in
org.apache.activemq.usecases.TopicReplicationTest
[06:42:38] Running org.apache.activemq.usecases.TopicSubscriptionSlowConsumerTest
[06:42:40] Tests run: 1, Failures: 0, Errors: 0, Skipped: 0, Time elapsed: 2.154 sec - in
org.apache.activemq.usecases.TopicSubscriptionSlowConsumerTest
[06:42:40] Running org.apache.activemq.usecases.TopicSubscriptionZeroPrefetchTest
[06:42:43] Tests run: 2, Failures: 0, Errors: 0, Skipped: 0, Time elapsed: 2.374 sec - in
org.apache.activemq.usecases.TopicSubscriptionZeroPrefetchTest
[06:42:43] Running org.apache.activemq.usecases.TransactionRollbackOrderTest
[06:42:45] Tests run: 1, Failures: 0, Errors: 0, Skipped: 0, Time elapsed: 2.075 sec - in
org.apache.activemq.usecases.TransactionRollbackOrderTest
[06:42:46] Running org.apache.activemq.usecases.TransactionTest
[06:42:47] Tests run: 1, Failures: 0, Errors: 0, Skipped: 0, Time elapsed: 1.128 sec - in
org.apache.activemq.usecases.TransactionTest
[06:42:48] Running org.apache.activemq.usecases.TransientQueueRedeliverTest
[06:43:13] Tests run: 4, Failures: 0, Errors: 0, Skipped: 0, Time elapsed: 25.336 sec - in
org.apache.activemq.usecases.TransientQueueRedeliverTest
[06:43:13] Running org.apache.activemq.usecases.TwoBrokerMessageNotSentToRemoteWhenNoConsumerTest
[06:43:25] Tests run: 3, Failures: 0, Errors: 0, Skipped: 0, Time elapsed: 11.826 sec - in
org.apache.activemq.usecases.TwoBrokerMessageNotSentToRemoteWhenNoConsumerTest
[06:43:26] Running org.apache.activemq.usecases.TwoBrokerNetworkConnectorWildcardDynamicallyIncludedDestinationTest
[06:44:03] Tests run: 4, Failures: 0, Errors: 0, Skipped: 0, Time elapsed: 37.129 sec - in
org.apache.activemq.usecases.TwoBrokerNetworkConnectorWildcardDynamicallyIncludedDestinationTest
[06:44:03] Running org.apache.activemq.usecases.TwoBrokerNetworkConnectorWildcardStaticallyIncludedDestinationTest
[06:44:20] Killed
[06:44:20] Running org.apache.activemq.usecases.TwoBrokerNetworkLoadBalanceTest
[06:44:25] Tests run: 1, Failures: 0, Errors: 0, Skipped: 0, Time elapsed: 4.433 sec - in
org.apache.activemq.usecases.TwoBrokerNetworkLoadBalanceTest
[06:44:25] Running org.apache.activemq.usecases.TwoBrokerQueueClientsReconnectTest
[06:45:17] Tests run: 11, Failures: 0, Errors: 0, Skipped: 0, Time elapsed: 52.077 sec - in
org.apache.activemq.usecases.TwoBrokerQueueClientsReconnectTest
[06:45:18] Running org.apache.activemq.usecases.TwoBrokerQueueSendReceiveTest
[06:45:31] Tests run: 2, Failures: 0, Errors: 0, Skipped: 0, Time elapsed: 13.71 sec - in
org.apache.activemq.usecases.TwoBrokerQueueSendReceiveTest
[06:45:32] Running org.apache.activemq.usecases.TwoBrokerTempQueueAdvisoryTest
[06:45:57] Tests run: 3, Failures: 0, Errors: 0, Skipped: 0, Time elapsed: 24.858 sec - in
org.apache.activemq.usecases.TwoBrokerTempQueueAdvisoryTest
[06:45:57] Running org.apache.activemq.usecases.TwoBrokerTopicSendReceiveLotsOfMessagesUsingTcpTest
[06:46:07] Tests run: 1, Failures: 0, Errors: 0, Skipped: 0, Time elapsed: 9.891 sec - in
org.apache.activemq.usecases.TwoBrokerTopicSendReceiveLotsOfMessagesUsingTcpTest
[06:46:08] Running org.apache.activemq.usecases.TwoBrokerTopicSendReceiveTest
[06:46:16] Tests run: 1, Failures: 0, Errors: 0, Skipped: 0, Time elapsed: 8.078 sec - in
org.apache.activemq.usecases.TwoBrokerTopicSendReceiveTest
[06:46:16] Running org.apache.activemq.usecases.TwoBrokerTopicSendReceiveUsingJavaConfigurationTest
[06:46:23] Tests run: 1, Failures: 0, Errors: 0, Skipped: 0, Time elapsed: 6.962 sec - in
org.apache.activemq.usecases.TwoBrokerTopicSendReceiveUsingJavaConfigurationTest
[06:46:23] Running org.apache.activemq.usecases.TwoBrokerTopicSendReceiveUsingTcpTest
[06:46:31] Tests run: 1, Failures: 0, Errors: 0, Skipped: 0, Time elapsed: 8.114 sec - in
org.apache.activemq.usecases.TwoBrokerTopicSendReceiveUsingTcpTest
[06:46:32] Running org.apache.activemq.usecases.TwoBrokerVirtualDestDinamicallyIncludedDestTest
[06:47:30] Tests run: 4, Failures: 1, Errors: 0, Skipped: 0, Time elapsed: 58.771 sec <<<
FAILURE! - in org.apache.activemq.usecases.TwoBrokerVirtualDestDinamicallyIncludedDestTest
[06:47:30] testVirtualDestinationsDinamicallyIncludedBehavior2(org.apache.activemq.usecases.TwoBrokerVirtualDestDinamicallyIncludedDestTest)
 Time elapsed: 19.8 sec  <<< FAILURE!
[06:47:30] junit.framework.AssertionFailedError: expected:<10> but was:<0>
[06:47:30] 	at junit.framework.Assert.fail(Assert.java:57)
[06:47:30] 	at junit.framework.Assert.failNotEquals(Assert.java:329)
[06:47:30] 	at junit.framework.Assert.assertEquals(Assert.java:78)
[06:47:30] 	at junit.framework.Assert.assertEquals(Assert.java:234)
[06:47:30] 	at junit.framework.Assert.assertEquals(Assert.java:241)
[06:47:30] 	at junit.framework.TestCase.assertEquals(TestCase.java:409)
[06:47:30] 	at org.apache.activemq.usecases.TwoBrokerVirtualDestDinamicallyIncludedDestTest.testVirtualDestinationsDinamicallyIncludedBehavior2(TwoBrokerVirtualDestDinamicallyIncludedDestTest.java:127)
[06:47:30] 
[06:47:31] Running org.apache.activemq.usecases.TwoBrokerVirtualTopicForwardingTest
[06:47:50] Tests run: 3, Failures: 0, Errors: 0, Skipped: 0, Time elapsed: 18.874 sec - in
org.apache.activemq.usecases.TwoBrokerVirtualTopicForwardingTest
[06:47:50] Running org.apache.activemq.usecases.TwoMulticastDiscoveryBrokerTopicSendReceiveTest
[06:48:04] Tests run: 1, Failures: 1, Errors: 0, Skipped: 0, Time elapsed: 14.089 sec <<<
FAILURE! - in org.apache.activemq.usecases.TwoMulticastDiscoveryBrokerTopicSendReceiveTest
[06:48:04] testSendReceive(org.apache.activemq.usecases.TwoMulticastDiscoveryBrokerTopicSendReceiveTest)
 Time elapsed: 13.914 sec  <<< FAILURE!
[06:48:04] junit.framework.ComparisonFailure: Message: 14945 expected:<...xt for message:
1494[5] at Thu Oct 23 06:47...> but was:<...xt for message: 1494[6] at Thu Oct 23 06:47...>
[06:48:04] 	at junit.framework.Assert.assertEquals(Assert.java:100)
[06:48:04] 	at junit.framework.TestCase.assertEquals(TestCase.java:261)
[06:48:04] 	at org.apache.activemq.test.JmsSendReceiveTestSupport.assertMessageValid(JmsSendReceiveTestSupport.java:199)
[06:48:04] 	at org.apache.activemq.test.JmsSendReceiveTestSupport.assertMessagesReceivedAreValid(JmsSendReceiveTestSupport.java:180)
[06:48:04] 	at org.apache.activemq.test.JmsSendReceiveTestSupport.assertMessagesAreReceived(JmsSendReceiveTestSupport.java:155)
[06:48:04] 	at org.apache.activemq.test.JmsSendReceiveTestSupport.testSendReceive(JmsSendReceiveTestSupport.java:115)
[06:48:04] 	at sun.reflect.NativeMethodAccessorImpl.invoke0(Native Method)
[06:48:04] 	at sun.reflect.NativeMethodAccessorImpl.invoke(NativeMethodAccessorImpl.java:57)
[06:48:04] 	at sun.reflect.DelegatingMethodAccessorImpl.invoke(DelegatingMethodAccessorImpl.java:43)
[06:48:04] 	at java.lang.reflect.Method.invoke(Method.java:606)
[06:48:04] 	at junit.framework.TestCase.runTest(TestCase.java:176)
[06:48:04] 	at junit.framework.TestCase.runBare(TestCase.java:141)
[06:48:04] 	at org.apache.activemq.CombinationTestSupport.runBare(CombinationTestSupport.java:107)
[06:48:04] 	at org.apache.activemq.CombinationTestSupport.runBare(CombinationTestSupport.java:113)
[06:48:04] 	at junit.framework.TestResult$1.protect(TestResult.java:122)
[06:48:04] 	at junit.framework.TestResult.runProtected(TestResult.java:142)
[06:48:04] 	at junit.framework.TestResult.run(TestResult.java:125)
[06:48:04] 	at junit.framework.TestCase.run(TestCase.java:129)
[06:48:04] 	at junit.framework.TestSuite.runTest(TestSuite.java:255)
[06:48:04] 	at junit.framework.TestSuite.run(TestSuite.java:250)
[06:48:04] 	at org.junit.internal.runners.JUnit38ClassRunner.run(JUnit38ClassRunner.java:84)
[06:48:04] 	at org.apache.maven.surefire.junit4.JUnit4Provider.execute(JUnit4Provider.java:264)
[06:48:04] 	at org.apache.maven.surefire.junit4.JUnit4Provider.executeTestSet(JUnit4Provider.java:153)
[06:48:04] 	at org.apache.maven.surefire.junit4.JUnit4Provider.invoke(JUnit4Provider.java:124)
[06:48:04] 	at org.apache.maven.surefire.booter.ForkedBooter.invokeProviderInSameClassLoader(ForkedBooter.java:200)
[06:48:04] 	at org.apache.maven.surefire.booter.ForkedBooter.runSuitesInProcess(ForkedBooter.java:153)
[06:48:04] 	at org.apache.maven.surefire.booter.ForkedBooter.main(ForkedBooter.java:103)
[06:48:04] 
[06:48:16] Running org.apache.activemq.usecases.TwoSecureBrokerRequestReplyTest
[06:49:11] Tests run: 1, Failures: 0, Errors: 0, Skipped: 0, Time elapsed: 55.207 sec - in
org.apache.activemq.usecases.TwoSecureBrokerRequestReplyTest
[06:49:12] Running org.apache.activemq.usecases.UnlimitedEnqueueTest
[06:49:14] Tests run: 1, Failures: 0, Errors: 0, Skipped: 0, Time elapsed: 2.395 sec - in
org.apache.activemq.usecases.UnlimitedEnqueueTest
[06:49:15] Running org.apache.activemq.usecases.VerifyNetworkConsumersDisconnectTest
[06:49:49] Tests run: 2, Failures: 0, Errors: 0, Skipped: 0, Time elapsed: 33.766 sec - in
org.apache.activemq.usecases.VerifyNetworkConsumersDisconnectTest
[06:49:50] Running org.apache.activemq.usecases.VirtualTopicNetworkClusterReactivationTest
[06:49:56] Tests run: 1, Failures: 0, Errors: 0, Skipped: 0, Time elapsed: 6.492 sec - in
org.apache.activemq.usecases.VirtualTopicNetworkClusterReactivationTest
[06:49:57] Running org.apache.activemq.util.LinkedNodeTest
[06:49:57] Tests run: 3, Failures: 0, Errors: 0, Skipped: 0, Time elapsed: 0.056 sec - in
org.apache.activemq.util.LinkedNodeTest
[06:49:57] Running org.apache.activemq.util.ReflectionSupportTest
[06:49:57] Tests run: 3, Failures: 0, Errors: 0, Skipped: 0, Time elapsed: 0.18 sec - in org.apache.activemq.util.ReflectionSupportTest
[06:49:57] Running org.apache.activemq.xbean.ConnectorXBeanConfigTest
[06:50:12] Tests run: 4, Failures: 0, Errors: 0, Skipped: 0, Time elapsed: 14.83 sec - in
org.apache.activemq.xbean.ConnectorXBeanConfigTest
[06:50:13] Running org.apache.activemq.xbean.JDBCPersistenceAdapterXBeanConfigTest
[06:50:16] Tests run: 1, Failures: 0, Errors: 0, Skipped: 0, Time elapsed: 3.334 sec - in
org.apache.activemq.xbean.JDBCPersistenceAdapterXBeanConfigTest
[06:50:16] Running org.apache.activemq.xbean.JDBCPersistenceXBeanConfigTest
[06:50:19] Tests run: 1, Failures: 0, Errors: 0, Skipped: 0, Time elapsed: 2.877 sec - in
org.apache.activemq.xbean.JDBCPersistenceXBeanConfigTest
[06:50:20] Running org.apache.activemq.xbean.ManagementContextXBeanConfigTest
[06:50:24] Tests run: 3, Failures: 0, Errors: 0, Skipped: 0, Time elapsed: 4.507 sec - in
org.apache.activemq.xbean.ManagementContextXBeanConfigTest
[06:50:25] Running org.apache.activemq.xbean.MultipleTestsWithEmbeddedBrokerAndPersistenceTest
[06:50:27] Tests run: 2, Failures: 0, Errors: 0, Skipped: 0, Time elapsed: 2.457 sec - in
org.apache.activemq.xbean.MultipleTestsWithEmbeddedBrokerAndPersistenceTest
[06:50:28] Running org.apache.activemq.xbean.MultipleTestsWithEmbeddedBrokerTest
[06:50:29] Tests run: 2, Failures: 0, Errors: 0, Skipped: 0, Time elapsed: 1.026 sec - in
org.apache.activemq.xbean.MultipleTestsWithEmbeddedBrokerTest
[06:50:30] Running org.apache.activemq.xbean.XBeanConfigTest
[06:50:31] Tests run: 1, Failures: 0, Errors: 0, Skipped: 0, Time elapsed: 1.742 sec - in
org.apache.activemq.xbean.XBeanConfigTest
[06:50:32] Running org.apache.activemq.xbean.XBeanStartFalseTest
[06:50:33] Tests run: 1, Failures: 0, Errors: 0, Skipped: 0, Time elapsed: 1.467 sec - in
org.apache.activemq.xbean.XBeanStartFalseTest
[06:50:34] Running org.apache.activemq.xbean.XBeanXmlTest
[06:50:39] Tests run: 1, Failures: 0, Errors: 0, Skipped: 0, Time elapsed: 5.059 sec - in
org.apache.activemq.xbean.XBeanXmlTest
[06:50:39] 
[06:50:39] Results :
[06:50:39] 
[06:50:39] Failed tests: 
[06:50:39]   DbRestartJDBCQueueMasterSlaveLeaseTest>CombinationTestSupport.runBare:113->CombinationTestSupport.runBare:107->JmsSendReceiveTestSupport.testSendReceive:103->JmsSendReceiveTestSupport.assertMessagesAreReceived:126->JmsSendReceiveTestSupport.assertMessagesReceivedAreValid:148
Not enough messages received expected:<500> but was:<499>
[06:50:39]   NetworkBrokerDetachTest.testNetworkedBrokerDurableSubAfterRestart:192 Got two
more messages after restart
[06:50:39]   DurableSubSelectorDelayWithRestartTest.testProcess:86 small number of journal
files should be left 
[06:50:39]   LargeQueueSparseDeleteTest>CombinationTestSupport.runBare:113->CombinationTestSupport.runBare:107->testCopyMessages:151
Copying the message took too long: 12774ms
[06:50:39]   TwoBrokerVirtualDestDinamicallyIncludedDestTest>CombinationTestSupport.runBare:113->CombinationTestSupport.runBare:107->testVirtualDestinationsDinamicallyIncludedBehavior2:127
expected:<10> but was:<0>
[06:50:39]   TwoMulticastDiscoveryBrokerTopicSendReceiveTest>CombinationTestSupport.runBare:113->CombinationTestSupport.runBare:107->JmsSendReceiveTestSupport.testSendReceive:115->JmsSendReceiveTestSupport.assertMessagesAreReceived:155->JmsSendReceiveTestSupport.assertMessagesReceivedAreValid:180->JmsSendReceiveTestSupport.assertMessageValid:199
Message: 14945 expected:<...xt for message: 1494[5] at Thu Oct 23 06:47...> but was:<...xt
for message: 1494[6] at Thu Oct 23 06:47...>
[06:50:39] 
[06:50:39] Tests in error: 
[06:50:39]   SslContextNBrokerServiceTest.testDummyConfigurationIsolation:51->verifyCredentials:66->verifySslCredentials:85
� SocketTimeout
[06:50:39] 
[06:50:39] Tests run: 4725, Failures: 6, Errors: 1, Skipped: 17
[06:50:39] 
[JENKINS] Recording test results
[06:52:50] 

Mime
View raw message