activemq-dev mailing list archives

Site index · List index
Message view « Date » · « Thread »
Top « Date » · « Thread »
From Apache Jenkins Server <jenk...@builds.apache.org>
Subject Build failed in Jenkins: ActiveMQ » ActiveMQ :: Unit Tests #1519
Date Fri, 12 Sep 2014 07:58:06 GMT
See <https://builds.apache.org/job/ActiveMQ/org.apache.activemq$activemq-unit-tests/1519/changes>

Changes:

[gtully] https://issues.apache.org/jira/browse/AMQ-5274 - we now only check expiry on non
inflight messages so there is on contention on ack with the periodic expriy check thread -
related https://issues.apache.org/jira/browse/AMQ-2876

[gtully] https://issues.apache.org/jira/browse/AMQ-5266 - fix edge case with optimizedDispatch=true
where a single message could be pending till the next page in event

------------------------------------------
[...truncated 2898 lines...]
[06:29:09] Running org.apache.activemq.bugs.AMQ4554Test
[06:29:15] Tests run: 1, Failures: 0, Errors: 0, Skipped: 0, Time elapsed: 5.66 sec - in org.apache.activemq.bugs.AMQ4554Test
[06:29:16] Running org.apache.activemq.bugs.AMQ4582Test
[06:29:21] Tests run: 1, Failures: 0, Errors: 0, Skipped: 0, Time elapsed: 5.185 sec - in
org.apache.activemq.bugs.AMQ4582Test
[06:29:23] Running org.apache.activemq.bugs.AMQ4595Test
[06:31:16] Tests run: 3, Failures: 0, Errors: 0, Skipped: 0, Time elapsed: 112.535 sec - in
org.apache.activemq.bugs.AMQ4595Test
[06:31:18] Killed
[06:31:19] Running org.apache.activemq.bugs.AMQ4656Test
[06:31:31] Tests run: 2, Failures: 0, Errors: 0, Skipped: 0, Time elapsed: 12.127 sec - in
org.apache.activemq.bugs.AMQ4656Test
[06:31:33] Running org.apache.activemq.bugs.AMQ4671Test
[06:31:38] Tests run: 1, Failures: 0, Errors: 0, Skipped: 0, Time elapsed: 4.869 sec - in
org.apache.activemq.bugs.AMQ4671Test
[06:31:39] Running org.apache.activemq.bugs.AMQ4677Test
[06:31:48] Tests run: 1, Failures: 0, Errors: 1, Skipped: 0, Time elapsed: 8.023 sec <<<
FAILURE! - in org.apache.activemq.bugs.AMQ4677Test
[06:31:48] testSendAndReceiveAllMessages(org.apache.activemq.bugs.AMQ4677Test)  Time elapsed:
6.804 sec  <<< ERROR!
[06:31:48] java.lang.IllegalStateException: Can't find levelDB store name.
[06:31:48] 	at org.apache.activemq.bugs.AMQ4677Test.getLevelDBStoreMBean(AMQ4677Test.java:177)
[06:31:48] 	at org.apache.activemq.bugs.AMQ4677Test.testSendAndReceiveAllMessages(AMQ4677Test.java:94)
[06:31:48] 
[06:31:50] Running org.apache.activemq.bugs.AMQ4853Test
[06:31:53] Tests run: 3, Failures: 0, Errors: 0, Skipped: 2, Time elapsed: 3.396 sec - in
org.apache.activemq.bugs.AMQ4853Test
[06:31:54] Running org.apache.activemq.bugs.AMQ4887Test
[06:32:02] Tests run: 4, Failures: 0, Errors: 0, Skipped: 0, Time elapsed: 8.255 sec - in
org.apache.activemq.bugs.AMQ4887Test
[06:32:05] Running org.apache.activemq.bugs.AMQ4893Test
[06:32:06] Tests run: 4, Failures: 0, Errors: 0, Skipped: 0, Time elapsed: 1.044 sec - in
org.apache.activemq.bugs.AMQ4893Test
[06:32:07] Running org.apache.activemq.bugs.AMQ4899Test
[06:32:18] Tests run: 1, Failures: 0, Errors: 0, Skipped: 0, Time elapsed: 10.98 sec - in
org.apache.activemq.bugs.AMQ4899Test
[06:32:20] Running org.apache.activemq.bugs.AMQ4930Test
[06:32:59] Tests run: 3, Failures: 0, Errors: 0, Skipped: 0, Time elapsed: 39.456 sec - in
org.apache.activemq.bugs.AMQ4930Test
[06:33:02] Running org.apache.activemq.bugs.AMQ4950Test
[06:33:06] Tests run: 1, Failures: 0, Errors: 0, Skipped: 0, Time elapsed: 4.376 sec - in
org.apache.activemq.bugs.AMQ4950Test
[06:33:08] Running org.apache.activemq.bugs.AMQ4952Test
[06:33:49] Tests run: 2, Failures: 1, Errors: 0, Skipped: 0, Time elapsed: 40.708 sec <<<
FAILURE! - in org.apache.activemq.bugs.AMQ4952Test
[06:33:49] testConsumerBrokerRestart[enableAudit=false](org.apache.activemq.bugs.AMQ4952Test)
 Time elapsed: 11.644 sec  <<< FAILURE!
[06:33:49] java.lang.AssertionError: messages left in store expected:<true> but was:<false>
[06:33:49] 	at org.junit.Assert.fail(Assert.java:88)
[06:33:49] 	at org.junit.Assert.failNotEquals(Assert.java:743)
[06:33:49] 	at org.junit.Assert.assertEquals(Assert.java:118)
[06:33:49] 	at org.apache.activemq.bugs.AMQ4952Test.testConsumerBrokerRestart(AMQ4952Test.java:227)
[06:33:49] 
[06:33:50] Running org.apache.activemq.bugs.AMQ5035Test
[06:33:58] Tests run: 1, Failures: 0, Errors: 0, Skipped: 0, Time elapsed: 8.507 sec - in
org.apache.activemq.bugs.AMQ5035Test
[06:34:00] Running org.apache.activemq.bugs.AMQ5136Test
[06:34:05] Tests run: 2, Failures: 0, Errors: 0, Skipped: 0, Time elapsed: 5.092 sec - in
org.apache.activemq.bugs.AMQ5136Test
[06:34:07] Running org.apache.activemq.bugs.AMQ5212Test
[06:34:49] Tests run: 8, Failures: 0, Errors: 0, Skipped: 0, Time elapsed: 41.923 sec - in
org.apache.activemq.bugs.AMQ5212Test
[06:34:51] Running org.apache.activemq.bugs.AMQ5266Test
[06:44:50] Running org.apache.activemq.bugs.AMQ5274Test
[06:45:10] Tests run: 1, Failures: 0, Errors: 0, Skipped: 0, Time elapsed: 19.72 sec - in
org.apache.activemq.bugs.AMQ5274Test
[06:45:12] Running org.apache.activemq.bugs.ActiveMQSlowConsumerManualTest
[06:45:25] Tests run: 4, Failures: 0, Errors: 0, Skipped: 0, Time elapsed: 12.956 sec - in
org.apache.activemq.bugs.ActiveMQSlowConsumerManualTest
[06:45:27] Running org.apache.activemq.bugs.ConnectionPerMessageTest
[06:51:57] Tests run: 1, Failures: 0, Errors: 0, Skipped: 0, Time elapsed: 389.969 sec - in
org.apache.activemq.bugs.ConnectionPerMessageTest
[06:51:59] Running org.apache.activemq.bugs.CraigsBugTest
[06:52:06] Tests run: 1, Failures: 0, Errors: 0, Skipped: 0, Time elapsed: 7.304 sec - in
org.apache.activemq.bugs.CraigsBugTest
[06:52:08] Running org.apache.activemq.bugs.DoubleExpireTest
[06:53:13] Tests run: 1, Failures: 0, Errors: 0, Skipped: 0, Time elapsed: 65.001 sec - in
org.apache.activemq.bugs.DoubleExpireTest
[06:53:14] Running org.apache.activemq.bugs.DurableConsumerTest
[06:55:42] Tests run: 6, Failures: 1, Errors: 0, Skipped: 0, Time elapsed: 147.568 sec <<<
FAILURE! - in org.apache.activemq.bugs.DurableConsumerTest
[06:55:42] testFailover(org.apache.activemq.bugs.DurableConsumerTest)  Time elapsed: 28.376
sec  <<< FAILURE!
[06:55:42] junit.framework.AssertionFailedError: no exceptions: [javax.jms.JMSException: java.lang.NullPointerException,
javax.jms.JMSException: java.lang.NullPointerException, javax.jms.JMSException: java.lang.NullPointerException,
javax.jms.JMSException: java.lang.NullPointerException, javax.jms.JMSException: java.lang.NullPointerException,
javax.jms.JMSException: java.lang.NullPointerException, javax.jms.JMSException: java.lang.NullPointerException,
javax.jms.JMSException: java.lang.NullPointerException, javax.jms.JMSException: java.lang.NullPointerException,
javax.jms.JMSException: java.lang.NullPointerException, javax.jms.JMSException: java.lang.NullPointerException,
javax.jms.JMSException: java.lang.NullPointerException, javax.jms.JMSException: java.lang.NullPointerException,
javax.jms.JMSException: java.lang.NullPointerException, javax.jms.JMSException: java.lang.NullPointerException,
javax.jms.JMSException: java.lang.NullPointerException, javax.jms.JMSException: java.lang.NullPointerException,
javax.jms.JMSException: java.lang.NullPointerException, javax.jms.JMSException: java.lang.RuntimeException:
java.io.EOFException, javax.jms.JMSException: java.lang.RuntimeException: java.io.EOFException,
javax.jms.JMSException: java.lang.RuntimeException: java.io.EOFException, javax.jms.JMSException:
java.lang.RuntimeException: java.io.EOFException, javax.jms.JMSException: java.lang.RuntimeException:
java.io.EOFException, javax.jms.JMSException: java.lang.RuntimeException: java.io.EOFException,
javax.jms.JMSException: java.lang.RuntimeException: java.io.EOFException, javax.jms.JMSException:
java.lang.RuntimeException: java.io.EOFException, javax.jms.JMSException: java.lang.RuntimeException:
java.io.EOFException, javax.jms.JMSException: java.lang.RuntimeException: java.io.EOFException,
javax.jms.JMSException: java.lang.RuntimeException: java.io.EOFException, javax.jms.JMSException:
java.lang.RuntimeException: java.io.EOFException, javax.jms.JMSException: java.lang.RuntimeException:
java.io.EOFException, javax.jms.JMSException: java.lang.RuntimeException: java.io.EOFException,
javax.jms.JMSException: java.lang.RuntimeException: java.io.EOFException, javax.jms.JMSException:
java.lang.RuntimeException: java.io.EOFException, javax.jms.JMSException: java.lang.RuntimeException:
java.io.EOFException, javax.jms.JMSException: java.lang.RuntimeException: java.io.EOFException,
javax.jms.JMSException: java.lang.RuntimeException: java.io.EOFException, javax.jms.JMSException:
java.lang.RuntimeException: java.io.EOFException, javax.jms.JMSException: java.lang.RuntimeException:
java.io.EOFException, javax.jms.JMSException: java.lang.RuntimeException: java.io.EOFException,
javax.jms.JMSException: java.lang.RuntimeException: java.io.EOFException, javax.jms.JMSException:
java.lang.RuntimeException: java.io.EOFException, javax.jms.JMSException: java.lang.RuntimeException:
java.io.EOFException, javax.jms.JMSException: java.lang.RuntimeException: java.io.EOFException,
javax.jms.JMSException: java.lang.RuntimeException: java.io.EOFException, javax.jms.JMSException:
java.lang.RuntimeException: java.io.EOFException, javax.jms.JMSException: java.lang.RuntimeException:
java.io.EOFException, javax.jms.JMSException: java.lang.RuntimeException: java.io.EOFException,
javax.jms.JMSException: java.lang.RuntimeException: java.io.EOFException, javax.jms.JMSException:
java.lang.RuntimeException: java.io.EOFException, javax.jms.JMSException: java.lang.RuntimeException:
java.io.EOFException, javax.jms.JMSException: java.lang.RuntimeException: java.io.EOFException,
javax.jms.JMSException: java.lang.RuntimeException: java.io.EOFException, javax.jms.JMSException:
java.lang.RuntimeException: java.io.EOFException, javax.jms.JMSException: java.lang.RuntimeException:
java.io.EOFException, javax.jms.JMSException: java.lang.RuntimeException: java.io.EOFException,
javax.jms.JMSException: java.lang.RuntimeException: java.io.EOFException, javax.jms.JMSException:
java.lang.RuntimeException: java.io.EOFException, javax.jms.JMSException: java.lang.RuntimeException:
java.io.EOFException, javax.jms.JMSException: java.lang.RuntimeException: java.io.EOFException,
javax.jms.JMSException: java.lang.RuntimeException: java.io.EOFException, javax.jms.JMSException:
java.lang.RuntimeException: java.io.EOFException, javax.jms.JMSException: java.lang.RuntimeException:
java.io.EOFException, javax.jms.JMSException: java.lang.RuntimeException: java.io.EOFException,
javax.jms.JMSException: java.lang.RuntimeException: java.io.EOFException, javax.jms.JMSException:
java.lang.RuntimeException: java.io.EOFException, javax.jms.JMSException: java.lang.RuntimeException:
java.io.EOFException, javax.jms.JMSException: java.lang.RuntimeException: java.io.EOFException,
javax.jms.JMSException: java.lang.RuntimeException: java.io.EOFException, javax.jms.JMSException:
java.lang.RuntimeException: java.io.EOFException, javax.jms.JMSException: java.lang.RuntimeException:
java.io.EOFException, javax.jms.JMSException: java.lang.RuntimeException: java.io.EOFException,
javax.jms.JMSException: java.lang.RuntimeException: java.io.EOFException, javax.jms.JMSException:
java.lang.RuntimeException: java.io.EOFException, javax.jms.JMSException: java.lang.RuntimeException:
java.io.EOFException, javax.jms.JMSException: java.lang.RuntimeException: java.io.EOFException,
javax.jms.JMSException: java.lang.RuntimeException: java.io.EOFException, javax.jms.JMSException:
java.lang.RuntimeException: java.io.EOFException, javax.jms.JMSException: java.lang.RuntimeException:
java.io.EOFException, javax.jms.JMSException: java.lang.RuntimeException: java.io.EOFException,
javax.jms.JMSException: java.lang.RuntimeException: java.io.EOFException, javax.jms.JMSException:
java.lang.RuntimeException: java.io.EOFException, javax.jms.JMSException: java.lang.RuntimeException:
java.io.EOFException, javax.jms.JMSException: java.lang.RuntimeException: java.io.EOFException,
javax.jms.JMSException: java.lang.RuntimeException: java.io.EOFException, javax.jms.JMSException:
java.lang.RuntimeException: java.io.EOFException, javax.jms.JMSException: java.lang.RuntimeException:
java.io.EOFException, javax.jms.JMSException: java.lang.RuntimeException: java.io.EOFException,
javax.jms.JMSException: java.lang.RuntimeException: java.io.EOFException, javax.jms.JMSException:
java.lang.RuntimeException: java.io.EOFException, javax.jms.JMSException: java.lang.RuntimeException:
java.io.EOFException, javax.jms.JMSException: java.lang.RuntimeException: java.io.EOFException,
javax.jms.JMSException: java.lang.RuntimeException: java.io.EOFException, javax.jms.JMSException:
java.lang.RuntimeException: java.io.EOFException, javax.jms.JMSException: java.lang.RuntimeException:
java.io.EOFException, javax.jms.JMSException: java.lang.RuntimeException: java.io.EOFException,
javax.jms.JMSException: java.lang.RuntimeException: java.io.EOFException, javax.jms.JMSException:
java.lang.RuntimeException: java.io.EOFException, javax.jms.JMSException: java.lang.RuntimeException:
java.io.EOFException, javax.jms.JMSException: java.lang.RuntimeException: java.io.EOFException,
javax.jms.JMSException: java.lang.RuntimeException: java.io.EOFException, javax.jms.JMSException:
java.lang.RuntimeException: java.io.EOFException, javax.jms.JMSException: java.lang.RuntimeException:
java.io.EOFException, javax.jms.JMSException: java.lang.RuntimeException: java.io.EOFException,
javax.jms.JMSException: java.lang.RuntimeException: java.io.EOFException, javax.jms.JMSException:
java.lang.RuntimeException: java.io.EOFException, javax.jms.JMSException: java.lang.RuntimeException:
java.io.EOFException, javax.jms.JMSException: java.lang.RuntimeException: java.io.EOFException,
javax.jms.JMSException: java.lang.RuntimeException: java.io.EOFException, javax.jms.JMSException:
java.lang.RuntimeException: java.io.EOFException, javax.jms.JMSException: java.lang.RuntimeException:
java.io.EOFException, javax.jms.JMSException: java.lang.RuntimeException: java.io.EOFException,
javax.jms.JMSException: java.lang.RuntimeException: java.io.EOFException, javax.jms.JMSException:
java.lang.RuntimeException: java.io.EOFException, javax.jms.JMSException: java.lang.RuntimeException:
java.io.EOFException, javax.jms.JMSException: java.lang.RuntimeException: java.io.EOFException,
javax.jms.JMSException: java.lang.RuntimeException: java.io.EOFException, javax.jms.JMSException:
java.lang.RuntimeException: java.io.EOFException, javax.jms.JMSException: java.lang.RuntimeException:
java.io.EOFException, javax.jms.JMSException: java.lang.RuntimeException: java.io.EOFException,
javax.jms.JMSException: java.lang.RuntimeException: java.io.EOFException, javax.jms.JMSException:
java.lang.RuntimeException: java.io.EOFException, javax.jms.JMSException: java.lang.RuntimeException:
java.io.EOFException, javax.jms.JMSException: java.lang.RuntimeException: java.io.EOFException,
javax.jms.JMSException: java.lang.RuntimeException: java.io.EOFException, javax.jms.JMSException:
java.lang.RuntimeException: java.io.EOFException, javax.jms.JMSException: java.lang.RuntimeException:
java.io.EOFException, javax.jms.JMSException: java.lang.RuntimeException: java.io.EOFException,
javax.jms.JMSException: java.lang.RuntimeException: java.io.EOFException, javax.jms.JMSException:
java.lang.RuntimeException: java.io.EOFException, javax.jms.JMSException: java.lang.RuntimeException:
java.io.EOFException, javax.jms.JMSException: java.lang.RuntimeException: java.io.EOFException,
javax.jms.JMSException: java.lang.RuntimeException: java.io.EOFException, javax.jms.JMSException:
java.lang.RuntimeException: java.io.EOFException, javax.jms.JMSException: java.lang.RuntimeException:
java.io.EOFException, javax.jms.JMSException: java.lang.RuntimeException: java.io.EOFException,
javax.jms.JMSException: java.lang.RuntimeException: java.io.EOFException, javax.jms.JMSException:
java.lang.RuntimeException: java.io.EOFException, javax.jms.JMSException: java.lang.RuntimeException:
java.io.EOFException, javax.jms.JMSException: java.lang.RuntimeException: java.io.EOFException,
javax.jms.JMSException: java.lang.RuntimeException: java.io.EOFException, javax.jms.JMSException:
java.lang.RuntimeException: java.io.EOFException, javax.jms.JMSException: java.lang.RuntimeException:
java.io.EOFException, javax.jms.JMSException: java.lang.RuntimeException: java.io.EOFException]
[06:55:42] 	at junit.framework.Assert.fail(Assert.java:57)
[06:55:42] 	at junit.framework.Assert.assertTrue(Assert.java:22)
[06:55:42] 	at junit.framework.TestCase.assertTrue(TestCase.java:192)
[06:55:42] 	at org.apache.activemq.bugs.DurableConsumerTest.testFailover(DurableConsumerTest.java:204)
[06:55:42] 
[06:55:44] Running org.apache.activemq.bugs.JMSDurableTopicNoLocalTest
[06:55:55] Tests run: 1, Failures: 0, Errors: 0, Skipped: 0, Time elapsed: 10.967 sec - in
org.apache.activemq.bugs.JMSDurableTopicNoLocalTest
[06:55:56] Running org.apache.activemq.bugs.JmsDurableTopicSlowReceiveTest
[06:57:50] Tests run: 2, Failures: 0, Errors: 0, Skipped: 0, Time elapsed: 113.763 sec - in
org.apache.activemq.bugs.JmsDurableTopicSlowReceiveTest
[06:57:52] Running org.apache.activemq.bugs.JmsTimeoutTest
[06:58:13] Tests run: 2, Failures: 0, Errors: 0, Skipped: 0, Time elapsed: 20.905 sec - in
org.apache.activemq.bugs.JmsTimeoutTest
[06:58:14] Running org.apache.activemq.bugs.MemoryUsageBlockResumeTest
[06:58:21] Tests run: 1, Failures: 0, Errors: 0, Skipped: 0, Time elapsed: 6.54 sec - in org.apache.activemq.bugs.MemoryUsageBlockResumeTest
[06:58:22] Running org.apache.activemq.bugs.MemoryUsageBrokerTest
[06:59:29] Tests run: 1, Failures: 0, Errors: 0, Skipped: 0, Time elapsed: 66.436 sec - in
org.apache.activemq.bugs.MemoryUsageBrokerTest
[06:59:31] Running org.apache.activemq.bugs.MemoryUsageCleanupTest
[07:03:56] Tests run: 1, Failures: 0, Errors: 0, Skipped: 0, Time elapsed: 265.163 sec - in
org.apache.activemq.bugs.MemoryUsageCleanupTest
[07:03:57] Running org.apache.activemq.bugs.MessageExpirationReaperTest
[07:04:15] Tests run: 2, Failures: 0, Errors: 0, Skipped: 0, Time elapsed: 17.605 sec - in
org.apache.activemq.bugs.MessageExpirationReaperTest
[07:04:17] Running org.apache.activemq.bugs.MissingDataFileTest
[07:05:10] Tests run: 1, Failures: 0, Errors: 0, Skipped: 0, Time elapsed: 52.984 sec - in
org.apache.activemq.bugs.MissingDataFileTest
[07:05:11] Running org.apache.activemq.bugs.OptimizeAcknowledgeWithExpiredMsgsTest
[07:05:18] Tests run: 3, Failures: 0, Errors: 0, Skipped: 0, Time elapsed: 6.912 sec - in
org.apache.activemq.bugs.OptimizeAcknowledgeWithExpiredMsgsTest
[07:05:19] Running org.apache.activemq.bugs.QueueWorkerPrefetchTest
[07:05:26] Tests run: 1, Failures: 0, Errors: 0, Skipped: 0, Time elapsed: 6.565 sec - in
org.apache.activemq.bugs.QueueWorkerPrefetchTest
[07:05:28] Running org.apache.activemq.bugs.RedeliveryPluginHeaderTest
[07:05:40] Tests run: 1, Failures: 0, Errors: 0, Skipped: 0, Time elapsed: 12.176 sec - in
org.apache.activemq.bugs.RedeliveryPluginHeaderTest
[07:05:42] Running org.apache.activemq.bugs.SlowConsumerTest
[07:06:47] Tests run: 1, Failures: 0, Errors: 0, Skipped: 0, Time elapsed: 65.684 sec - in
org.apache.activemq.bugs.SlowConsumerTest
[07:06:50] Running org.apache.activemq.bugs.SparseAckReplayAfterStoreCleanupLevelDBStoreTest
[07:07:06] Tests run: 2, Failures: 0, Errors: 0, Skipped: 0, Time elapsed: 16.144 sec - in
org.apache.activemq.bugs.SparseAckReplayAfterStoreCleanupLevelDBStoreTest
[07:07:08] Running org.apache.activemq.bugs.TempQueueDeleteOnCloseTest
[07:07:16] Tests run: 1, Failures: 0, Errors: 0, Skipped: 0, Time elapsed: 8.164 sec - in
org.apache.activemq.bugs.TempQueueDeleteOnCloseTest
[07:07:17] Running org.apache.activemq.bugs.TempStorageBlockedBrokerTest
[07:09:49] Tests run: 2, Failures: 0, Errors: 0, Skipped: 0, Time elapsed: 151.38 sec - in
org.apache.activemq.bugs.TempStorageBlockedBrokerTest
[07:09:51] Running org.apache.activemq.bugs.TempStorageConfigBrokerTest
[07:09:51] Tests run: 2, Failures: 0, Errors: 0, Skipped: 2, Time elapsed: 0.573 sec - in
org.apache.activemq.bugs.TempStorageConfigBrokerTest
[07:09:52] Running org.apache.activemq.bugs.TempStoreDataCleanupTest
[07:14:35] Tests run: 1, Failures: 0, Errors: 0, Skipped: 0, Time elapsed: 282.324 sec - in
org.apache.activemq.bugs.TempStoreDataCleanupTest
[07:14:37] Running org.apache.activemq.bugs.TransactedStoreUsageSuspendResumeTest
[07:16:31] Tests run: 1, Failures: 0, Errors: 0, Skipped: 0, Time elapsed: 113.921 sec - in
org.apache.activemq.bugs.TransactedStoreUsageSuspendResumeTest
[07:16:32] Running org.apache.activemq.bugs.TransactionNotStartedErrorTest
[07:17:08] Tests run: 1, Failures: 0, Errors: 0, Skipped: 0, Time elapsed: 35.536 sec - in
org.apache.activemq.bugs.TransactionNotStartedErrorTest
[07:17:10] Running org.apache.activemq.bugs.TrapMessageInJDBCStoreTest
[07:17:18] Tests run: 1, Failures: 0, Errors: 1, Skipped: 0, Time elapsed: 7.994 sec <<<
FAILURE! - in org.apache.activemq.bugs.TrapMessageInJDBCStoreTest
[07:17:18] testDBCommitException(org.apache.activemq.bugs.TrapMessageInJDBCStoreTest)  Time
elapsed: 7.29 sec  <<< ERROR!
[07:17:18] java.io.IOException: Failed to get last broker message id: java.sql.SQLException:
ResultSet not open. Operation 'next' not permitted. Verify that autocommit is off.
[07:17:18] 	at org.apache.derby.impl.jdbc.SQLExceptionFactory.getSQLException(Unknown Source)
[07:17:18] 	at org.apache.derby.impl.jdbc.SQLExceptionFactory40.wrapArgsForTransportAcrossDRDA(Unknown
Source)
[07:17:18] 	at org.apache.derby.impl.jdbc.SQLExceptionFactory40.getSQLException(Unknown Source)
[07:17:18] 	at org.apache.derby.impl.jdbc.Util.newEmbedSQLException(Unknown Source)
[07:17:18] 	at org.apache.derby.impl.jdbc.Util.newEmbedSQLException(Unknown Source)
[07:17:18] 	at org.apache.derby.impl.jdbc.Util.generateCsSQLException(Unknown Source)
[07:17:18] 	at org.apache.derby.impl.jdbc.EmbedConnection.newSQLException(Unknown Source)
[07:17:18] 	at org.apache.derby.impl.jdbc.ConnectionChild.newSQLException(Unknown Source)
[07:17:18] 	at org.apache.derby.impl.jdbc.EmbedResultSet.checkIfClosed(Unknown Source)
[07:17:18] 	at org.apache.derby.impl.jdbc.EmbedResultSet.checkExecIfClosed(Unknown Source)
[07:17:18] 	at org.apache.derby.impl.jdbc.EmbedResultSet.movePosition(Unknown Source)
[07:17:18] 	at org.apache.derby.impl.jdbc.EmbedResultSet.next(Unknown Source)
[07:17:18] 	at org.apache.activemq.store.jdbc.adapter.DefaultJDBCAdapter.doGetLastMessageStoreSequenceId(DefaultJDBCAdapter.java:178)
[07:17:18] 	at org.apache.activemq.store.jdbc.JDBCPersistenceAdapter.getLastMessageBrokerSequenceId(JDBCPersistenceAdapter.java:260)
[07:17:18] 	at org.apache.activemq.broker.region.DestinationFactoryImpl.getLastMessageBrokerSequenceId(DestinationFactoryImpl.java:147)
[07:17:18] 	at org.apache.activemq.broker.region.RegionBroker.<init>(RegionBroker.java:129)
[07:17:18] 	at org.apache.activemq.broker.BrokerService.createRegionBroker(BrokerService.java:2261)
[07:17:18] 	at org.apache.activemq.broker.BrokerService.createRegionBroker(BrokerService.java:2247)
[07:17:18] 	at org.apache.activemq.broker.BrokerService.createBroker(BrokerService.java:2204)
[07:17:18] 	at org.apache.activemq.broker.BrokerService.getBroker(BrokerService.java:958)
[07:17:18] 	at org.apache.activemq.broker.BrokerService.getAdminConnectionContext(BrokerService.java:2475)
[07:17:18] 	at org.apache.activemq.broker.BrokerService.startVirtualConsumerDestinations(BrokerService.java:2615)
[07:17:18] 	at org.apache.activemq.broker.BrokerService.startDestinations(BrokerService.java:2466)
[07:17:18] 	at org.apache.activemq.broker.BrokerService.doStartBroker(BrokerService.java:669)
[07:17:18] 	at org.apache.activemq.broker.BrokerService.startBroker(BrokerService.java:661)
[07:17:18] 	at org.apache.activemq.broker.BrokerService.start(BrokerService.java:597)
[07:17:18] 	at org.apache.activemq.bugs.TrapMessageInJDBCStoreTest.testDBCommitException(TrapMessageInJDBCStoreTest.java:107)
[07:17:18] 
[07:17:20] Running org.apache.activemq.bugs.VMTransportClosureTest
[07:27:19] Running org.apache.activemq.bugs.amq1095.MessageSelectorTest
[07:27:41] Tests run: 3, Failures: 0, Errors: 0, Skipped: 0, Time elapsed: 22.165 sec - in
org.apache.activemq.bugs.amq1095.MessageSelectorTest
[07:27:43] Running org.apache.activemq.command.ActiveMQBytesMessageTest
[07:27:43] Tests run: 19, Failures: 0, Errors: 0, Skipped: 0, Time elapsed: 0.315 sec - in
org.apache.activemq.command.ActiveMQBytesMessageTest
[07:27:45] Running org.apache.activemq.command.ActiveMQDestinationTest
[07:27:46] Tests run: 14, Failures: 0, Errors: 0, Skipped: 0, Time elapsed: 1.353 sec - in
org.apache.activemq.command.ActiveMQDestinationTest
[07:27:48] Running org.apache.activemq.command.ActiveMQMapMessageTest
[07:27:50] Tests run: 17, Failures: 0, Errors: 0, Skipped: 0, Time elapsed: 2.013 sec - in
org.apache.activemq.command.ActiveMQMapMessageTest
[07:27:52] Running org.apache.activemq.command.ActiveMQMessageTest
[07:27:53] Tests run: 51, Failures: 0, Errors: 0, Skipped: 0, Time elapsed: 1.012 sec - in
org.apache.activemq.command.ActiveMQMessageTest
[07:27:55] Running org.apache.activemq.command.ActiveMQObjectMessageTest
[07:27:56] Tests run: 5, Failures: 0, Errors: 0, Skipped: 0, Time elapsed: 1.034 sec - in
org.apache.activemq.command.ActiveMQObjectMessageTest
[07:27:57] Running org.apache.activemq.command.ActiveMQStreamMessageTest
[07:27:58] Tests run: 18, Failures: 0, Errors: 0, Skipped: 0, Time elapsed: 1.268 sec - in
org.apache.activemq.command.ActiveMQStreamMessageTest
[07:27:59] Running org.apache.activemq.command.ActiveMQTextMessageTest
[07:28:00] Tests run: 9, Failures: 0, Errors: 0, Skipped: 0, Time elapsed: 1.193 sec - in
org.apache.activemq.command.ActiveMQTextMessageTest
[07:28:02] Running org.apache.activemq.command.MessageCompressionTest
[07:28:15] Tests run: 2, Failures: 0, Errors: 0, Skipped: 0, Time elapsed: 12.955 sec - in
org.apache.activemq.command.MessageCompressionTest
[07:28:17] Running org.apache.activemq.command.MessageSendTest
[07:28:18] Tests run: 2, Failures: 0, Errors: 0, Skipped: 0, Time elapsed: 1.147 sec - in
org.apache.activemq.command.MessageSendTest
[07:28:19] Running org.apache.activemq.command.MessageTest
[07:28:21] Tests run: 7, Failures: 0, Errors: 0, Skipped: 0, Time elapsed: 1.297 sec - in
org.apache.activemq.command.MessageTest
[07:28:22] Running org.apache.activemq.config.BrokerPropertiesTest
[07:28:26] Tests run: 2, Failures: 0, Errors: 0, Skipped: 0, Time elapsed: 4.011 sec - in
org.apache.activemq.config.BrokerPropertiesTest
[07:28:27] Running org.apache.activemq.config.BrokerXmlConfigFromJNDITest
[07:28:37] Tests run: 1, Failures: 0, Errors: 0, Skipped: 0, Time elapsed: 9.522 sec - in
org.apache.activemq.config.BrokerXmlConfigFromJNDITest
[07:28:39] Running org.apache.activemq.config.BrokerXmlConfigTest
[07:28:49] Tests run: 1, Failures: 0, Errors: 0, Skipped: 0, Time elapsed: 10.469 sec - in
org.apache.activemq.config.BrokerXmlConfigTest
[07:28:52] Running org.apache.activemq.config.ConfigTest
[07:29:40] Tests run: 7, Failures: 0, Errors: 0, Skipped: 0, Time elapsed: 48.196 sec - in
org.apache.activemq.config.ConfigTest
[07:29:42] Running org.apache.activemq.config.JDBCConfigTest
[07:30:10] Tests run: 1, Failures: 0, Errors: 0, Skipped: 0, Time elapsed: 28.331 sec - in
org.apache.activemq.config.JDBCConfigTest
[07:30:13] Running org.apache.activemq.console.command.AMQ3410Test
[07:31:18] 
[07:31:18] Results :
[07:31:18] 
[07:31:18] Failed tests: 
[07:31:18]   JmsTempDestinationTest.testSlowConsumerDoesNotBlockFastTempUsers:375 ok
[07:31:18]   QueueMbeanRestartTest.testMBeanPresenceOnRestart:84->verifyPresenceOfQueueMbean:107
expected to find matching queue mbean for: queue://org.apache.activemq.broker.QueueMbeanRestartTest.null
[07:31:18]   BrokerViewSlowStoreStartupTest.testBrokerViewOnSlowStoreStart:336 null
[07:31:18]   HealthViewMBeanTest>CombinationTestSupport.runBare:113->CombinationTestSupport.runBare:107->testHealthView:97->assertRegisteredObjectName:113
Could not find MBean!: org.apache.activemq:type=Broker,brokerName=localhost,service=Health
[07:31:18]   AMQ2584ConcurrentDlqTest>CombinationTestSupport.runBare:113->CombinationTestSupport.runBare:107->testSize:112
kahaDB dir should contain 1 db file,is: 2 expected:<1> but was:<2>
[07:31:18]   AMQ2584Test.testSize:121 Store usage exceeds expected usage
[07:31:18]   AMQ4157Test.testPublishCountsWithRollbackConsumer:101->consumeMessages:123
got message 997
[07:31:18]   AMQ4952Test.testConsumerBrokerRestart:227 messages left in store expected:<true>
but was:<false>
[07:31:18]   DurableConsumerTest>CombinationTestSupport.runBare:107->testFailover:204
no exceptions: [javax.jms.JMSException: java.lang.NullPointerException, javax.jms.JMSException:
java.lang.NullPointerException, javax.jms.JMSException: java.lang.NullPointerException, javax.jms.JMSException:
java.lang.NullPointerException, javax.jms.JMSException: java.lang.NullPointerException, javax.jms.JMSException:
java.lang.NullPointerException, javax.jms.JMSException: java.lang.NullPointerException, javax.jms.JMSException:
java.lang.NullPointerException, javax.jms.JMSException: java.lang.NullPointerException, javax.jms.JMSException:
java.lang.NullPointerException, javax.jms.JMSException: java.lang.NullPointerException, javax.jms.JMSException:
java.lang.NullPointerException, javax.jms.JMSException: java.lang.NullPointerException, javax.jms.JMSException:
java.lang.NullPointerException, javax.jms.JMSException: java.lang.NullPointerException, javax.jms.JMSException:
java.lang.NullPointerException, javax.jms.JMSException: java.lang.NullPointerException, javax.jms.JMSException:
java.lang.NullPointerException, javax.jms.JMSException: java.lang.RuntimeException: java.io.EOFException,
javax.jms.JMSException: java.lang.RuntimeException: java.io.EOFException, javax.jms.JMSException:
java.lang.RuntimeException: java.io.EOFException, javax.jms.JMSException: java.lang.RuntimeException:
java.io.EOFException, javax.jms.JMSException: java.lang.RuntimeException: java.io.EOFException,
javax.jms.JMSException: java.lang.RuntimeException: java.io.EOFException, javax.jms.JMSException:
java.lang.RuntimeException: java.io.EOFException, javax.jms.JMSException: java.lang.RuntimeException:
java.io.EOFException, javax.jms.JMSException: java.lang.RuntimeException: java.io.EOFException,
javax.jms.JMSException: java.lang.RuntimeException: java.io.EOFException, javax.jms.JMSException:
java.lang.RuntimeException: java.io.EOFException, javax.jms.JMSException: java.lang.RuntimeException:
java.io.EOFException, javax.jms.JMSException: java.lang.RuntimeException: java.io.EOFException,
javax.jms.JMSException: java.lang.RuntimeException: java.io.EOFException, javax.jms.JMSException:
java.lang.RuntimeException: java.io.EOFException, javax.jms.JMSException: java.lang.RuntimeException:
java.io.EOFException, javax.jms.JMSException: java.lang.RuntimeException: java.io.EOFException,
javax.jms.JMSException: java.lang.RuntimeException: java.io.EOFException, javax.jms.JMSException:
java.lang.RuntimeException: java.io.EOFException, javax.jms.JMSException: java.lang.RuntimeException:
java.io.EOFException, javax.jms.JMSException: java.lang.RuntimeException: java.io.EOFException,
javax.jms.JMSException: java.lang.RuntimeException: java.io.EOFException, javax.jms.JMSException:
java.lang.RuntimeException: java.io.EOFException, javax.jms.JMSException: java.lang.RuntimeException:
java.io.EOFException, javax.jms.JMSException: java.lang.RuntimeException: java.io.EOFException,
javax.jms.JMSException: java.lang.RuntimeException: java.io.EOFException, javax.jms.JMSException:
java.lang.RuntimeException: java.io.EOFException, javax.jms.JMSException: java.lang.RuntimeException:
java.io.EOFException, javax.jms.JMSException: java.lang.RuntimeException: java.io.EOFException,
javax.jms.JMSException: java.lang.RuntimeException: java.io.EOFException, javax.jms.JMSException:
java.lang.RuntimeException: java.io.EOFException, javax.jms.JMSException: java.lang.RuntimeException:
java.io.EOFException, javax.jms.JMSException: java.lang.RuntimeException: java.io.EOFException,
javax.jms.JMSException: java.lang.RuntimeException: java.io.EOFException, javax.jms.JMSException:
java.lang.RuntimeException: java.io.EOFException, javax.jms.JMSException: java.lang.RuntimeException:
java.io.EOFException, javax.jms.JMSException: java.lang.RuntimeException: java.io.EOFException,
javax.jms.JMSException: java.lang.RuntimeException: java.io.EOFException, javax.jms.JMSException:
java.lang.RuntimeException: java.io.EOFException, javax.jms.JMSException: java.lang.RuntimeException:
java.io.EOFException, javax.jms.JMSException: java.lang.RuntimeException: java.io.EOFException,
javax.jms.JMSException: java.lang.RuntimeException: java.io.EOFException, javax.jms.JMSException:
java.lang.RuntimeException: java.io.EOFException, javax.jms.JMSException: java.lang.RuntimeException:
java.io.EOFException, javax.jms.JMSException: java.lang.RuntimeException: java.io.EOFException,
javax.jms.JMSException: java.lang.RuntimeException: java.io.EOFException, javax.jms.JMSException:
java.lang.RuntimeException: java.io.EOFException, javax.jms.JMSException: java.lang.RuntimeException:
java.io.EOFException, javax.jms.JMSException: java.lang.RuntimeException: java.io.EOFException,
javax.jms.JMSException: java.lang.RuntimeException: java.io.EOFException, javax.jms.JMSException:
java.lang.RuntimeException: java.io.EOFException, javax.jms.JMSException: java.lang.RuntimeException:
java.io.EOFException, javax.jms.JMSException: java.lang.RuntimeException: java.io.EOFException,
javax.jms.JMSException: java.lang.RuntimeException: java.io.EOFException, javax.jms.JMSException:
java.lang.RuntimeException: java.io.EOFException, javax.jms.JMSException: java.lang.RuntimeException:
java.io.EOFException, javax.jms.JMSException: java.lang.RuntimeException: java.io.EOFException,
javax.jms.JMSException: java.lang.RuntimeException: java.io.EOFException, javax.jms.JMSException:
java.lang.RuntimeException: java.io.EOFException, javax.jms.JMSException: java.lang.RuntimeException:
java.io.EOFException, javax.jms.JMSException: java.lang.RuntimeException: java.io.EOFException,
javax.jms.JMSException: java.lang.RuntimeException: java.io.EOFException, javax.jms.JMSException:
java.lang.RuntimeException: java.io.EOFException, javax.jms.JMSException: java.lang.RuntimeException:
java.io.EOFException, javax.jms.JMSException: java.lang.RuntimeException: java.io.EOFException,
javax.jms.JMSException: java.lang.RuntimeException: java.io.EOFException, javax.jms.JMSException:
java.lang.RuntimeException: java.io.EOFException, javax.jms.JMSException: java.lang.RuntimeException:
java.io.EOFException, javax.jms.JMSException: java.lang.RuntimeException: java.io.EOFException,
javax.jms.JMSException: java.lang.RuntimeException: java.io.EOFException, javax.jms.JMSException:
java.lang.RuntimeException: java.io.EOFException, javax.jms.JMSException: java.lang.RuntimeException:
java.io.EOFException, javax.jms.JMSException: java.lang.RuntimeException: java.io.EOFException,
javax.jms.JMSException: java.lang.RuntimeException: java.io.EOFException, javax.jms.JMSException:
java.lang.RuntimeException: java.io.EOFException, javax.jms.JMSException: java.lang.RuntimeException:
java.io.EOFException, javax.jms.JMSException: java.lang.RuntimeException: java.io.EOFException,
javax.jms.JMSException: java.lang.RuntimeException: java.io.EOFException, javax.jms.JMSException:
java.lang.RuntimeException: java.io.EOFException, javax.jms.JMSException: java.lang.RuntimeException:
java.io.EOFException, javax.jms.JMSException: java.lang.RuntimeException: java.io.EOFException,
javax.jms.JMSException: java.lang.RuntimeException: java.io.EOFException, javax.jms.JMSException:
java.lang.RuntimeException: java.io.EOFException, javax.jms.JMSException: java.lang.RuntimeException:
java.io.EOFException, javax.jms.JMSException: java.lang.RuntimeException: java.io.EOFException,
javax.jms.JMSException: java.lang.RuntimeException: java.io.EOFException, javax.jms.JMSException:
java.lang.RuntimeException: java.io.EOFException, javax.jms.JMSException: java.lang.RuntimeException:
java.io.EOFException, javax.jms.JMSException: java.lang.RuntimeException: java.io.EOFException,
javax.jms.JMSException: java.lang.RuntimeException: java.io.EOFException, javax.jms.JMSException:
java.lang.RuntimeException: java.io.EOFException, javax.jms.JMSException: java.lang.RuntimeException:
java.io.EOFException, javax.jms.JMSException: java.lang.RuntimeException: java.io.EOFException,
javax.jms.JMSException: java.lang.RuntimeException: java.io.EOFException, javax.jms.JMSException:
java.lang.RuntimeException: java.io.EOFException, javax.jms.JMSException: java.lang.RuntimeException:
java.io.EOFException, javax.jms.JMSException: java.lang.RuntimeException: java.io.EOFException,
javax.jms.JMSException: java.lang.RuntimeException: java.io.EOFException, javax.jms.JMSException:
java.lang.RuntimeException: java.io.EOFException, javax.jms.JMSException: java.lang.RuntimeException:
java.io.EOFException, javax.jms.JMSException: java.lang.RuntimeException: java.io.EOFException,
javax.jms.JMSException: java.lang.RuntimeException: java.io.EOFException, javax.jms.JMSException:
java.lang.RuntimeException: java.io.EOFException, javax.jms.JMSException: java.lang.RuntimeException:
java.io.EOFException, javax.jms.JMSException: java.lang.RuntimeException: java.io.EOFException,
javax.jms.JMSException: java.lang.RuntimeException: java.io.EOFException, javax.jms.JMSException:
java.lang.RuntimeException: java.io.EOFException, javax.jms.JMSException: java.lang.RuntimeException:
java.io.EOFException, javax.jms.JMSException: java.lang.RuntimeException: java.io.EOFException,
javax.jms.JMSException: java.lang.RuntimeException: java.io.EOFException, javax.jms.JMSException:
java.lang.RuntimeException: java.io.EOFException, javax.jms.JMSException: java.lang.RuntimeException:
java.io.EOFException, javax.jms.JMSException: java.lang.RuntimeException: java.io.EOFException,
javax.jms.JMSException: java.lang.RuntimeException: java.io.EOFException, javax.jms.JMSException:
java.lang.RuntimeException: java.io.EOFException, javax.jms.JMSException: java.lang.RuntimeException:
java.io.EOFException, javax.jms.JMSException: java.lang.RuntimeException: java.io.EOFException,
javax.jms.JMSException: java.lang.RuntimeException: java.io.EOFException, javax.jms.JMSException:
java.lang.RuntimeException: java.io.EOFException, javax.jms.JMSException: java.lang.RuntimeException:
java.io.EOFException, javax.jms.JMSException: java.lang.RuntimeException: java.io.EOFException,
javax.jms.JMSException: java.lang.RuntimeException: java.io.EOFException, javax.jms.JMSException:
java.lang.RuntimeException: java.io.EOFException, javax.jms.JMSException: java.lang.RuntimeException:
java.io.EOFException, javax.jms.JMSException: java.lang.RuntimeException: java.io.EOFException,
javax.jms.JMSException: java.lang.RuntimeException: java.io.EOFException]
[07:31:18] 
[07:31:18] Tests in error: 
[07:31:18]   RemoveDestinationTest.testRemoveDestinationWithSubscriber:148->destinationPresentInAdminView:158
? UndeclaredThrowable
[07:31:18]   JdbcXARecoveryBrokerTest>CombinationTestSupport.runBare:107->XARecoveryBrokerTest.testQueuePersistentPreparedAcksNotLostOnRestart:685
? UndeclaredThrowable
[07:31:18]   JdbcXARecoveryBrokerTest>CombinationTestSupport.runBare:107->XARecoveryBrokerTest.testPreparedJmxView:107
? UndeclaredThrowable
[07:31:18]   QueueMbeanRestartTest.testMBeanPresenceOnRestart:77->createBroker:121 ?  test
...
[07:31:18]   QueueMbeanRestartTest.testMBeanPresenceOnRestart:77->createBroker:121 ? IO
Fai...
[07:31:18]   XARecoveryBrokerTest>CombinationTestSupport.runBare:107->testPreparedJmxView:87
? UndeclaredThrowable
[07:31:18]   XARecoveryBrokerTest>CombinationTestSupport.runBare:107->testQueuePersistentPreparedAcksNotLostOnRestart:685
? UndeclaredThrowable
[07:31:18]   AdvisoryDuplexNetworkBridgeTest>AdvisoryNetworkBridgeTest.testAddConsumerLater:69->createBroker1:30
? IO
[07:31:18]   AdvisoryDuplexNetworkBridgeTest>AdvisoryNetworkBridgeTest.testAdvisory:39->createBroker1:30
? IO
[07:31:18]   AdvisoryNetworkBridgeTest.testAddConsumerLater:71->createBroker2:114 ? BeanCreation
[07:31:18]   AdvisoryNetworkBridgeTest.testAdvisory:49->createBroker2:114 ? BeanCreation
Er...
[07:31:18]   DbRestartJDBCQueueMasterSlaveLeaseQuiesceTest>CombinationTestSupport.runBare:113->CombinationTestSupport.runBare:107->setUp:65->JDBCQueueMasterSlaveTest.setUp:45->QueueMasterSlaveTestSupport.setUp:63->JDBCQueueMasterSlaveTest.createMaster:51
? IO
[07:31:18]   DbRestartJDBCQueueMasterSlaveLeaseQuiesceTest>CombinationTestSupport.runBare:113->CombinationTestSupport.runBare:107->setUp:65->JDBCQueueMasterSlaveTest.setUp:45->QueueMasterSlaveTestSupport.setUp:63->JDBCQueueMasterSlaveTest.createMaster:51
? IO
[07:31:18]   DbRestartJDBCQueueMasterSlaveLeaseQuiesceTest>CombinationTestSupport.runBare:113->CombinationTestSupport.runBare:107->setUp:65->JDBCQueueMasterSlaveTest.setUp:45->QueueMasterSlaveTestSupport.setUp:63->JDBCQueueMasterSlaveTest.createMaster:51
? IO
[07:31:18]   DbRestartJDBCQueueMasterSlaveLeaseQuiesceTest>CombinationTestSupport.runBare:113->CombinationTestSupport.runBare:107->setUp:65->JDBCQueueMasterSlaveTest.setUp:45->QueueMasterSlaveTestSupport.setUp:63->JDBCQueueMasterSlaveTest.createMaster:51
? IO
[07:31:18]   DbRestartJDBCQueueMasterSlaveLeaseTest>CombinationTestSupport.runBare:113->CombinationTestSupport.runBare:107->JDBCQueueMasterSlaveTest.setUp:45->QueueMasterSlaveTestSupport.setUp:63->JDBCQueueMasterSlaveTest.createMaster:51
? IO
[07:31:18]   DbRestartJDBCQueueMasterSlaveLeaseTest>CombinationTestSupport.runBare:113->CombinationTestSupport.runBare:107->JDBCQueueMasterSlaveTest.setUp:45->QueueMasterSlaveTestSupport.setUp:63->JDBCQueueMasterSlaveTest.createMaster:51
? IO
[07:31:18]   DbRestartJDBCQueueMasterSlaveLeaseTest>CombinationTestSupport.runBare:113->CombinationTestSupport.runBare:107->JDBCQueueMasterSlaveTest.setUp:45->QueueMasterSlaveTestSupport.setUp:63->JDBCQueueMasterSlaveTest.createMaster:51
? IO
[07:31:18]   DbRestartJDBCQueueMasterSlaveTest>CombinationTestSupport.runBare:113->CombinationTestSupport.runBare:107->JDBCQueueMasterSlaveTest.setUp:45->QueueMasterSlaveTestSupport.setUp:63->JDBCQueueMasterSlaveTest.createMaster:51
? IO
[07:31:18]   DbRestartJDBCQueueMasterSlaveTest>CombinationTestSupport.runBare:113->CombinationTestSupport.runBare:107->JDBCQueueMasterSlaveTest.setUp:45->QueueMasterSlaveTestSupport.setUp:63->JDBCQueueMasterSlaveTest.createMaster:51
? IO
[07:31:18]   DbRestartJDBCQueueMasterSlaveTest>CombinationTestSupport.runBare:113->CombinationTestSupport.runBare:107->JDBCQueueMasterSlaveTest.setUp:45->QueueMasterSlaveTestSupport.setUp:63->JDBCQueueMasterSlaveTest.createMaster:51
? IO
[07:31:18]   DbRestartJDBCQueueTest>CombinationTestSupport.runBare:113->CombinationTestSupport.runBare:107->setUp:71
? NullPointer
[07:31:18]   JDBCQueueMasterSlaveTest>CombinationTestSupport.runBare:113->CombinationTestSupport.runBare:107->setUp:45->QueueMasterSlaveTestSupport.setUp:63->createMaster:51
? IO
[07:31:18]   JDBCQueueMasterSlaveTest>CombinationTestSupport.runBare:113->CombinationTestSupport.runBare:107->setUp:45->QueueMasterSlaveTestSupport.setUp:63->createMaster:51
? IO
[07:31:18]   JDBCQueueMasterSlaveTest>CombinationTestSupport.runBare:113->CombinationTestSupport.runBare:107->setUp:45->QueueMasterSlaveTestSupport.setUp:63->createMaster:51
? IO
[07:31:18]   QueueMasterSlaveSingleUrlTest>CombinationTestSupport.runBare:113->CombinationTestSupport.runBare:107->setUp:36->QueueMasterSlaveTestSupport.setUp:63->createMaster:49
? IO
[07:31:18]   QueueMasterSlaveSingleUrlTest>CombinationTestSupport.runBare:113->CombinationTestSupport.runBare:107->setUp:36->QueueMasterSlaveTestSupport.setUp:63->createMaster:49
? IO
[07:31:18]   QueueMasterSlaveSingleUrlTest>CombinationTestSupport.runBare:113->CombinationTestSupport.runBare:107->setUp:36->QueueMasterSlaveTestSupport.setUp:63->createMaster:49
? IO
[07:31:18]   QueueMasterSlaveTestUsingSharedFileTest>CombinationTestSupport.runBare:113->CombinationTestSupport.runBare:107->QueueMasterSlaveTestSupport.setUp:63->QueueMasterSlaveTestSupport.createMaster:111
? BeanCreation
[07:31:18]   QueueMasterSlaveTestUsingSharedFileTest>CombinationTestSupport.runBare:113->CombinationTestSupport.runBare:107->QueueMasterSlaveTestSupport.setUp:63->QueueMasterSlaveTestSupport.createMaster:111
? BeanCreation
[07:31:18]   QueueMasterSlaveTestUsingSharedFileTest>CombinationTestSupport.runBare:113->CombinationTestSupport.runBare:107->QueueMasterSlaveTestSupport.setUp:63->QueueMasterSlaveTestSupport.createMaster:111
? BeanCreation
[07:31:18]   kahaDbJdbcLeaseQueueMasterSlaveTest>CombinationTestSupport.runBare:113->CombinationTestSupport.runBare:107->setUp:40->QueueMasterSlaveTestSupport.setUp:63->createMaster:46
? IO
[07:31:18]   kahaDbJdbcLeaseQueueMasterSlaveTest>CombinationTestSupport.runBare:113->CombinationTestSupport.runBare:107->setUp:40->QueueMasterSlaveTestSupport.setUp:63->createMaster:46
? IO
[07:31:18]   kahaDbJdbcLeaseQueueMasterSlaveTest>CombinationTestSupport.runBare:113->CombinationTestSupport.runBare:107->setUp:40->QueueMasterSlaveTestSupport.setUp:63->createMaster:46
? IO
[07:31:18]   mKahaDbQueueMasterSlaveTest>CombinationTestSupport.runBare:113->CombinationTestSupport.runBare:107->QueueMasterSlaveTestSupport.setUp:63->createMaster:35
? IO
[07:31:18]   mKahaDbQueueMasterSlaveTest>CombinationTestSupport.runBare:113->CombinationTestSupport.runBare:107->QueueMasterSlaveTestSupport.setUp:63->createMaster:35
? IO
[07:31:18]   mKahaDbQueueMasterSlaveTest>CombinationTestSupport.runBare:113->CombinationTestSupport.runBare:107->QueueMasterSlaveTestSupport.setUp:63->createMaster:35
? IO
[07:31:18]   mKahaDBXARecoveryBrokerTest>CombinationTestSupport.runBare:107->XARecoveryBrokerTest.testPreparedJmxView:107
? UndeclaredThrowable
[07:31:18]   mKahaDBXARecoveryBrokerTest>CombinationTestSupport.runBare:107->XARecoveryBrokerTest.testQueuePersistentPreparedAcksNotLostOnRestart:685
? UndeclaredThrowable
[07:31:18]   mLevelDBXARecoveryBrokerTest>CombinationTestSupport.runBare:107->XARecoveryBrokerTest.testQueuePersistentPreparedAcksNotLostOnRestart:685
? UndeclaredThrowable
[07:31:18]   mLevelDBXARecoveryBrokerTest>CombinationTestSupport.runBare:107->XARecoveryBrokerTest.testPreparedJmxView:107
? UndeclaredThrowable
[07:31:18]   StoreQueueCursorJDBCNoDuplicateTest>StoreQueueCursorNoDuplicateTest.setUp:55
? IO
[07:31:18]   InMemoryJobSchedulerManagementTest>JobSchedulerManagementTest.testRemoveAllScheduled:52->JobSchedulerManagementTest.scheduleMessage:398
? JMS
[07:31:18]   AMQ1936Test.tearDown:103 ? FileNotFound targetactivemq-data/localhost/KahaDB/d...
[07:31:18]   AMQ2149LevelDBTest>AMQ2149Test.testQueueTransactionalOrderWithRestart:412->AMQ2149Test.doTestTransactionalOrderWithRestart:425->AMQ2149Test.createBroker:99
? IO
[07:31:18]   AMQ2149LevelDBTest>AMQ2149Test.testOrderWithRestart:369->AMQ2149Test.createBroker:99
? IO
[07:31:18]   AMQ2149LevelDBTest>AMQ2149Test.testTopicOrderWithRestart:392->AMQ2149Test.createBroker:99
? IO
[07:31:18]   AMQ2149LevelDBTest>AMQ2149Test.testTopicTransactionalOrderWithRestart:417->AMQ2149Test.doTestTransactionalOrderWithRestart:425->AMQ2149Test.createBroker:99
? IO
[07:31:18]   AMQ2149Test.testQueueTransactionalOrderWithRestart:412->doTestTransactionalOrderWithRestart:425->createBroker:99
? IO
[07:31:18]   AMQ2149Test.testOrderWithRestart:369->createBroker:99 ? IO Failed to bind
to s...
[07:31:18]   AMQ2149Test.testTopicOrderWithRestart:392->createBroker:99 ? IO Failed to
bind...
[07:31:18]   AMQ2149Test.testTopicTransactionalOrderWithRestart:417->doTestTransactionalOrderWithRestart:425->createBroker:99
? IO
[07:31:18]   AMQ2439Test>CombinationTestSupport.runBare:113->CombinationTestSupport.runBare:107->setUp:83->JmsMultipleBrokersTestSupport.createBroker:293
? IO
[07:31:18]   AMQ2512Test>CombinationTestSupport.runBare:113->CombinationTestSupport.runBare:107->setUp:154->EmbeddedBrokerTestSupport.setUp:45->createBroker:171
? IO
[07:31:18]   AMQ2645Test>CombinationTestSupport.runBare:113->CombinationTestSupport.runBare:107->setUp:107->EmbeddedBrokerTestSupport.setUp:45->EmbeddedBrokerTestSupport.createBroker:119
? IO
[07:31:18]   AMQ3445Test.testJDBCRetiansDestinationAfterRestart:96 ? UndeclaredThrowable
[07:31:18]   AMQ4485NetworkOfXBrokersWithNDestsFanoutTransactionTest>CombinationTestSupport.runBare:113->CombinationTestSupport.runBare:107->testBrokers:138->createBroker:89
? IO
[07:31:18]   AMQ4677Test.testSendAndReceiveAllMessages:94->getLevelDBStoreMBean:177 IllegalState
[07:31:18]   TrapMessageInJDBCStoreTest.testDBCommitException:107 ? IO Failed to get last
b...
[07:31:18] 
[07:31:18] Tests run: 1822, Failures: 9, Errors: 59, Skipped: 8
[07:31:18] 
[07:31:21] Tests run: 5, Failures: 0, Errors: 0, Skipped: 0, Time elapsed: 67.998 sec - in
org.apache.activemq.console.command.AMQ3410Test
[JENKINS] Recording test results
[07:33:46] 

Mime
View raw message