activemq-dev mailing list archives

Site index · List index
Message view « Date » · « Thread »
Top « Date » · « Thread »
From Apache Jenkins Server <jenk...@builds.apache.org>
Subject Build failed in Jenkins: ActiveMQ » ActiveMQ :: Unit Tests #1522
Date Thu, 18 Sep 2014 07:09:46 GMT
See <https://builds.apache.org/job/ActiveMQ/org.apache.activemq$activemq-unit-tests/1522/changes>

Changes:

[gtully] add info log message for a queue purge event

------------------------------------------
[...truncated 659 lines...]
[05:50:41] Tests run: 1, Failures: 0, Errors: 0, Skipped: 0, Time elapsed: 130.295 sec - in
org.apache.activemq.bugs.AMQ3140Test
[05:50:41] Running org.apache.activemq.bugs.AMQ3141Test
[05:50:54] Tests run: 1, Failures: 1, Errors: 0, Skipped: 0, Time elapsed: 13.203 sec <<<
FAILURE! - in org.apache.activemq.bugs.AMQ3141Test
[05:50:54] testNoMissingMessagesOnShortScheduleDelay(org.apache.activemq.bugs.AMQ3141Test)
 Time elapsed: 13.125 sec  <<< FAILURE!
[05:50:54] java.lang.AssertionError: expect all messages received but 3 are missing
[05:50:54] 	at org.junit.Assert.fail(Assert.java:88)
[05:50:54] 	at org.junit.Assert.assertTrue(Assert.java:41)
[05:50:54] 	at org.apache.activemq.bugs.AMQ3141Test.testNoMissingMessagesOnShortScheduleDelay(AMQ3141Test.java:109)
[05:50:54] 
[05:50:54] Running org.apache.activemq.bugs.AMQ3145Test
[05:50:57] Tests run: 1, Failures: 0, Errors: 0, Skipped: 0, Time elapsed: 2.61 sec - in org.apache.activemq.bugs.AMQ3145Test
[05:50:57] Running org.apache.activemq.bugs.AMQ3157Test
[05:51:09] Tests run: 1, Failures: 0, Errors: 0, Skipped: 0, Time elapsed: 11.291 sec - in
org.apache.activemq.bugs.AMQ3157Test
[05:51:09] Running org.apache.activemq.bugs.AMQ3167Test
[05:51:26] Tests run: 1, Failures: 0, Errors: 0, Skipped: 0, Time elapsed: 16.588 sec - in
org.apache.activemq.bugs.AMQ3167Test
[05:51:26] Running org.apache.activemq.bugs.AMQ3274Test
[05:51:28] Tests run: 1, Failures: 0, Errors: 0, Skipped: 0, Time elapsed: 1.531 sec - in
org.apache.activemq.bugs.AMQ3274Test
[05:51:28] Running org.apache.activemq.bugs.AMQ3324Test
[05:51:32] Tests run: 1, Failures: 0, Errors: 0, Skipped: 0, Time elapsed: 4.245 sec - in
org.apache.activemq.bugs.AMQ3324Test
[05:51:33] Running org.apache.activemq.bugs.AMQ3352Test
[05:51:40] Tests run: 1, Failures: 0, Errors: 0, Skipped: 0, Time elapsed: 7.037 sec - in
org.apache.activemq.bugs.AMQ3352Test
[05:51:41] Running org.apache.activemq.bugs.AMQ3405Test
[05:51:44] Tests run: 1, Failures: 0, Errors: 0, Skipped: 0, Time elapsed: 3.056 sec - in
org.apache.activemq.bugs.AMQ3405Test
[05:51:44] Running org.apache.activemq.bugs.AMQ3436Test
[05:51:52] Tests run: 1, Failures: 0, Errors: 0, Skipped: 0, Time elapsed: 8.331 sec - in
org.apache.activemq.bugs.AMQ3436Test
[05:51:53] Running org.apache.activemq.bugs.AMQ3445Test
[05:52:04] Tests run: 1, Failures: 0, Errors: 0, Skipped: 0, Time elapsed: 10.623 sec - in
org.apache.activemq.bugs.AMQ3445Test
[05:52:04] Running org.apache.activemq.bugs.AMQ3454Test
[05:52:10] Tests run: 1, Failures: 0, Errors: 0, Skipped: 0, Time elapsed: 6.22 sec - in org.apache.activemq.bugs.AMQ3454Test
[05:52:11] Running org.apache.activemq.bugs.AMQ3465Test
[05:52:12] Tests run: 2, Failures: 0, Errors: 0, Skipped: 0, Time elapsed: 0.854 sec - in
org.apache.activemq.bugs.AMQ3465Test
[05:52:12] Running org.apache.activemq.bugs.AMQ3529Test
[05:52:20] Tests run: 1, Failures: 0, Errors: 0, Skipped: 0, Time elapsed: 7.659 sec - in
org.apache.activemq.bugs.AMQ3529Test
[05:52:20] Running org.apache.activemq.bugs.AMQ3537Test
[05:52:21] Tests run: 1, Failures: 0, Errors: 0, Skipped: 0, Time elapsed: 0.173 sec - in
org.apache.activemq.bugs.AMQ3537Test
[05:52:21] Running org.apache.activemq.bugs.AMQ3567Test
[05:54:03] Tests run: 1, Failures: 0, Errors: 0, Skipped: 0, Time elapsed: 102.382 sec - in
org.apache.activemq.bugs.AMQ3567Test
[05:54:04] Running org.apache.activemq.bugs.AMQ3622Test
[05:54:07] Tests run: 1, Failures: 0, Errors: 0, Skipped: 0, Time elapsed: 2.822 sec - in
org.apache.activemq.bugs.AMQ3622Test
[05:54:08] Running org.apache.activemq.bugs.AMQ3625Test
[05:54:21] Tests run: 1, Failures: 0, Errors: 0, Skipped: 0, Time elapsed: 13.398 sec - in
org.apache.activemq.bugs.AMQ3625Test
[05:54:21] Running org.apache.activemq.bugs.AMQ3674Test
[05:54:22] Tests run: 1, Failures: 0, Errors: 0, Skipped: 0, Time elapsed: 1.176 sec - in
org.apache.activemq.bugs.AMQ3674Test
[05:54:23] Running org.apache.activemq.bugs.AMQ3675Test
[05:54:25] Tests run: 1, Failures: 0, Errors: 0, Skipped: 0, Time elapsed: 2.18 sec - in org.apache.activemq.bugs.AMQ3675Test
[05:54:26] Running org.apache.activemq.bugs.AMQ3678Test
[05:54:27] Tests run: 1, Failures: 0, Errors: 0, Skipped: 0, Time elapsed: 1.286 sec - in
org.apache.activemq.bugs.AMQ3678Test
[05:54:28] Running org.apache.activemq.bugs.AMQ3732Test
[05:56:29] Tests run: 1, Failures: 0, Errors: 0, Skipped: 0, Time elapsed: 120.681 sec - in
org.apache.activemq.bugs.AMQ3732Test
[05:56:29] Running org.apache.activemq.bugs.AMQ3779Test
[05:56:31] Tests run: 1, Failures: 0, Errors: 0, Skipped: 0, Time elapsed: 1.704 sec - in
org.apache.activemq.bugs.AMQ3779Test
[05:56:32] Running org.apache.activemq.bugs.AMQ3841Test
[05:56:34] Tests run: 1, Failures: 0, Errors: 0, Skipped: 0, Time elapsed: 2.783 sec - in
org.apache.activemq.bugs.AMQ3841Test
[05:56:35] Running org.apache.activemq.bugs.AMQ3879Test
[05:56:37] Tests run: 1, Failures: 0, Errors: 0, Skipped: 0, Time elapsed: 1.47 sec - in org.apache.activemq.bugs.AMQ3879Test
[05:56:37] Running org.apache.activemq.bugs.AMQ3903Test
[05:56:38] Tests run: 2, Failures: 0, Errors: 0, Skipped: 0, Time elapsed: 0.962 sec - in
org.apache.activemq.bugs.AMQ3903Test
[05:56:38] Running org.apache.activemq.bugs.AMQ3932Test
[05:56:59] Tests run: 3, Failures: 0, Errors: 0, Skipped: 0, Time elapsed: 21.028 sec - in
org.apache.activemq.bugs.AMQ3932Test
[05:57:00] Running org.apache.activemq.bugs.AMQ3934Test
[05:57:01] Tests run: 1, Failures: 0, Errors: 0, Skipped: 0, Time elapsed: 1.177 sec - in
org.apache.activemq.bugs.AMQ3934Test
[05:57:01] Running org.apache.activemq.bugs.AMQ3961Test
[05:57:06] Tests run: 1, Failures: 0, Errors: 0, Skipped: 0, Time elapsed: 4.801 sec - in
org.apache.activemq.bugs.AMQ3961Test
[05:57:07] Running org.apache.activemq.bugs.AMQ3992Test
[05:57:11] Tests run: 1, Failures: 0, Errors: 0, Skipped: 0, Time elapsed: 4.107 sec - in
org.apache.activemq.bugs.AMQ3992Test
[05:57:11] Running org.apache.activemq.bugs.AMQ4062Test
[05:57:18] Tests run: 1, Failures: 0, Errors: 0, Skipped: 0, Time elapsed: 6.152 sec - in
org.apache.activemq.bugs.AMQ4062Test
[05:57:18] Running org.apache.activemq.bugs.AMQ4083Test
[05:58:14] Tests run: 6, Failures: 0, Errors: 0, Skipped: 0, Time elapsed: 56.568 sec - in
org.apache.activemq.bugs.AMQ4083Test
[05:58:16] Running org.apache.activemq.bugs.AMQ4116Test
[05:58:17] Tests run: 2, Failures: 0, Errors: 0, Skipped: 0, Time elapsed: 1.166 sec - in
org.apache.activemq.bugs.AMQ4116Test
[05:58:18] Running org.apache.activemq.bugs.AMQ4126Test
[05:58:23] Tests run: 9, Failures: 0, Errors: 0, Skipped: 0, Time elapsed: 5.228 sec - in
org.apache.activemq.bugs.AMQ4126Test
[05:58:23] Running org.apache.activemq.bugs.AMQ4133Test
[05:58:27] Tests run: 4, Failures: 0, Errors: 0, Skipped: 0, Time elapsed: 3.479 sec - in
org.apache.activemq.bugs.AMQ4133Test
[05:58:27] Running org.apache.activemq.bugs.AMQ4147Test
[05:58:38] Tests run: 2, Failures: 0, Errors: 0, Skipped: 0, Time elapsed: 10.402 sec - in
org.apache.activemq.bugs.AMQ4147Test
[05:58:38] Running org.apache.activemq.bugs.AMQ4148Test
[05:58:50] Tests run: 1, Failures: 0, Errors: 0, Skipped: 0, Time elapsed: 11.397 sec - in
org.apache.activemq.bugs.AMQ4148Test
[05:58:50] Running org.apache.activemq.bugs.AMQ4157Test
[05:58:59] Tests run: 1, Failures: 0, Errors: 0, Skipped: 0, Time elapsed: 8.841 sec - in
org.apache.activemq.bugs.AMQ4157Test
[05:59:00] Running org.apache.activemq.bugs.AMQ4160Test
[05:59:45] Tests run: 3, Failures: 0, Errors: 0, Skipped: 0, Time elapsed: 44.793 sec - in
org.apache.activemq.bugs.AMQ4160Test
[05:59:45] Running org.apache.activemq.bugs.AMQ4212Test
[06:02:12] Tests run: 2, Failures: 0, Errors: 0, Skipped: 0, Time elapsed: 146.219 sec - in
org.apache.activemq.bugs.AMQ4212Test
[06:02:13] Running org.apache.activemq.bugs.AMQ4213Test
[06:02:14] Tests run: 1, Failures: 0, Errors: 0, Skipped: 0, Time elapsed: 1.417 sec - in
org.apache.activemq.bugs.AMQ4213Test
[06:02:15] Running org.apache.activemq.bugs.AMQ4220Test
[06:02:20] Tests run: 1, Failures: 0, Errors: 0, Skipped: 0, Time elapsed: 5.749 sec - in
org.apache.activemq.bugs.AMQ4220Test
[06:02:21] Running org.apache.activemq.bugs.AMQ4221Test
[06:02:55] Running org.apache.activemq.bugs.AMQ4222Test
[06:02:56] Tests run: 1, Failures: 0, Errors: 0, Skipped: 0, Time elapsed: 1.013 sec - in
org.apache.activemq.bugs.AMQ4222Test
[06:02:57] Running org.apache.activemq.bugs.AMQ4323Test
[06:03:33] Tests run: 1, Failures: 0, Errors: 0, Skipped: 0, Time elapsed: 36.552 sec - in
org.apache.activemq.bugs.AMQ4323Test
[06:03:34] Running org.apache.activemq.bugs.AMQ4356Test
[06:03:37] Tests run: 1, Failures: 0, Errors: 0, Skipped: 0, Time elapsed: 3.584 sec - in
org.apache.activemq.bugs.AMQ4356Test
[06:03:38] Running org.apache.activemq.bugs.AMQ4361Test
[06:03:42] Tests run: 1, Failures: 0, Errors: 0, Skipped: 0, Time elapsed: 4.006 sec - in
org.apache.activemq.bugs.AMQ4361Test
[06:03:42] Running org.apache.activemq.bugs.AMQ4368Test
[06:03:55] Tests run: 1, Failures: 0, Errors: 0, Skipped: 0, Time elapsed: 12.718 sec - in
org.apache.activemq.bugs.AMQ4368Test
[06:03:56] Running org.apache.activemq.bugs.AMQ4407Test
[06:03:59] Tests run: 1, Failures: 0, Errors: 0, Skipped: 0, Time elapsed: 3.16 sec - in org.apache.activemq.bugs.AMQ4407Test
[06:04:00] Running org.apache.activemq.bugs.AMQ4413Test
[06:04:06] Tests run: 1, Failures: 0, Errors: 0, Skipped: 0, Time elapsed: 6.384 sec - in
org.apache.activemq.bugs.AMQ4413Test
[06:04:06] Running org.apache.activemq.bugs.AMQ4469Test
[06:04:12] Tests run: 1, Failures: 0, Errors: 0, Skipped: 0, Time elapsed: 5.862 sec - in
org.apache.activemq.bugs.AMQ4469Test
[06:04:13] Running org.apache.activemq.bugs.AMQ4472Test
[06:04:14] Tests run: 1, Failures: 0, Errors: 0, Skipped: 0, Time elapsed: 1.547 sec - in
org.apache.activemq.bugs.AMQ4472Test
[06:04:14] Running org.apache.activemq.bugs.AMQ4475Test
[06:04:19] Tests run: 1, Failures: 0, Errors: 0, Skipped: 0, Time elapsed: 4.551 sec - in
org.apache.activemq.bugs.AMQ4475Test
[06:04:20] Running org.apache.activemq.bugs.AMQ4485LowLimitTest
[06:04:20] Tests run: 1, Failures: 0, Errors: 1, Skipped: 0, Time elapsed: 0.409 sec <<<
FAILURE! - in org.apache.activemq.bugs.AMQ4485LowLimitTest
[06:04:20] testBrokers(org.apache.activemq.bugs.AMQ4485LowLimitTest)  Time elapsed: 0.254
sec  <<< ERROR!
[06:04:20] java.io.IOException: Failed to bind to server socket: tcp://localhost:61600 due
to: java.net.BindException: Address already in use
[06:04:20] 	at java.net.PlainSocketImpl.socketBind(Native Method)
[06:04:20] 	at java.net.AbstractPlainSocketImpl.bind(AbstractPlainSocketImpl.java:376)
[06:04:20] 	at java.net.ServerSocket.bind(ServerSocket.java:376)
[06:04:20] 	at java.net.ServerSocket.<init>(ServerSocket.java:237)
[06:04:20] 	at javax.net.DefaultServerSocketFactory.createServerSocket(ServerSocketFactory.java:231)
[06:04:20] 	at org.apache.activemq.transport.tcp.TcpTransportServer.bind(TcpTransportServer.java:136)
[06:04:20] 	at org.apache.activemq.transport.tcp.TcpTransportFactory.doBind(TcpTransportFactory.java:56)
[06:04:20] 	at org.apache.activemq.transport.TransportFactorySupport.bind(TransportFactorySupport.java:40)
[06:04:20] 	at org.apache.activemq.broker.BrokerService.createTransportConnector(BrokerService.java:2376)
[06:04:20] 	at org.apache.activemq.broker.BrokerService.addConnector(BrokerService.java:318)
[06:04:20] 	at org.apache.activemq.bugs.AMQ4485LowLimitTest.createBroker(AMQ4485LowLimitTest.java:98)
[06:04:20] 	at org.apache.activemq.bugs.AMQ4485LowLimitTest.createBroker(AMQ4485LowLimitTest.java:85)
[06:04:20] 	at org.apache.activemq.bugs.AMQ4485LowLimitTest.testBrokers(AMQ4485LowLimitTest.java:214)
[06:04:20] 
[06:04:20] Running org.apache.activemq.bugs.AMQ4485NetworkOfXBrokersWithNDestsFanoutTransactionTest
[06:04:21] Tests run: 1, Failures: 0, Errors: 1, Skipped: 0, Time elapsed: 0.397 sec <<<
FAILURE! - in org.apache.activemq.bugs.AMQ4485NetworkOfXBrokersWithNDestsFanoutTransactionTest
[06:04:21] testBrokers(org.apache.activemq.bugs.AMQ4485NetworkOfXBrokersWithNDestsFanoutTransactionTest)
 Time elapsed: 0.247 sec  <<< ERROR!
[06:04:21] java.io.IOException: Failed to bind to server socket: tcp://localhost:61600 due
to: java.net.BindException: Address already in use
[06:04:21] 	at java.net.PlainSocketImpl.socketBind(Native Method)
[06:04:21] 	at java.net.AbstractPlainSocketImpl.bind(AbstractPlainSocketImpl.java:376)
[06:04:21] 	at java.net.ServerSocket.bind(ServerSocket.java:376)
[06:04:21] 	at java.net.ServerSocket.<init>(ServerSocket.java:237)
[06:04:21] 	at javax.net.DefaultServerSocketFactory.createServerSocket(ServerSocketFactory.java:231)
[06:04:21] 	at org.apache.activemq.transport.tcp.TcpTransportServer.bind(TcpTransportServer.java:136)
[06:04:21] 	at org.apache.activemq.transport.tcp.TcpTransportFactory.doBind(TcpTransportFactory.java:56)
[06:04:21] 	at org.apache.activemq.transport.TransportFactorySupport.bind(TransportFactorySupport.java:40)
[06:04:21] 	at org.apache.activemq.broker.BrokerService.createTransportConnector(BrokerService.java:2376)
[06:04:21] 	at org.apache.activemq.broker.BrokerService.addConnector(BrokerService.java:318)
[06:04:21] 	at org.apache.activemq.bugs.AMQ4485NetworkOfXBrokersWithNDestsFanoutTransactionTest.createBroker(AMQ4485NetworkOfXBrokersWithNDestsFanoutTransactionTest.java:89)
[06:04:21] 	at org.apache.activemq.bugs.AMQ4485NetworkOfXBrokersWithNDestsFanoutTransactionTest.testBrokers(AMQ4485NetworkOfXBrokersWithNDestsFanoutTransactionTest.java:138)
[06:04:21] 
[06:04:21] Running org.apache.activemq.bugs.AMQ4485Test
[06:04:50] Tests run: 1, Failures: 0, Errors: 0, Skipped: 0, Time elapsed: 28.456 sec - in
org.apache.activemq.bugs.AMQ4485Test
[06:04:50] Running org.apache.activemq.bugs.AMQ4487Test
[06:05:08] Tests run: 2, Failures: 0, Errors: 0, Skipped: 0, Time elapsed: 17.619 sec - in
org.apache.activemq.bugs.AMQ4487Test
[06:05:08] Running org.apache.activemq.bugs.AMQ4504Test
[06:05:10] Tests run: 1, Failures: 0, Errors: 0, Skipped: 0, Time elapsed: 1.917 sec - in
org.apache.activemq.bugs.AMQ4504Test
[06:05:11] Running org.apache.activemq.bugs.AMQ4513Test
[06:05:36] Tests run: 1, Failures: 0, Errors: 0, Skipped: 0, Time elapsed: 25.322 sec - in
org.apache.activemq.bugs.AMQ4513Test
[06:05:37] Running org.apache.activemq.bugs.AMQ4517Test
[06:05:39] Tests run: 1, Failures: 0, Errors: 0, Skipped: 0, Time elapsed: 1.594 sec - in
org.apache.activemq.bugs.AMQ4517Test
[06:05:40] Running org.apache.activemq.bugs.AMQ4518Test
[06:05:41] Tests run: 1, Failures: 0, Errors: 0, Skipped: 0, Time elapsed: 1.676 sec - in
org.apache.activemq.bugs.AMQ4518Test
[06:05:42] Running org.apache.activemq.bugs.AMQ4530Test
[06:05:44] Tests run: 1, Failures: 0, Errors: 0, Skipped: 0, Time elapsed: 1.966 sec - in
org.apache.activemq.bugs.AMQ4530Test
[06:05:44] Running org.apache.activemq.bugs.AMQ4531Test
[06:05:45] Tests run: 1, Failures: 0, Errors: 0, Skipped: 0, Time elapsed: 0.917 sec - in
org.apache.activemq.bugs.AMQ4531Test
[06:05:46] Running org.apache.activemq.bugs.AMQ4554Test
[06:05:47] Tests run: 1, Failures: 0, Errors: 0, Skipped: 0, Time elapsed: 0.942 sec - in
org.apache.activemq.bugs.AMQ4554Test
[06:05:47] Running org.apache.activemq.bugs.AMQ4582Test
[06:05:48] Tests run: 1, Failures: 0, Errors: 0, Skipped: 0, Time elapsed: 1.013 sec - in
org.apache.activemq.bugs.AMQ4582Test
[06:05:49] Running org.apache.activemq.bugs.AMQ4595Test
[06:07:28] Tests run: 3, Failures: 0, Errors: 0, Skipped: 0, Time elapsed: 99.172 sec - in
org.apache.activemq.bugs.AMQ4595Test
[06:07:29] Running org.apache.activemq.bugs.AMQ4636Test
[06:07:56] Tests run: 3, Failures: 0, Errors: 0, Skipped: 0, Time elapsed: 27.13 sec - in
org.apache.activemq.bugs.AMQ4636Test
[06:07:56] Running org.apache.activemq.bugs.AMQ4656Test
[06:08:04] Tests run: 2, Failures: 0, Errors: 0, Skipped: 0, Time elapsed: 7.225 sec - in
org.apache.activemq.bugs.AMQ4656Test
[06:08:04] Running org.apache.activemq.bugs.AMQ4671Test
[06:08:05] Tests run: 1, Failures: 0, Errors: 0, Skipped: 0, Time elapsed: 1.052 sec - in
org.apache.activemq.bugs.AMQ4671Test
[06:08:06] Running org.apache.activemq.bugs.AMQ4677Test
[06:08:54] Tests run: 1, Failures: 0, Errors: 0, Skipped: 0, Time elapsed: 47.838 sec - in
org.apache.activemq.bugs.AMQ4677Test
[06:08:55] Running org.apache.activemq.bugs.AMQ4853Test
[06:08:56] Tests run: 3, Failures: 0, Errors: 0, Skipped: 2, Time elapsed: 0.864 sec - in
org.apache.activemq.bugs.AMQ4853Test
[06:08:56] Running org.apache.activemq.bugs.AMQ4887Test
[06:09:00] Tests run: 4, Failures: 0, Errors: 0, Skipped: 0, Time elapsed: 3.512 sec - in
org.apache.activemq.bugs.AMQ4887Test
[06:09:01] Running org.apache.activemq.bugs.AMQ4893Test
[06:09:01] Tests run: 4, Failures: 0, Errors: 0, Skipped: 0, Time elapsed: 0.307 sec - in
org.apache.activemq.bugs.AMQ4893Test
[06:09:02] Running org.apache.activemq.bugs.AMQ4899Test
[06:09:07] Tests run: 1, Failures: 0, Errors: 0, Skipped: 0, Time elapsed: 5.525 sec - in
org.apache.activemq.bugs.AMQ4899Test
[06:09:08] Running org.apache.activemq.bugs.AMQ4930Test
[06:09:31] Tests run: 3, Failures: 0, Errors: 0, Skipped: 0, Time elapsed: 23.196 sec - in
org.apache.activemq.bugs.AMQ4930Test
[06:09:32] Running org.apache.activemq.bugs.AMQ4950Test
[06:09:33] Tests run: 1, Failures: 0, Errors: 0, Skipped: 0, Time elapsed: 1.464 sec - in
org.apache.activemq.bugs.AMQ4950Test
[06:09:34] Running org.apache.activemq.bugs.AMQ4952Test
[06:10:18] Tests run: 2, Failures: 0, Errors: 0, Skipped: 0, Time elapsed: 44.7 sec - in org.apache.activemq.bugs.AMQ4952Test
[06:10:19] Running org.apache.activemq.bugs.AMQ5035Test
[06:10:22] Tests run: 1, Failures: 0, Errors: 0, Skipped: 0, Time elapsed: 3.438 sec - in
org.apache.activemq.bugs.AMQ5035Test
[06:10:22] Running org.apache.activemq.bugs.AMQ5136Test
[06:10:24] Tests run: 2, Failures: 0, Errors: 0, Skipped: 0, Time elapsed: 1.365 sec - in
org.apache.activemq.bugs.AMQ5136Test
[06:10:24] Running org.apache.activemq.bugs.AMQ5212Test
[06:10:51] Tests run: 8, Failures: 0, Errors: 0, Skipped: 0, Time elapsed: 26.986 sec - in
org.apache.activemq.bugs.AMQ5212Test
[06:10:52] Running org.apache.activemq.bugs.AMQ5266Test
[06:20:53] Running org.apache.activemq.bugs.AMQ5274Test
[06:21:09] Tests run: 1, Failures: 0, Errors: 0, Skipped: 0, Time elapsed: 15.874 sec - in
org.apache.activemq.bugs.AMQ5274Test
[06:21:11] Running org.apache.activemq.bugs.ActiveMQSlowConsumerManualTest
[06:21:22] Tests run: 4, Failures: 0, Errors: 0, Skipped: 0, Time elapsed: 10.532 sec - in
org.apache.activemq.bugs.ActiveMQSlowConsumerManualTest
[06:21:23] Running org.apache.activemq.bugs.ConnectionPerMessageTest
[06:31:23] Running org.apache.activemq.bugs.CraigsBugTest
[06:31:27] Tests run: 1, Failures: 0, Errors: 0, Skipped: 0, Time elapsed: 4.171 sec - in
org.apache.activemq.bugs.CraigsBugTest
[06:31:28] Running org.apache.activemq.bugs.DoubleExpireTest
[06:32:29] Tests run: 1, Failures: 0, Errors: 0, Skipped: 0, Time elapsed: 61.057 sec - in
org.apache.activemq.bugs.DoubleExpireTest
[06:32:29] Running org.apache.activemq.bugs.DurableConsumerTest
[06:35:41] Tests run: 6, Failures: 1, Errors: 0, Skipped: 0, Time elapsed: 191.527 sec <<<
FAILURE! - in org.apache.activemq.bugs.DurableConsumerTest
[06:35:41] testFailover(org.apache.activemq.bugs.DurableConsumerTest)  Time elapsed: 19.827
sec  <<< FAILURE!
[06:35:41] junit.framework.AssertionFailedError: no exceptions: [javax.jms.JMSException: java.lang.NullPointerException]
[06:35:41] 	at junit.framework.Assert.fail(Assert.java:57)
[06:35:41] 	at junit.framework.Assert.assertTrue(Assert.java:22)
[06:35:41] 	at junit.framework.TestCase.assertTrue(TestCase.java:192)
[06:35:41] 	at org.apache.activemq.bugs.DurableConsumerTest.testFailover(DurableConsumerTest.java:204)
[06:35:41] 
[06:35:42] Running org.apache.activemq.bugs.JMSDurableTopicNoLocalTest
[06:45:42] Running org.apache.activemq.bugs.JmsDurableTopicSlowReceiveTest
[06:55:43] Running org.apache.activemq.bugs.JmsTimeoutTest
[06:56:00] Tests run: 2, Failures: 0, Errors: 0, Skipped: 0, Time elapsed: 17.766 sec - in
org.apache.activemq.bugs.JmsTimeoutTest
[06:56:01] Running org.apache.activemq.bugs.MemoryUsageBlockResumeTest
[06:56:06] Tests run: 1, Failures: 0, Errors: 0, Skipped: 0, Time elapsed: 5.115 sec - in
org.apache.activemq.bugs.MemoryUsageBlockResumeTest
[06:56:08] Running org.apache.activemq.bugs.MemoryUsageBrokerTest
[06:57:16] Tests run: 1, Failures: 0, Errors: 0, Skipped: 0, Time elapsed: 68.251 sec - in
org.apache.activemq.bugs.MemoryUsageBrokerTest
[06:57:17] Running org.apache.activemq.bugs.MemoryUsageCleanupTest
[07:00:50] Tests run: 1, Failures: 0, Errors: 0, Skipped: 0, Time elapsed: 213.126 sec - in
org.apache.activemq.bugs.MemoryUsageCleanupTest
[07:00:51] Running org.apache.activemq.bugs.MessageExpirationReaperTest
[07:01:01] Tests run: 2, Failures: 0, Errors: 0, Skipped: 0, Time elapsed: 9.506 sec - in
org.apache.activemq.bugs.MessageExpirationReaperTest
[07:01:02] Running org.apache.activemq.bugs.MissingDataFileTest
[07:02:55] 
[07:02:55] Results :
[07:02:55] 
[07:02:55] Failed tests: 
[07:02:55]   DbRestartJDBCQueueMasterSlaveLeaseQuiesceTest>CombinationTestSupport.runBare:113->CombinationTestSupport.runBare:107->QueueMasterSlaveTestSupport.testVirtualTopicFailover:132
slave started
[07:02:55]   VirtualTopicsAndDurableSubsTest>CombinationTestSupport.runBare:113->CombinationTestSupport.runBare:107->MBeanTest.testDestinationOptionsAreVisible:986->MBeanTest.assertRegisteredObjectName:741
Could not find MBean!: org.apache.activemq:type=Broker,brokerName=localhost,destinationType=Queue,destinationName=QueueWithOptions
[07:02:55]   AMQ2149LevelDBTest>AMQ2149Test.testQueueTransactionalOrderWithRestart:412->AMQ2149Test.doTestTransactionalOrderWithRestart:435->AMQ2149Test.verifyOrderedMessageReceipt:560
No exceptions
[07:02:55]   AMQ2149LevelDBTest>AMQ2149Test.testTopicTransactionalOrderWithRestart:417->AMQ2149Test.doTestTransactionalOrderWithRestart:435->AMQ2149Test.verifyOrderedMessageReceipt:549
No timeout waiting for senders/receivers to complete
[07:02:55]   AMQ2149Test.testQueueTransactionalOrderWithRestart:412->doTestTransactionalOrderWithRestart:435->verifyOrderedMessageReceipt:549
No timeout waiting for senders/receivers to complete
[07:02:55]   AMQ2149Test.testOrderWithRestart:382->verifyOrderedMessageReceipt:505->verifyOrderedMessageReceipt:549
No timeout waiting for senders/receivers to complete
[07:02:55]   AMQ3141Test.testNoMissingMessagesOnShortScheduleDelay:109 expect all messages
received but 3 are missing
[07:02:55]   DurableConsumerTest>CombinationTestSupport.runBare:107->testFailover:204
no exceptions: [javax.jms.JMSException: java.lang.NullPointerException]
[07:02:55] 
[07:02:55] Tests in error: 
[07:02:55]   AMQ2870Test.testSize:120->sendMessage:169 ?  test timed out after 300000 milli...
[07:02:55]   AMQ4485LowLimitTest>CombinationTestSupport.runBare:113->CombinationTestSupport.runBare:107->testBrokers:214->createBroker:85->createBroker:98
? IO
[07:02:55]   AMQ4485NetworkOfXBrokersWithNDestsFanoutTransactionTest>CombinationTestSupport.runBare:113->CombinationTestSupport.runBare:107->testBrokers:138->createBroker:89
? IO
[07:02:55] 
[07:02:55] Tests run: 1642, Failures: 6, Errors: 2, Skipped: 6
[07:02:55] 
[JENKINS] Recording test results
[07:03:15] 

Mime
View raw message