activemq-dev mailing list archives

Site index · List index
Message view « Date » · « Thread »
Top « Date » · « Thread »
From Apache Jenkins Server <jenk...@builds.apache.org>
Subject Build failed in Jenkins: ActiveMQ » ActiveMQ :: Unit Tests #1509
Date Tue, 19 Aug 2014 10:00:14 GMT
See <https://builds.apache.org/job/ActiveMQ/org.apache.activemq$activemq-unit-tests/1509/changes>

Changes:

[tabish121] https://issues.apache.org/jira/browse/AMQ-5281

[tabish121] This test does not need a management context, disable JMX

[tabish121] Make the test more tolerant of slow machines by replacing fixed length

------------------------------------------
[...truncated 873 lines...]
[08:01:22] Running org.apache.activemq.broker.scheduler.memory.InMemoryJobSchedulerTxTest
[08:01:35] Tests run: 2, Failures: 0, Errors: 0, Skipped: 0, Time elapsed: 12.706 sec - in
org.apache.activemq.broker.scheduler.memory.InMemoryJobSchedulerTxTest
[08:01:35] Running org.apache.activemq.broker.store.DefaultStoreBrokerTest
[08:03:56] Tests run: 129, Failures: 0, Errors: 0, Skipped: 0, Time elapsed: 141.28 sec -
in org.apache.activemq.broker.store.DefaultStoreBrokerTest
[08:03:58] Running org.apache.activemq.broker.store.DefaultStoreRecoveryBrokerTest
[08:04:52] Tests run: 9, Failures: 0, Errors: 0, Skipped: 0, Time elapsed: 54.209 sec - in
org.apache.activemq.broker.store.DefaultStoreRecoveryBrokerTest
[08:04:54] Running org.apache.activemq.broker.store.RecoverExpiredMessagesTest
[08:05:48] Tests run: 4, Failures: 0, Errors: 0, Skipped: 0, Time elapsed: 53.961 sec - in
org.apache.activemq.broker.store.RecoverExpiredMessagesTest
[08:05:48] Running org.apache.activemq.broker.util.DestinationsPluginTest
[08:05:49] Tests run: 1, Failures: 0, Errors: 0, Skipped: 0, Time elapsed: 0.804 sec - in
org.apache.activemq.broker.util.DestinationsPluginTest
[08:05:51] Running org.apache.activemq.broker.util.PluginBrokerTest
[08:05:55] Tests run: 1, Failures: 0, Errors: 0, Skipped: 0, Time elapsed: 4.373 sec - in
org.apache.activemq.broker.util.PluginBrokerTest
[08:05:56] Running org.apache.activemq.broker.util.RedeliveryPluginTest
[08:05:58] Tests run: 1, Failures: 0, Errors: 0, Skipped: 0, Time elapsed: 1.501 sec - in
org.apache.activemq.broker.util.RedeliveryPluginTest
[08:05:59] Running org.apache.activemq.broker.util.TimeStampingBrokerPluginTest
[08:06:01] Tests run: 3, Failures: 0, Errors: 0, Skipped: 0, Time elapsed: 2.866 sec - in
org.apache.activemq.broker.util.TimeStampingBrokerPluginTest
[08:06:03] Running org.apache.activemq.broker.util.TraceBrokerPathPluginTest
[08:06:06] Tests run: 1, Failures: 0, Errors: 0, Skipped: 0, Time elapsed: 3.159 sec - in
org.apache.activemq.broker.util.TraceBrokerPathPluginTest
[08:06:08] Running org.apache.activemq.broker.virtual.CompositeQueueTest
[08:06:12] Tests run: 1, Failures: 0, Errors: 0, Skipped: 0, Time elapsed: 4.092 sec - in
org.apache.activemq.broker.virtual.CompositeQueueTest
[08:06:13] Running org.apache.activemq.broker.virtual.CompositeTopicTest
[08:06:17] Tests run: 1, Failures: 0, Errors: 0, Skipped: 0, Time elapsed: 3.81 sec - in org.apache.activemq.broker.virtual.CompositeTopicTest
[08:06:18] Running org.apache.activemq.broker.virtual.DestinationInterceptorDurableSubTest
[08:06:23] Tests run: 1, Failures: 0, Errors: 0, Skipped: 0, Time elapsed: 4.597 sec - in
org.apache.activemq.broker.virtual.DestinationInterceptorDurableSubTest
[08:06:25] Running org.apache.activemq.broker.virtual.FilteredQueueTest
[08:06:30] Tests run: 1, Failures: 0, Errors: 0, Skipped: 0, Time elapsed: 5.791 sec - in
org.apache.activemq.broker.virtual.FilteredQueueTest
[08:06:31] Running org.apache.activemq.broker.virtual.MirroredQueueCorrectMemoryUsageTest
[08:15:21] Tests run: 1, Failures: 0, Errors: 0, Skipped: 0, Time elapsed: 529.593 sec - in
org.apache.activemq.broker.virtual.MirroredQueueCorrectMemoryUsageTest
[08:15:23] Running org.apache.activemq.broker.virtual.MirroredQueueTest
[08:15:24] Tests run: 2, Failures: 0, Errors: 0, Skipped: 0, Time elapsed: 1.02 sec - in org.apache.activemq.broker.virtual.MirroredQueueTest
[08:15:25] Running org.apache.activemq.broker.virtual.MirroredQueueUsingVirtualTopicQueueTest
[08:15:26] Tests run: 2, Failures: 0, Errors: 0, Skipped: 0, Time elapsed: 0.983 sec - in
org.apache.activemq.broker.virtual.MirroredQueueUsingVirtualTopicQueueTest
[08:15:28] Running org.apache.activemq.broker.virtual.VirtualDestPerfTest
[08:15:28] Tests run: 2, Failures: 0, Errors: 0, Skipped: 2, Time elapsed: 0.089 sec - in
org.apache.activemq.broker.virtual.VirtualDestPerfTest
[08:15:29] Running org.apache.activemq.broker.virtual.VirtualTopicDLQTest
[08:15:38] Tests run: 1, Failures: 0, Errors: 0, Skipped: 0, Time elapsed: 9.088 sec - in
org.apache.activemq.broker.virtual.VirtualTopicDLQTest
[08:15:38] Running org.apache.activemq.broker.virtual.VirtualTopicDisconnectSelectorTest
[08:15:46] Tests run: 2, Failures: 0, Errors: 0, Skipped: 0, Time elapsed: 7.522 sec - in
org.apache.activemq.broker.virtual.VirtualTopicDisconnectSelectorTest
[08:15:48] Running org.apache.activemq.broker.virtual.VirtualTopicPubSubTest
[08:15:49] Tests run: 2, Failures: 0, Errors: 0, Skipped: 0, Time elapsed: 1.339 sec - in
org.apache.activemq.broker.virtual.VirtualTopicPubSubTest
[08:15:50] Running org.apache.activemq.broker.virtual.VirtualTopicPubSubUsingXBeanTest
[08:15:52] Tests run: 2, Failures: 0, Errors: 0, Skipped: 0, Time elapsed: 2.054 sec - in
org.apache.activemq.broker.virtual.VirtualTopicPubSubUsingXBeanTest
[08:15:53] Running org.apache.activemq.broker.virtual.VirtualTopicSelectorTest
[08:15:56] Tests run: 1, Failures: 0, Errors: 0, Skipped: 0, Time elapsed: 2.11 sec - in org.apache.activemq.broker.virtual.VirtualTopicSelectorTest
[08:15:57] Running org.apache.activemq.broker.virtual.VirtualTopicsAndDurableSubsTest
[08:16:18] Tests run: 27, Failures: 1, Errors: 0, Skipped: 0, Time elapsed: 20.709 sec <<<
FAILURE! - in org.apache.activemq.broker.virtual.VirtualTopicsAndDurableSubsTest
[08:16:18] testDestinationOptionsAreVisible(org.apache.activemq.broker.virtual.VirtualTopicsAndDurableSubsTest)
 Time elapsed: 0.035 sec  <<< FAILURE!
[08:16:18] junit.framework.AssertionFailedError: Could not find MBean!: org.apache.activemq:type=Broker,brokerName=localhost,destinationType=Queue,destinationName=QueueWithOptions
[08:16:18] 	at junit.framework.Assert.fail(Assert.java:57)
[08:16:18] 	at junit.framework.TestCase.fail(TestCase.java:227)
[08:16:18] 	at org.apache.activemq.broker.jmx.MBeanTest.assertRegisteredObjectName(MBeanTest.java:741)
[08:16:18] 	at org.apache.activemq.broker.jmx.MBeanTest.testDestinationOptionsAreVisible(MBeanTest.java:986)
[08:16:18] 	at sun.reflect.NativeMethodAccessorImpl.invoke0(Native Method)
[08:16:18] 	at sun.reflect.NativeMethodAccessorImpl.invoke(NativeMethodAccessorImpl.java:57)
[08:16:18] 	at sun.reflect.DelegatingMethodAccessorImpl.invoke(DelegatingMethodAccessorImpl.java:43)
[08:16:18] 	at java.lang.reflect.Method.invoke(Method.java:606)
[08:16:18] 	at junit.framework.TestCase.runTest(TestCase.java:176)
[08:16:18] 	at junit.framework.TestCase.runBare(TestCase.java:141)
[08:16:18] 	at org.apache.activemq.CombinationTestSupport.runBare(CombinationTestSupport.java:107)
[08:16:18] 	at org.apache.activemq.CombinationTestSupport.runBare(CombinationTestSupport.java:113)
[08:16:18] 	at junit.framework.TestResult$1.protect(TestResult.java:122)
[08:16:18] 	at junit.framework.TestResult.runProtected(TestResult.java:142)
[08:16:18] 	at junit.framework.TestResult.run(TestResult.java:125)
[08:16:18] 	at junit.framework.TestCase.run(TestCase.java:129)
[08:16:18] 	at junit.framework.TestSuite.runTest(TestSuite.java:255)
[08:16:18] 	at junit.framework.TestSuite.run(TestSuite.java:250)
[08:16:18] 	at org.junit.internal.runners.JUnit38ClassRunner.run(JUnit38ClassRunner.java:84)
[08:16:18] 	at org.apache.maven.surefire.junit4.JUnit4Provider.execute(JUnit4Provider.java:264)
[08:16:18] 	at org.apache.maven.surefire.junit4.JUnit4Provider.executeTestSet(JUnit4Provider.java:153)
[08:16:18] 	at org.apache.maven.surefire.junit4.JUnit4Provider.invoke(JUnit4Provider.java:124)
[08:16:18] 	at org.apache.maven.surefire.booter.ForkedBooter.invokeProviderInSameClassLoader(ForkedBooter.java:200)
[08:16:18] 	at org.apache.maven.surefire.booter.ForkedBooter.runSuitesInProcess(ForkedBooter.java:153)
[08:16:18] 	at org.apache.maven.surefire.booter.ForkedBooter.main(ForkedBooter.java:103)
[08:16:18] 
[08:16:19] Running org.apache.activemq.bugs.AMQ1687Test
[08:16:20] Tests run: 1, Failures: 0, Errors: 0, Skipped: 0, Time elapsed: 1.219 sec - in
org.apache.activemq.bugs.AMQ1687Test
[08:16:21] Running org.apache.activemq.bugs.AMQ1853Test
[08:16:28] Tests run: 1, Failures: 0, Errors: 0, Skipped: 0, Time elapsed: 7.7 sec - in org.apache.activemq.bugs.AMQ1853Test
[08:16:29] Running org.apache.activemq.bugs.AMQ1893Test
[08:26:29] Running org.apache.activemq.bugs.AMQ1917Test
[08:26:36] Tests run: 1, Failures: 0, Errors: 0, Skipped: 0, Time elapsed: 7.185 sec - in
org.apache.activemq.bugs.AMQ1917Test
[08:26:37] Running org.apache.activemq.bugs.AMQ1936Test
[08:36:38] Running org.apache.activemq.bugs.AMQ2021Test
[08:46:37] Running org.apache.activemq.bugs.AMQ2084Test
[08:46:44] Tests run: 2, Failures: 0, Errors: 0, Skipped: 0, Time elapsed: 6.981 sec - in
org.apache.activemq.bugs.AMQ2084Test
[08:46:45] Running org.apache.activemq.bugs.AMQ2103Test
[08:46:46] Tests run: 2, Failures: 0, Errors: 0, Skipped: 0, Time elapsed: 1.192 sec - in
org.apache.activemq.bugs.AMQ2103Test
[08:46:48] Running org.apache.activemq.bugs.AMQ2149LevelDBTest
[08:55:06] Killed
[08:55:06] Running org.apache.activemq.bugs.AMQ2149Test
[09:05:08] Running org.apache.activemq.bugs.AMQ2171Test
[09:06:40] Tests run: 2, Failures: 0, Errors: 0, Skipped: 0, Time elapsed: 91.812 sec - in
org.apache.activemq.bugs.AMQ2171Test
[09:06:40] Running org.apache.activemq.bugs.AMQ2200Test
[09:06:43] Tests run: 1, Failures: 0, Errors: 0, Skipped: 0, Time elapsed: 2.599 sec - in
org.apache.activemq.bugs.AMQ2200Test
[09:06:43] Running org.apache.activemq.bugs.AMQ2213Test
[09:06:47] Tests run: 3, Failures: 0, Errors: 0, Skipped: 0, Time elapsed: 3.303 sec - in
org.apache.activemq.bugs.AMQ2213Test
[09:06:47] Running org.apache.activemq.bugs.AMQ2314Test
[09:08:27] Tests run: 2, Failures: 0, Errors: 0, Skipped: 0, Time elapsed: 100.388 sec - in
org.apache.activemq.bugs.AMQ2314Test
[09:08:28] Running org.apache.activemq.bugs.AMQ2356Test
[09:14:59] Tests run: 1, Failures: 0, Errors: 0, Skipped: 0, Time elapsed: 390.976 sec - in
org.apache.activemq.bugs.AMQ2356Test
[09:14:59] Running org.apache.activemq.bugs.AMQ2364Test
[09:15:43] Tests run: 1, Failures: 0, Errors: 0, Skipped: 0, Time elapsed: 44.036 sec - in
org.apache.activemq.bugs.AMQ2364Test
[09:15:44] Running org.apache.activemq.bugs.AMQ2383Test
[09:15:45] Tests run: 1, Failures: 0, Errors: 0, Skipped: 0, Time elapsed: 0.758 sec - in
org.apache.activemq.bugs.AMQ2383Test
[09:15:45] Running org.apache.activemq.bugs.AMQ2401Test
[09:16:07] Tests run: 1, Failures: 0, Errors: 0, Skipped: 0, Time elapsed: 21.669 sec - in
org.apache.activemq.bugs.AMQ2401Test
[09:16:07] Running org.apache.activemq.bugs.AMQ2413Test
[09:19:19] Tests run: 8, Failures: 0, Errors: 0, Skipped: 0, Time elapsed: 192.141 sec - in
org.apache.activemq.bugs.AMQ2413Test
[09:19:20] Running org.apache.activemq.bugs.AMQ2439Test
[09:20:41] Tests run: 1, Failures: 0, Errors: 0, Skipped: 0, Time elapsed: 80.975 sec - in
org.apache.activemq.bugs.AMQ2439Test
[09:20:41] Running org.apache.activemq.bugs.AMQ2489Test
[09:20:46] Tests run: 2, Failures: 0, Errors: 0, Skipped: 0, Time elapsed: 5.047 sec - in
org.apache.activemq.bugs.AMQ2489Test
[09:20:48] Running org.apache.activemq.bugs.AMQ2512Test
[09:21:29] Tests run: 1, Failures: 0, Errors: 0, Skipped: 0, Time elapsed: 41.112 sec - in
org.apache.activemq.bugs.AMQ2512Test
[09:21:30] Running org.apache.activemq.bugs.AMQ2513Test
[09:21:32] Tests run: 1, Failures: 0, Errors: 0, Skipped: 0, Time elapsed: 2.648 sec - in
org.apache.activemq.bugs.AMQ2513Test
[09:21:33] Running org.apache.activemq.bugs.AMQ2528Test
[09:21:33] Tests run: 1, Failures: 0, Errors: 0, Skipped: 0, Time elapsed: 0.905 sec - in
org.apache.activemq.bugs.AMQ2528Test
[09:21:34] Running org.apache.activemq.bugs.AMQ2571Test
[09:21:35] Tests run: 1, Failures: 0, Errors: 0, Skipped: 0, Time elapsed: 0.833 sec - in
org.apache.activemq.bugs.AMQ2571Test
[09:21:35] Running org.apache.activemq.bugs.AMQ2580Test
[09:21:49] Tests run: 5, Failures: 0, Errors: 0, Skipped: 0, Time elapsed: 13.387 sec - in
org.apache.activemq.bugs.AMQ2580Test
[09:21:49] Running org.apache.activemq.bugs.AMQ2584ConcurrentDlqTest
[09:23:20] Tests run: 1, Failures: 0, Errors: 0, Skipped: 0, Time elapsed: 90.683 sec - in
org.apache.activemq.bugs.AMQ2584ConcurrentDlqTest
[09:23:20] Running org.apache.activemq.bugs.AMQ2584Test
[09:25:24] Tests run: 2, Failures: 0, Errors: 0, Skipped: 0, Time elapsed: 123.628 sec - in
org.apache.activemq.bugs.AMQ2584Test
[09:25:25] Running org.apache.activemq.bugs.AMQ2585Test
[09:25:26] Tests run: 1, Failures: 0, Errors: 0, Skipped: 0, Time elapsed: 0.991 sec - in
org.apache.activemq.bugs.AMQ2585Test
[09:25:26] Running org.apache.activemq.bugs.AMQ2616Test
[09:25:30] Tests run: 1, Failures: 0, Errors: 0, Skipped: 0, Time elapsed: 3.354 sec - in
org.apache.activemq.bugs.AMQ2616Test
[09:25:30] Running org.apache.activemq.bugs.AMQ2645Test
[09:25:36] Tests run: 1, Failures: 0, Errors: 0, Skipped: 0, Time elapsed: 6.1 sec - in org.apache.activemq.bugs.AMQ2645Test
[09:25:37] Running org.apache.activemq.bugs.AMQ2736Test
[09:25:41] Tests run: 1, Failures: 0, Errors: 0, Skipped: 0, Time elapsed: 3.785 sec - in
org.apache.activemq.bugs.AMQ2736Test
[09:25:41] Running org.apache.activemq.bugs.AMQ2751Test
[09:25:48] Tests run: 1, Failures: 0, Errors: 0, Skipped: 0, Time elapsed: 7.137 sec - in
org.apache.activemq.bugs.AMQ2751Test
[09:25:49] Running org.apache.activemq.bugs.AMQ2801Test
[09:27:26] Tests run: 1, Failures: 0, Errors: 0, Skipped: 0, Time elapsed: 97.253 sec - in
org.apache.activemq.bugs.AMQ2801Test
[09:27:26] Running org.apache.activemq.bugs.AMQ2832Test
[09:27:57] Tests run: 2, Failures: 0, Errors: 0, Skipped: 0, Time elapsed: 30.316 sec - in
org.apache.activemq.bugs.AMQ2832Test
[09:27:57] Running org.apache.activemq.bugs.AMQ2870Test
[09:38:00] Running org.apache.activemq.bugs.AMQ2902Test
[09:38:01] Tests run: 2, Failures: 0, Errors: 0, Skipped: 0, Time elapsed: 0.911 sec - in
org.apache.activemq.bugs.AMQ2902Test
[09:38:01] Running org.apache.activemq.bugs.AMQ2910Test
[09:38:06] Tests run: 1, Failures: 0, Errors: 0, Skipped: 0, Time elapsed: 4.46 sec - in org.apache.activemq.bugs.AMQ2910Test
[09:38:06] Running org.apache.activemq.bugs.AMQ2982Test
[09:38:42] Tests run: 1, Failures: 0, Errors: 0, Skipped: 0, Time elapsed: 35.179 sec - in
org.apache.activemq.bugs.AMQ2982Test
[09:38:42] Running org.apache.activemq.bugs.AMQ2983Test
[09:40:53] Tests run: 1, Failures: 0, Errors: 0, Skipped: 0, Time elapsed: 131.171 sec - in
org.apache.activemq.bugs.AMQ2983Test
[09:40:54] Running org.apache.activemq.bugs.AMQ3014Test
[09:40:55] Tests run: 2, Failures: 0, Errors: 0, Skipped: 0, Time elapsed: 1.47 sec - in org.apache.activemq.bugs.AMQ3014Test
[09:40:56] Running org.apache.activemq.bugs.AMQ3120Test
[09:46:50] Tests run: 1, Failures: 0, Errors: 0, Skipped: 0, Time elapsed: 354.631 sec - in
org.apache.activemq.bugs.AMQ3120Test
[09:46:51] Running org.apache.activemq.bugs.AMQ3140Test
[09:49:03] Tests run: 1, Failures: 0, Errors: 0, Skipped: 0, Time elapsed: 131.798 sec - in
org.apache.activemq.bugs.AMQ3140Test
[09:49:03] Running org.apache.activemq.bugs.AMQ3141Test
[09:49:16] Tests run: 1, Failures: 0, Errors: 0, Skipped: 0, Time elapsed: 13.157 sec - in
org.apache.activemq.bugs.AMQ3141Test
[09:49:16] Running org.apache.activemq.bugs.AMQ3145Test
[09:49:19] Tests run: 1, Failures: 0, Errors: 0, Skipped: 0, Time elapsed: 3.037 sec - in
org.apache.activemq.bugs.AMQ3145Test
[09:49:20] Running org.apache.activemq.bugs.AMQ3157Test
[09:49:31] Tests run: 1, Failures: 0, Errors: 0, Skipped: 0, Time elapsed: 10.989 sec - in
org.apache.activemq.bugs.AMQ3157Test
[09:49:31] Running org.apache.activemq.bugs.AMQ3167Test
[09:49:49] Tests run: 1, Failures: 0, Errors: 0, Skipped: 0, Time elapsed: 17.281 sec - in
org.apache.activemq.bugs.AMQ3167Test
[09:49:49] Running org.apache.activemq.bugs.AMQ3274Test
[09:49:50] Tests run: 1, Failures: 0, Errors: 0, Skipped: 0, Time elapsed: 1.441 sec - in
org.apache.activemq.bugs.AMQ3274Test
[09:49:51] Running org.apache.activemq.bugs.AMQ3324Test
[09:49:55] Tests run: 1, Failures: 0, Errors: 0, Skipped: 0, Time elapsed: 4.089 sec - in
org.apache.activemq.bugs.AMQ3324Test
[09:49:57] Running org.apache.activemq.bugs.AMQ3352Test
[09:50:01] Tests run: 1, Failures: 0, Errors: 0, Skipped: 0, Time elapsed: 4.236 sec - in
org.apache.activemq.bugs.AMQ3352Test
[09:50:02] Running org.apache.activemq.bugs.AMQ3405Test
[09:50:05] Tests run: 1, Failures: 0, Errors: 0, Skipped: 0, Time elapsed: 3.035 sec - in
org.apache.activemq.bugs.AMQ3405Test
[09:50:05] Running org.apache.activemq.bugs.AMQ3436Test
[09:50:14] Tests run: 1, Failures: 0, Errors: 0, Skipped: 0, Time elapsed: 8.765 sec - in
org.apache.activemq.bugs.AMQ3436Test
[09:50:16] Running org.apache.activemq.bugs.AMQ3445Test
[09:50:25] Tests run: 1, Failures: 0, Errors: 1, Skipped: 0, Time elapsed: 9.189 sec <<<
FAILURE! - in org.apache.activemq.bugs.AMQ3445Test
[09:50:25] testJDBCRetiansDestinationAfterRestart(org.apache.activemq.bugs.AMQ3445Test)  Time
elapsed: 9.107 sec  <<< ERROR!
[09:50:25] java.lang.reflect.UndeclaredThrowableException: null
[09:50:25] 	at com.sun.jmx.interceptor.DefaultMBeanServerInterceptor.getMBean(DefaultMBeanServerInterceptor.java:1095)
[09:50:25] 	at com.sun.jmx.interceptor.DefaultMBeanServerInterceptor.getAttribute(DefaultMBeanServerInterceptor.java:643)
[09:50:25] 	at com.sun.jmx.mbeanserver.JmxMBeanServer.getAttribute(JmxMBeanServer.java:678)
[09:50:25] 	at javax.management.MBeanServerInvocationHandler.invoke(MBeanServerInvocationHandler.java:267)
[09:50:25] 	at com.sun.proxy.$Proxy8.getQueueSize(Unknown Source)
[09:50:25] 	at org.apache.activemq.bugs.AMQ3445Test.testJDBCRetiansDestinationAfterRestart(AMQ3445Test.java:96)
[09:50:25] 
[09:50:26] Running org.apache.activemq.bugs.AMQ3454Test
[09:50:31] Tests run: 1, Failures: 0, Errors: 0, Skipped: 0, Time elapsed: 5.253 sec - in
org.apache.activemq.bugs.AMQ3454Test
[09:50:33] Running org.apache.activemq.bugs.AMQ3465Test
[09:50:34] Tests run: 2, Failures: 0, Errors: 0, Skipped: 0, Time elapsed: 0.831 sec - in
org.apache.activemq.bugs.AMQ3465Test
[09:50:34] Running org.apache.activemq.bugs.AMQ3529Test
[09:50:41] Tests run: 1, Failures: 0, Errors: 0, Skipped: 0, Time elapsed: 7.646 sec - in
org.apache.activemq.bugs.AMQ3529Test
[09:50:42] Running org.apache.activemq.bugs.AMQ3537Test
[09:50:42] Tests run: 1, Failures: 0, Errors: 0, Skipped: 0, Time elapsed: 0.224 sec - in
org.apache.activemq.bugs.AMQ3537Test
[09:50:42] Running org.apache.activemq.bugs.AMQ3567Test
[09:52:25] Tests run: 1, Failures: 0, Errors: 0, Skipped: 0, Time elapsed: 102.578 sec - in
org.apache.activemq.bugs.AMQ3567Test
[09:52:25] Running org.apache.activemq.bugs.AMQ3622Test
[09:52:28] Tests run: 1, Failures: 0, Errors: 0, Skipped: 0, Time elapsed: 2.736 sec - in
org.apache.activemq.bugs.AMQ3622Test
[09:52:29] Running org.apache.activemq.bugs.AMQ3625Test
[09:52:42] Tests run: 1, Failures: 0, Errors: 0, Skipped: 0, Time elapsed: 13.031 sec - in
org.apache.activemq.bugs.AMQ3625Test
[09:52:42] Running org.apache.activemq.bugs.AMQ3674Test
[09:52:43] Tests run: 1, Failures: 0, Errors: 0, Skipped: 0, Time elapsed: 1.038 sec - in
org.apache.activemq.bugs.AMQ3674Test
[09:52:44] Running org.apache.activemq.bugs.AMQ3675Test
[09:52:46] Tests run: 1, Failures: 0, Errors: 0, Skipped: 0, Time elapsed: 2.053 sec - in
org.apache.activemq.bugs.AMQ3675Test
[09:52:46] Running org.apache.activemq.bugs.AMQ3678Test
[09:52:49] Tests run: 1, Failures: 0, Errors: 0, Skipped: 0, Time elapsed: 2.366 sec - in
org.apache.activemq.bugs.AMQ3678Test
[09:52:49] Running org.apache.activemq.bugs.AMQ3732Test
[09:54:49] Tests run: 1, Failures: 0, Errors: 0, Skipped: 0, Time elapsed: 119.567 sec - in
org.apache.activemq.bugs.AMQ3732Test
[09:54:49] Running org.apache.activemq.bugs.AMQ3779Test
[09:54:51] Tests run: 1, Failures: 0, Errors: 0, Skipped: 0, Time elapsed: 1.391 sec - in
org.apache.activemq.bugs.AMQ3779Test
[09:54:52] Running org.apache.activemq.bugs.AMQ3841Test
[09:54:54] Tests run: 1, Failures: 0, Errors: 0, Skipped: 0, Time elapsed: 2.663 sec - in
org.apache.activemq.bugs.AMQ3841Test
[09:54:55] Running org.apache.activemq.bugs.AMQ3879Test
[09:54:56] Tests run: 1, Failures: 0, Errors: 0, Skipped: 0, Time elapsed: 1.341 sec - in
org.apache.activemq.bugs.AMQ3879Test
[09:54:56] Running org.apache.activemq.bugs.AMQ3903Test
[09:54:57] Tests run: 2, Failures: 0, Errors: 0, Skipped: 0, Time elapsed: 0.88 sec - in org.apache.activemq.bugs.AMQ3903Test
[09:54:57] Running org.apache.activemq.bugs.AMQ3932Test
[09:55:06] 
[09:55:06] Results :
[09:55:06] 
[09:55:06] Failed tests: 
[09:55:06]   MessageListenerRedeliveryTest.testQueueRollbackSessionListener:197 expected:<2>
but was:<0>
[09:55:06]   QueueMbeanRestartTest.testMBeanPresenceOnRestart:84->verifyPresenceOfQueueMbean:107
expected to find matching queue mbean for: queue://org.apache.activemq.broker.QueueMbeanRestartTest.null
[09:55:06]   QueueMbeanRestartTest.testMBeanPresenceOnRestart:84->verifyPresenceOfQueueMbean:107
expected to find matching queue mbean for: queue://org.apache.activemq.broker.QueueMbeanRestartTest.null
[09:55:06]   QueueMbeanRestartTest.testMBeanPresenceOnRestart:84->verifyPresenceOfQueueMbean:107
expected to find matching queue mbean for: queue://org.apache.activemq.broker.QueueMbeanRestartTest.null
[09:55:06]   DbRestartJDBCQueueMasterSlaveLeaseQuiesceTest>CombinationTestSupport.runBare:113->CombinationTestSupport.runBare:107->QueueMasterSlaveTestSupport.testVirtualTopicFailover:132
slave started
[09:55:06]   BrokerViewSlowStoreStartupTest.testBrokerViewOnSlowStoreStart:336 null
[09:55:06]   HealthViewMBeanTest>CombinationTestSupport.runBare:113->CombinationTestSupport.runBare:107->testHealthView:97->assertRegisteredObjectName:113
Could not find MBean!: org.apache.activemq:type=Broker,brokerName=localhost,service=Health
[09:55:06]   MBeanTest>CombinationTestSupport.runBare:113->CombinationTestSupport.runBare:107->testDestinationOptionsAreVisible:986->assertRegisteredObjectName:741
Could not find MBean!: org.apache.activemq:type=Broker,brokerName=localhost,destinationType=Queue,destinationName=QueueWithOptions
[09:55:06]   JobSchedulerTest.testAddLongLongIntStringByteSequence:105 null
[09:55:06]   VirtualTopicsAndDurableSubsTest>CombinationTestSupport.runBare:113->CombinationTestSupport.runBare:107->MBeanTest.testDestinationOptionsAreVisible:986->MBeanTest.assertRegisteredObjectName:741
Could not find MBean!: org.apache.activemq:type=Broker,brokerName=localhost,destinationType=Queue,destinationName=QueueWithOptions
[09:55:06]   AMQ2149LevelDBTest>AMQ2149Test.testQueueTransactionalOrderWithRestart:412->AMQ2149Test.doTestTransactionalOrderWithRestart:435->AMQ2149Test.verifyOrderedMessageReceipt:560
No exceptions
[09:55:06]   AMQ2149Test.testQueueTransactionalOrderWithRestart:412->doTestTransactionalOrderWithRestart:435->verifyOrderedMessageReceipt:549
No timeout waiting for senders/receivers to complete
[09:55:06] 
[09:55:06] Tests in error: 
[09:55:06]   RemoveDestinationTest.testRemoveDestinationWithSubscriber:148->destinationPresentInAdminView:158
? UndeclaredThrowable
[09:55:06]   JdbcXARecoveryBrokerTest>CombinationTestSupport.runBare:107->XARecoveryBrokerTest.testPreparedJmxView:107
? UndeclaredThrowable
[09:55:06]   JdbcXARecoveryBrokerTest>CombinationTestSupport.runBare:107->XARecoveryBrokerTest.testQueuePersistentPreparedAcksNotLostOnRestart:685
? UndeclaredThrowable
[09:55:06]   XARecoveryBrokerTest>CombinationTestSupport.runBare:107->testPreparedJmxView:87
? UndeclaredThrowable
[09:55:06]   XARecoveryBrokerTest>CombinationTestSupport.runBare:107->testQueuePersistentPreparedAcksNotLostOnRestart:685
? UndeclaredThrowable
[09:55:06]   mKahaDBXARecoveryBrokerTest>CombinationTestSupport.runBare:107->XARecoveryBrokerTest.testPreparedJmxView:107
? UndeclaredThrowable
[09:55:06]   mKahaDBXARecoveryBrokerTest>CombinationTestSupport.runBare:107->XARecoveryBrokerTest.testQueuePersistentPreparedAcksNotLostOnRestart:685
? UndeclaredThrowable
[09:55:06]   mLevelDBXARecoveryBrokerTest>CombinationTestSupport.runBare:107->XARecoveryBrokerTest.testPreparedJmxView:107
? UndeclaredThrowable
[09:55:06]   mLevelDBXARecoveryBrokerTest>CombinationTestSupport.runBare:107->XARecoveryBrokerTest.testQueuePersistentPreparedAcksNotLostOnRestart:685
? UndeclaredThrowable
[09:55:06]   AMQ2870Test.testSize:120->sendMessage:169 ?  test timed out after 300000 milli...
[09:55:06]   AMQ3445Test.testJDBCRetiansDestinationAfterRestart:96 ? UndeclaredThrowable
[09:55:06] 
[09:55:06] Tests run: 1523, Failures: 10, Errors: 10, Skipped: 4
[09:55:06] 
[JENKINS] Recording test results
[09:55:15] 

Mime
View raw message