activemq-dev mailing list archives

Site index · List index
Message view « Date » · « Thread »
Top « Date » · « Thread »
From Apache Jenkins Server <jenk...@builds.apache.org>
Subject Build failed in Jenkins: ActiveMQ » ActiveMQ :: Spring #1485
Date Sat, 19 Jul 2014 01:28:04 GMT
See <https://builds.apache.org/job/ActiveMQ/org.apache.activemq$activemq-spring/1485/>

------------------------------------------
[01:25:07] [INFO]                                                                        

[INFO] ------------------------------------------------------------------------
[INFO] Building ActiveMQ :: Spring 5.11-SNAPSHOT
[INFO] ------------------------------------------------------------------------
[INFO] 
[INFO] --- maven-clean-plugin:2.5:clean (default-clean) @ activemq-spring ---
[INFO] 
[INFO] --- maven-enforcer-plugin:1.0.1:enforce (default) @ activemq-spring ---
[INFO] 
[INFO] --- maven-consolets-plugin:1.30:install (default) @ activemq-spring ---
[INFO] 
[INFO] --- maven-bundle-plugin:2.3.7:cleanVersions (cleanVersions) @ activemq-spring ---
[INFO] 
[INFO] --- maven-remote-resources-plugin:1.3:process (default) @ activemq-spring ---
[INFO] 
[INFO] --- maven-resources-plugin:2.5:resources (default-resources) @ activemq-spring ---
[01:25:10] [debug] execute contextualize
[INFO] Using 'UTF-8' encoding to copy filtered resources.
[INFO] Copying 1 resource
[INFO] Copying 3 resources
[INFO] 
[INFO] --- maven-compiler-plugin:2.5.1:compile (default-compile) @ activemq-spring ---
[INFO] Compiling 20 source files to <https://builds.apache.org/job/ActiveMQ/org.apache.activemq$activemq-spring/ws/target/classes>
[INFO] 
[INFO] --- maven-xbean-plugin:3.12:mapping (default) @ activemq-spring ---
[INFO] Generating META-INF properties file: <https://builds.apache.org/job/ActiveMQ/org.apache.activemq$activemq-spring/ws/target/classes/META-INF/services/org/apache/xbean/spring/http/activemq.apache.org/schema/core>
for namespace: http://activemq.apache.org/schema/core
[INFO] Generating Spring 2.0 handler mapping: <https://builds.apache.org/job/ActiveMQ/org.apache.activemq$activemq-spring/ws/target/classes/META-INF/spring.handlers>
for namespace: http://activemq.apache.org/schema/core
[INFO] Generating HTML documentation file: <https://builds.apache.org/job/ActiveMQ/org.apache.activemq$activemq-spring/ws/target/classes/activemq.xsd.html>
for namespace: http://activemq.apache.org/schema/core
[01:25:15] Warning, could not load class: T: java.lang.ClassNotFoundException: T
[01:25:15] Warning, could not load class: T: java.lang.ClassNotFoundException: T
[01:25:15] Warning, could not load class: org.apache.activemq.partition.dto.Partitioning:
java.lang.ClassNotFoundException: org.apache.activemq.partition.dto.Partitioning
[01:25:15] Warning, could not load class: T: java.lang.ClassNotFoundException: T
[01:25:15] Warning, could not load class: T: java.lang.ClassNotFoundException: T
[INFO] Generating XSD file: <https://builds.apache.org/job/ActiveMQ/org.apache.activemq$activemq-spring/ws/target/classes/activemq.xsd>
for namespace: http://activemq.apache.org/schema/core
[INFO] Generating WIKI documentation file: <https://builds.apache.org/job/ActiveMQ/org.apache.activemq$activemq-spring/ws/target/classes/activemq.xsd.wiki>
for namespace: http://activemq.apache.org/schema/core
[INFO] ...done.
[INFO] 
[INFO] --- maven-resources-plugin:2.5:testResources (default-testResources) @ activemq-spring
---
[01:25:16] [debug] execute contextualize
[INFO] Using 'UTF-8' encoding to copy filtered resources.
[INFO] Copying 8 resources
[INFO] Copying 3 resources
[INFO] 
[INFO] --- maven-compiler-plugin:2.5.1:testCompile (default-testCompile) @ activemq-spring
---
[INFO] Compiling 12 source files to <https://builds.apache.org/job/ActiveMQ/org.apache.activemq$activemq-spring/ws/target/test-classes>
[INFO] 
[INFO] --- maven-surefire-plugin:2.16:test (default-test) @ activemq-spring ---
[INFO] Surefire report directory: <https://builds.apache.org/job/ActiveMQ/org.apache.activemq$activemq-spring/ws/target/surefire-reports>
[01:25:16] 
[01:25:16] -------------------------------------------------------
[01:25:16]  T E S T S
[01:25:16] -------------------------------------------------------
[01:25:17] Running org.apache.activemq.store.leveldb.LevelDBConfigTest
[01:25:19] Tests run: 1, Failures: 0, Errors: 0, Skipped: 0, Time elapsed: 2.437 sec - in
org.apache.activemq.store.leveldb.LevelDBConfigTest
[01:25:19] Running org.apache.activemq.spring.ParallelXATransactionTest
[01:25:36] Tests run: 1, Failures: 0, Errors: 0, Skipped: 0, Time elapsed: 16.609 sec - in
org.apache.activemq.spring.ParallelXATransactionTest
[01:25:36] Running org.apache.activemq.spring.SpringTest
[01:25:36] Tests run: 1, Failures: 0, Errors: 0, Skipped: 0, Time elapsed: 0.188 sec - in
org.apache.activemq.spring.SpringTest
[01:25:36] Running org.apache.activemq.spring.ListenerTest
[01:25:42] Tests run: 2, Failures: 0, Errors: 0, Skipped: 0, Time elapsed: 5.731 sec - in
org.apache.activemq.spring.ListenerTest
[01:25:42] Running org.apache.activemq.spring.SpringBrokerFactoryTest
[01:25:42] Tests run: 1, Failures: 0, Errors: 0, Skipped: 0, Time elapsed: 0.165 sec - in
org.apache.activemq.spring.SpringBrokerFactoryTest
[01:25:42] Running org.apache.bugs.AMQ2754Test
[01:25:59] Tests run: 1, Failures: 0, Errors: 0, Skipped: 0, Time elapsed: 17.202 sec - in
org.apache.bugs.AMQ2754Test
[01:25:59] Running org.apache.bugs.LoadBalanceTest
[01:26:10] Tests run: 2, Failures: 0, Errors: 0, Skipped: 1, Time elapsed: 11.136 sec - in
org.apache.bugs.LoadBalanceTest
[01:26:10] Running org.apache.bugs.AMQ1730Test
[01:26:13] Killed
[01:26:13] 
[01:26:13] Results :
[01:26:13] 
[01:26:13] Tests run: 9, Failures: 0, Errors: 0, Skipped: 1
[01:26:13] 
[JENKINS] Recording test results
[01:26:16] 

Mime
View raw message