activemq-dev mailing list archives

Site index · List index
Message view « Date » · « Thread »
Top « Date » · « Thread »
From Apache Jenkins Server <jenk...@builds.apache.org>
Subject Build failed in Jenkins: ActiveMQ #1478
Date Fri, 11 Jul 2014 00:35:20 GMT
See <https://builds.apache.org/job/ActiveMQ/1478/changes>

Changes:

[gtully] https://issues.apache.org/jira/browse/AMQ-5213 - fix failing jmock test - resolve
inconsistency in camel case attribute naming in a few mbeans

[kevin] Excluding some tests which hang Jenkins on Windows and Solaris, see AMQ-5270

[tabish121] https://issues.apache.org/jira/browse/AMQ-5271

[hadrian] Update poms to fully load into M2E

[hadrian] Update poms to fully load into M2E. Thanks dkulp

[hadrian] Update to use Java7

[tabish121] https://issues.apache.org/jira/browse/AMQ-5269

[tabish121] https://issues.apache.org/jira/browse/AMQ-5268

------------------------------------------
[...truncated 664 lines...]
	at hudson.maven.Maven3Builder.call(Maven3Builder.java:69)
	at hudson.remoting.UserRequest.perform(UserRequest.java:118)
	at hudson.remoting.UserRequest.perform(UserRequest.java:48)
	at hudson.remoting.Request$2.run(Request.java:328)
	at hudson.remoting.InterceptingExecutorService$1.call(InterceptingExecutorService.java:72)
	at java.util.concurrent.FutureTask$Sync.innerRun(FutureTask.java:303)
	at java.util.concurrent.FutureTask.run(FutureTask.java:138)
	at java.util.concurrent.ThreadPoolExecutor$Worker.runTask(ThreadPoolExecutor.java:895)
	at java.util.concurrent.ThreadPoolExecutor$Worker.run(ThreadPoolExecutor.java:918)
	at java.lang.Thread.run(Thread.java:662)
Caused by: org.apache.maven.plugin.CompilationFailureException: Compilation failure
Failure executing javac, but could not parse the error:
javac: invalid target release: 1.7
Usage: javac <options> <source files>
use -help for a list of possible options


	at org.apache.maven.plugin.AbstractCompilerMojo.execute(AbstractCompilerMojo.java:729)
	at org.apache.maven.plugin.CompilerMojo.execute(CompilerMojo.java:128)
	at org.apache.maven.plugin.DefaultBuildPluginManager.executeMojo(DefaultBuildPluginManager.java:101)
	at org.apache.maven.lifecycle.internal.MojoExecutor.execute(MojoExecutor.java:209)
	... 31 more
[ERROR] 
[ERROR] Re-run Maven using the -X switch to enable full debug logging.
[ERROR] 
[ERROR] For more information about the errors and possible solutions, please read the following
articles:
[ERROR] [Help 1] http://cwiki.apache.org/confluence/display/MAVEN/MojoFailureException
[ERROR] 
[ERROR] After correcting the problems, you can resume the build with the command
[ERROR]   mvn <goals> -rf :activemq-openwire-generator
[JENKINS] Archiving <https://builds.apache.org/job/ActiveMQ/ws/activemq-unit-tests/pom.xml>
to org.apache.activemq/activemq-unit-tests/5.11-SNAPSHOT/activemq-unit-tests-5.11-SNAPSHOT.pom
Sending artifact delta relative to ActiveMQ ? ActiveMQ :: Unit Tests #1472
Archived 1 artifacts
Archive block size is 32768
Received 1 blocks and 37751 bytes
Compression is 46.5%
Took 0.18 sec
[JENKINS] Archiving <https://builds.apache.org/job/ActiveMQ/ws/activemq-openwire-legacy/pom.xml>
to org.apache.activemq/activemq-openwire-legacy/5.11-SNAPSHOT/activemq-openwire-legacy-5.11-SNAPSHOT.pom
No artifacts from ActiveMQ ? ActiveMQ :: Openwire Legacy Support #1477 to compare, so performing
full copy of artifacts
[JENKINS] Archiving <https://builds.apache.org/job/ActiveMQ/ws/activemq-web-console/pom.xml>
to org.apache.activemq/activemq-web-console/5.11-SNAPSHOT/activemq-web-console-5.11-SNAPSHOT.pom
Sending artifact delta relative to ActiveMQ ? ActiveMQ :: Web Console #1472
Archived 1 artifacts
Archive block size is 32768
Received 0 blocks and 10536 bytes
Compression is 0.0%
Took 0.34 sec
[JENKINS] Archiving <https://builds.apache.org/job/ActiveMQ/ws/activemq-web-demo/pom.xml>
to org.apache.activemq/activemq-web-demo/5.11-SNAPSHOT/activemq-web-demo-5.11-SNAPSHOT.pom
Sending artifact delta relative to ActiveMQ ? ActiveMQ :: Web Demo #1472
Archived 1 artifacts
Archive block size is 32768
Received 0 blocks and 8321 bytes
Compression is 0.0%
Took 0.28 sec
[JENKINS] Archiving <https://builds.apache.org/job/ActiveMQ/ws/activemq-osgi/pom.xml>
to org.apache.activemq/activemq-osgi/5.11-SNAPSHOT/activemq-osgi-5.11-SNAPSHOT.pom
Sending artifact delta relative to ActiveMQ ? ActiveMQ :: OSGi bundle #1472
Archived 1 artifacts
Archive block size is 32768
Received 0 blocks and 20722 bytes
Compression is 0.0%
Took 0.32 sec
[JENKINS] Archiving <https://builds.apache.org/job/ActiveMQ/ws/activemq-tooling/activemq-maven-plugin/pom.xml>
to org.apache.activemq.tooling/activemq-maven-plugin/5.11-SNAPSHOT/activemq-maven-plugin-5.11-SNAPSHOT.pom
Sending artifact delta relative to ActiveMQ ? ActiveMQ :: StartUp/Stop Plugin #1472
Archived 1 artifacts
Archive block size is 32768
Received 0 blocks and 2922 bytes
Compression is 0.0%
Took 0.11 sec
[JENKINS] Archiving <https://builds.apache.org/job/ActiveMQ/ws/activemq-openwire-generator/pom.xml>
to org.apache.activemq/activemq-openwire-generator/5.11-SNAPSHOT/activemq-openwire-generator-5.11-SNAPSHOT.pom
No artifacts from ActiveMQ ? ActiveMQ :: Openwire Generator #1477 to compare, so performing
full copy of artifacts
[JENKINS] Archiving <https://builds.apache.org/job/ActiveMQ/ws/activemq-jdbc-store/pom.xml>
to org.apache.activemq/activemq-jdbc-store/5.11-SNAPSHOT/activemq-jdbc-store-5.11-SNAPSHOT.pom
No artifacts from ActiveMQ ? ActiveMQ :: JDBC Store #1477 to compare, so performing full copy
of artifacts
[JENKINS] Archiving <https://builds.apache.org/job/ActiveMQ/ws/activemq-rar/pom.xml>
to org.apache.activemq/activemq-rar/5.11-SNAPSHOT/activemq-rar-5.11-SNAPSHOT.pom
Sending artifact delta relative to ActiveMQ ? ActiveMQ :: RAR #1472
Archived 1 artifacts
Archive block size is 32768
Received 0 blocks and 13597 bytes
Compression is 0.0%
Took 0.23 sec
[JENKINS] Archiving <https://builds.apache.org/job/ActiveMQ/ws/activemq-tooling/activemq-memtest-maven-plugin/pom.xml>
to org.apache.activemq.tooling/activemq-memtest-maven-plugin/5.11-SNAPSHOT/activemq-memtest-maven-plugin-5.11-SNAPSHOT.pom
Sending artifact delta relative to ActiveMQ ? ActiveMQ :: Memory Usage Test Plugin #1476
Archived 1 artifacts
Archive block size is 32768
Received 0 blocks and 2841 bytes
Compression is 0.0%
Took 0.11 sec
[JENKINS] Archiving <https://builds.apache.org/job/ActiveMQ/ws/activemq-tooling/activemq-perf-maven-plugin/pom.xml>
to org.apache.activemq.tooling/activemq-perf-maven-plugin/5.11-SNAPSHOT/activemq-perf-maven-plugin-5.11-SNAPSHOT.pom
Sending artifact delta relative to ActiveMQ ? ActiveMQ :: Performance Test Plugin #1476
Archived 1 artifacts
Archive block size is 32768
Received 0 blocks and 2994 bytes
Compression is 0.0%
Took 0.1 sec
[JENKINS] Archiving <https://builds.apache.org/job/ActiveMQ/ws/activemq-amqp/pom.xml>
to org.apache.activemq/activemq-amqp/5.11-SNAPSHOT/activemq-amqp-5.11-SNAPSHOT.pom
Sending artifact delta relative to ActiveMQ ? ActiveMQ :: AMQP #1476
Archived 1 artifacts
Archive block size is 32768
Received 0 blocks and 7912 bytes
Compression is 0.0%
Took 95 ms
[JENKINS] Archiving <https://builds.apache.org/job/ActiveMQ/ws/activemq-itests-spring31/pom.xml>
to org.apache.activemq/activemq-itests-spring31/5.11-SNAPSHOT/activemq-itests-spring31-5.11-SNAPSHOT.pom
Sending artifact delta relative to ActiveMQ ? ActiveMQ :: Integration Test :: Spring 3.1 #1472
Archived 1 artifacts
Archive block size is 32768
Received 0 blocks and 3005 bytes
Compression is 0.0%
Took 98 ms
[JENKINS] Archiving <https://builds.apache.org/job/ActiveMQ/ws/assembly/pom.xml> to
org.apache.activemq/apache-activemq/5.11-SNAPSHOT/apache-activemq-5.11-SNAPSHOT.pom
Sending artifact delta relative to ActiveMQ ? ActiveMQ :: Assembly #1472
Archived 1 artifacts
Archive block size is 32768
Received 0 blocks and 18054 bytes
Compression is 0.0%
Took 2.7 sec
[JENKINS] Archiving <https://builds.apache.org/job/ActiveMQ/ws/activemq-jms-pool/pom.xml>
to org.apache.activemq/activemq-jms-pool/5.11-SNAPSHOT/activemq-jms-pool-5.11-SNAPSHOT.pom
No artifacts from ActiveMQ ? ActiveMQ :: Generic JMS Pool #1477 to compare, so performing
full copy of artifacts
[JENKINS] Archiving <https://builds.apache.org/job/ActiveMQ/ws/activemq-log4j-appender/pom.xml>
to org.apache.activemq/activemq-log4j-appender/5.11-SNAPSHOT/activemq-log4j-appender-5.11-SNAPSHOT.pom
Sending artifact delta relative to ActiveMQ ? ActiveMQ :: Log4j Appender #1476
Archived 1 artifacts
Archive block size is 32768
Received 0 blocks and 3679 bytes
Compression is 0.0%
Took 1.5 sec
[JENKINS] Archiving <https://builds.apache.org/job/ActiveMQ/ws/activemq-runtime-config/pom.xml>
to org.apache.activemq/activemq-runtime-config/5.11-SNAPSHOT/activemq-runtime-config-5.11-SNAPSHOT.pom
Sending artifact delta relative to ActiveMQ ? ActiveMQ :: Runtime Configuration #1476
Archived 1 artifacts
Archive block size is 32768
Received 0 blocks and 6523 bytes
Compression is 0.0%
Took 0.16 sec
[JENKINS] Archiving <https://builds.apache.org/job/ActiveMQ/ws/activemq-pool/pom.xml>
to org.apache.activemq/activemq-pool/5.11-SNAPSHOT/activemq-pool-5.11-SNAPSHOT.pom
No artifacts from ActiveMQ ? ActiveMQ :: Pool #1477 to compare, so performing full copy of
artifacts
[JENKINS] Archiving <https://builds.apache.org/job/ActiveMQ/ws/activemq-stomp/pom.xml>
to org.apache.activemq/activemq-stomp/5.11-SNAPSHOT/activemq-stomp-5.11-SNAPSHOT.pom
No artifacts from ActiveMQ ? ActiveMQ :: STOMP Protocol #1477 to compare, so performing full
copy of artifacts
[JENKINS] Archiving <https://builds.apache.org/job/ActiveMQ/ws/activemq-run/pom.xml>
to org.apache.activemq/activemq-run/5.11-SNAPSHOT/activemq-run-5.11-SNAPSHOT.pom
Sending artifact delta relative to ActiveMQ ? ActiveMQ :: Run Jar #1476
Archived 1 artifacts
Archive block size is 32768
Received 0 blocks and 4087 bytes
Compression is 0.0%
Took 96 ms
[JENKINS] Archiving <https://builds.apache.org/job/ActiveMQ/ws/activemq-mqtt/pom.xml>
to org.apache.activemq/activemq-mqtt/5.11-SNAPSHOT/activemq-mqtt-5.11-SNAPSHOT.pom
No artifacts from ActiveMQ ? ActiveMQ :: MQTT Protocol #1477 to compare, so performing full
copy of artifacts
[JENKINS] Archiving <https://builds.apache.org/job/ActiveMQ/ws/activemq-shiro/pom.xml>
to org.apache.activemq/activemq-shiro/5.11-SNAPSHOT/activemq-shiro-5.11-SNAPSHOT.pom
Sending artifact delta relative to ActiveMQ ? ActiveMQ :: Shiro #1472
Archived 1 artifacts
Archive block size is 32768
Received 0 blocks and 7059 bytes
Compression is 0.0%
Took 88 ms
[JENKINS] Archiving <https://builds.apache.org/job/ActiveMQ/ws/activemq-console/pom.xml>
to org.apache.activemq/activemq-console/5.11-SNAPSHOT/activemq-console-5.11-SNAPSHOT.pom
Sending artifact delta relative to ActiveMQ ? ActiveMQ :: Console #1476
Archived 1 artifacts
Archive block size is 32768
Received 0 blocks and 8453 bytes
Compression is 0.0%
Took 0.13 sec
[JENKINS] Archiving <https://builds.apache.org/job/ActiveMQ/ws/activemq-camel/pom.xml>
to org.apache.activemq/activemq-camel/5.11-SNAPSHOT/activemq-camel-5.11-SNAPSHOT.pom
Sending artifact delta relative to ActiveMQ ? ActiveMQ :: Camel #1472
Archived 1 artifacts
Archive block size is 32768
Received 0 blocks and 6843 bytes
Compression is 0.0%
Took 1.5 sec
[JENKINS] Archiving <https://builds.apache.org/job/ActiveMQ/ws/activemq-blueprint/pom.xml>
to org.apache.activemq/activemq-blueprint/5.11-SNAPSHOT/activemq-blueprint-5.11-SNAPSHOT.pom
[JENKINS] Archiving <https://builds.apache.org/job/ActiveMQ/ws/activemq-blueprint/target/activemq-blueprint-5.11-SNAPSHOT.jar>
to org.apache.activemq/activemq-blueprint/5.11-SNAPSHOT/activemq-blueprint-5.11-SNAPSHOT.jar
Sending artifact delta relative to ActiveMQ ? ActiveMQ :: Blueprint #1476
Archived 2 artifacts
Archive block size is 32768
Received 0 blocks and 11745 bytes
Compression is 0.0%
Took 0.15 sec
[JENKINS] Archiving <https://builds.apache.org/job/ActiveMQ/ws/activemq-client/pom.xml>
to org.apache.activemq/activemq-client/5.11-SNAPSHOT/activemq-client-5.11-SNAPSHOT.pom
No artifacts from ActiveMQ ? ActiveMQ :: Client #1477 to compare, so performing full copy
of artifacts
[JENKINS] Archiving <https://builds.apache.org/job/ActiveMQ/ws/pom.xml> to org.apache.activemq/activemq-parent/5.11-SNAPSHOT/activemq-parent-5.11-SNAPSHOT.pom
No artifacts from ActiveMQ ? ActiveMQ #1477 to compare, so performing full copy of artifacts
[JENKINS] Archiving <https://builds.apache.org/job/ActiveMQ/ws/activemq-karaf-itest/pom.xml>
to org.apache.activemq/activemq-karaf-itest/5.11-SNAPSHOT/activemq-karaf-itest-5.11-SNAPSHOT.pom
Sending artifact delta relative to ActiveMQ ? ActiveMQ :: Karaf Integration Tests #1472
Archived 1 artifacts
Archive block size is 32768
Received 0 blocks and 9809 bytes
Compression is 0.0%
Took 0.1 sec
[JENKINS] Archiving <https://builds.apache.org/job/ActiveMQ/ws/activemq-broker/pom.xml>
to org.apache.activemq/activemq-broker/5.11-SNAPSHOT/activemq-broker-5.11-SNAPSHOT.pom
No artifacts from ActiveMQ ? ActiveMQ :: Broker #1477 to compare, so performing full copy
of artifacts
[JENKINS] Archiving <https://builds.apache.org/job/ActiveMQ/ws/activemq-ra/pom.xml>
to org.apache.activemq/activemq-ra/5.11-SNAPSHOT/activemq-ra-5.11-SNAPSHOT.pom
No artifacts from ActiveMQ ? ActiveMQ :: RA #1477 to compare, so performing full copy of artifacts
[JENKINS] Archiving <https://builds.apache.org/job/ActiveMQ/ws/activemq-spring/pom.xml>
to org.apache.activemq/activemq-spring/5.11-SNAPSHOT/activemq-spring-5.11-SNAPSHOT.pom
No artifacts from ActiveMQ ? ActiveMQ :: Spring #1477 to compare, so performing full copy
of artifacts
[JENKINS] Archiving <https://builds.apache.org/job/ActiveMQ/ws/activemq-all/pom.xml>
to org.apache.activemq/activemq-all/5.11-SNAPSHOT/activemq-all-5.11-SNAPSHOT.pom
Sending artifact delta relative to ActiveMQ ? ActiveMQ :: All JAR bundle #1472
Archived 1 artifacts
Archive block size is 32768
Received 0 blocks and 15390 bytes
Compression is 0.0%
Took 0.3 sec
[JENKINS] Archiving <https://builds.apache.org/job/ActiveMQ/ws/activemq-kahadb-store/pom.xml>
to org.apache.activemq/activemq-kahadb-store/5.11-SNAPSHOT/activemq-kahadb-store-5.11-SNAPSHOT.pom
No artifacts from ActiveMQ ? ActiveMQ :: KahaDB Store #1477 to compare, so performing full
copy of artifacts
[JENKINS] Archiving <https://builds.apache.org/job/ActiveMQ/ws/activemq-jaas/pom.xml>
to org.apache.activemq/activemq-jaas/5.11-SNAPSHOT/activemq-jaas-5.11-SNAPSHOT.pom
No artifacts from ActiveMQ ? ActiveMQ :: JAAS #1477 to compare, so performing full copy of
artifacts
[JENKINS] Archiving <https://builds.apache.org/job/ActiveMQ/ws/activemq-tooling/pom.xml>
to org.apache.activemq.tooling/activemq-tooling/5.11-SNAPSHOT/activemq-tooling-5.11-SNAPSHOT.pom
Sending artifact delta relative to ActiveMQ ? ActiveMQ :: Tooling #1476
Archived 1 artifacts
Archive block size is 32768
Received 0 blocks and 1679 bytes
Compression is 0.0%
Took 0.15 sec
[JENKINS] Archiving <https://builds.apache.org/job/ActiveMQ/ws/activemq-partition/pom.xml>
to org.apache.activemq/activemq-partition/5.11-SNAPSHOT/activemq-partition-5.11-SNAPSHOT.pom
Sending artifact delta relative to ActiveMQ ? ActiveMQ :: Partition Management #1476
Archived 1 artifacts
Archive block size is 32768
Received 0 blocks and 3604 bytes
Compression is 0.0%
Took 0.11 sec
[JENKINS] Archiving <https://builds.apache.org/job/ActiveMQ/ws/activemq-web/pom.xml>
to org.apache.activemq/activemq-web/5.11-SNAPSHOT/activemq-web-5.11-SNAPSHOT.pom
Sending artifact delta relative to ActiveMQ ? ActiveMQ :: Web #1472
Archived 1 artifacts
Archive block size is 32768
Received 0 blocks and 4485 bytes
Compression is 0.0%
Took 96 ms
[JENKINS] Archiving <https://builds.apache.org/job/ActiveMQ/ws/activemq-leveldb-store/pom.xml>
to org.apache.activemq/activemq-leveldb-store/5.11-SNAPSHOT/activemq-leveldb-store-5.11-SNAPSHOT.pom
No artifacts from ActiveMQ ? ActiveMQ :: LevelDB Store #1477 to compare, so performing full
copy of artifacts
[JENKINS] Archiving <https://builds.apache.org/job/ActiveMQ/ws/activemq-fileserver/pom.xml>
to org.apache.activemq/activemq-fileserver/5.11-SNAPSHOT/activemq-fileserver-5.11-SNAPSHOT.pom
Sending artifact delta relative to ActiveMQ ? ActiveMQ :: File Server #1472
Archived 1 artifacts
Archive block size is 32768
Received 0 blocks and 3739 bytes
Compression is 0.0%
Took 0.13 sec
[JENKINS] Archiving <https://builds.apache.org/job/ActiveMQ/ws/activemq-karaf/pom.xml>
to org.apache.activemq/activemq-karaf/5.11-SNAPSHOT/activemq-karaf-5.11-SNAPSHOT.pom
Sending artifact delta relative to ActiveMQ ? ActiveMQ :: Apache Karaf #1472
Archived 1 artifacts
Archive block size is 32768
Received 0 blocks and 6902 bytes
Compression is 0.0%
Took 0.14 sec
[JENKINS] Archiving <https://builds.apache.org/job/ActiveMQ/ws/activemq-http/pom.xml>
to org.apache.activemq/activemq-http/5.11-SNAPSHOT/activemq-http-5.11-SNAPSHOT.pom
Sending artifact delta relative to ActiveMQ ? ActiveMQ :: HTTP Protocol Support #1472
Archived 1 artifacts
Archive block size is 32768
Received 0 blocks and 7154 bytes
Compression is 0.0%
Took 0.11 sec
Sending e-mails to: dev@activemq.apache.org
Sending e-mails to: dev@activemq.apache.org
Sending e-mails to: dev@activemq.apache.org
channel stopped
[locks-and-latches] Releasing all the locks
[locks-and-latches] All the locks released

Mime
View raw message