activemq-dev mailing list archives

Site index · List index
Message view « Date » · « Thread »
Top « Date » · « Thread »
From Apache Jenkins Server <jenk...@builds.apache.org>
Subject Build failed in Jenkins: ActiveMQ #1476
Date Thu, 10 Jul 2014 05:24:03 GMT
See <https://builds.apache.org/job/ActiveMQ/1476/changes>

Changes:

[kevin] added/updated timeouts to help resolve CI failures

[dejan] AMQ-5265 - fix race condition for task

------------------------------------------
[...truncated 4174 lines...]
	at org.apache.maven.plugin.surefire.booterclient.ForkStarter.runSuitesForkPerTestSet(ForkStarter.java:300)
	... 37 more
Caused by: java.lang.RuntimeException: The forked VM terminated without saying properly goodbye.
VM crash or System.exit called ?
Command was/bin/sh -c cd <https://builds.apache.org/job/ActiveMQ/ws/activemq-unit-tests>
&& /home/jenkins/tools/java/jdk1.6.0_45-32/jre/bin/java -Xmx512m -jar <https://builds.apache.org/job/ActiveMQ/ws/activemq-unit-tests/target/surefire/surefirebooter7057613162093891111.jar>
<https://builds.apache.org/job/ActiveMQ/ws/activemq-unit-tests/target/surefire/surefire4278260204564462052tmp>
<https://builds.apache.org/job/ActiveMQ/ws/activemq-unit-tests/target/surefire/surefire_4281360481457061163913tmp>
	at org.apache.maven.plugin.surefire.booterclient.ForkStarter.fork(ForkStarter.java:485)
	at org.apache.maven.plugin.surefire.booterclient.ForkStarter.fork(ForkStarter.java:352)
	at org.apache.maven.plugin.surefire.booterclient.ForkStarter.access$300(ForkStarter.java:85)
	at org.apache.maven.plugin.surefire.booterclient.ForkStarter$2.call(ForkStarter.java:288)
	at org.apache.maven.plugin.surefire.booterclient.ForkStarter$2.call(ForkStarter.java:283)
	... 5 more
[ERROR] 
[ERROR] Re-run Maven using the -X switch to enable full debug logging.
[ERROR] 
[ERROR] For more information about the errors and possible solutions, please read the following
articles:
[ERROR] [Help 1] http://cwiki.apache.org/confluence/display/MAVEN/MojoFailureException
[ERROR] 
[ERROR] After correcting the problems, you can resume the build with the command
[ERROR]   mvn <goals> -rf :activemq-unit-tests
[JENKINS] Archiving <https://builds.apache.org/job/ActiveMQ/ws/activemq-unit-tests/pom.xml>
to org.apache.activemq/activemq-unit-tests/5.11-SNAPSHOT/activemq-unit-tests-5.11-SNAPSHOT.pom
Sending artifact delta relative to ActiveMQ ? ActiveMQ :: Unit Tests #1472
Archived 1 artifacts
Archive block size is 32768
Received 1 blocks and 27734 bytes
Compression is 54.2%
Took 1.8 sec
[JENKINS] Archiving <https://builds.apache.org/job/ActiveMQ/ws/activemq-openwire-legacy/pom.xml>
to org.apache.activemq/activemq-openwire-legacy/5.11-SNAPSHOT/activemq-openwire-legacy-5.11-SNAPSHOT.pom
[JENKINS] Archiving <https://builds.apache.org/job/ActiveMQ/ws/activemq-openwire-legacy/target/activemq-openwire-legacy-5.11-SNAPSHOT.jar>
to org.apache.activemq/activemq-openwire-legacy/5.11-SNAPSHOT/activemq-openwire-legacy-5.11-SNAPSHOT.jar
No artifacts from ActiveMQ ? ActiveMQ :: Openwire Legacy Support #1475 to compare, so performing
full copy of artifacts
[JENKINS] Archiving <https://builds.apache.org/job/ActiveMQ/ws/activemq-web-console/pom.xml>
to org.apache.activemq/activemq-web-console/5.11-SNAPSHOT/activemq-web-console-5.11-SNAPSHOT.pom
Sending artifact delta relative to ActiveMQ ? ActiveMQ :: Web Console #1472
Archived 1 artifacts
Archive block size is 32768
Received 0 blocks and 10330 bytes
Compression is 0.0%
Took 0.35 sec
[JENKINS] Archiving <https://builds.apache.org/job/ActiveMQ/ws/activemq-web-demo/pom.xml>
to org.apache.activemq/activemq-web-demo/5.11-SNAPSHOT/activemq-web-demo-5.11-SNAPSHOT.pom
Sending artifact delta relative to ActiveMQ ? ActiveMQ :: Web Demo #1472
Archived 1 artifacts
Archive block size is 32768
Received 0 blocks and 8321 bytes
Compression is 0.0%
Took 0.5 sec
[JENKINS] Archiving <https://builds.apache.org/job/ActiveMQ/ws/activemq-osgi/pom.xml>
to org.apache.activemq/activemq-osgi/5.11-SNAPSHOT/activemq-osgi-5.11-SNAPSHOT.pom
Sending artifact delta relative to ActiveMQ ? ActiveMQ :: OSGi bundle #1472
Archived 1 artifacts
Archive block size is 32768
Received 0 blocks and 19690 bytes
Compression is 0.0%
Took 0.29 sec
[JENKINS] Archiving <https://builds.apache.org/job/ActiveMQ/ws/activemq-tooling/activemq-maven-plugin/pom.xml>
to org.apache.activemq.tooling/activemq-maven-plugin/5.11-SNAPSHOT/activemq-maven-plugin-5.11-SNAPSHOT.pom
Sending artifact delta relative to ActiveMQ ? ActiveMQ :: StartUp/Stop Plugin #1472
Archived 1 artifacts
Archive block size is 32768
Received 0 blocks and 2922 bytes
Compression is 0.0%
Took 0.21 sec
[JENKINS] Archiving <https://builds.apache.org/job/ActiveMQ/ws/activemq-openwire-generator/pom.xml>
to org.apache.activemq/activemq-openwire-generator/5.11-SNAPSHOT/activemq-openwire-generator-5.11-SNAPSHOT.pom
[JENKINS] Archiving <https://builds.apache.org/job/ActiveMQ/ws/activemq-openwire-generator/target/activemq-openwire-generator-5.11-SNAPSHOT.jar>
to org.apache.activemq/activemq-openwire-generator/5.11-SNAPSHOT/activemq-openwire-generator-5.11-SNAPSHOT.jar
No artifacts from ActiveMQ ? ActiveMQ :: Openwire Generator #1475 to compare, so performing
full copy of artifacts
[JENKINS] Archiving <https://builds.apache.org/job/ActiveMQ/ws/activemq-jdbc-store/pom.xml>
to org.apache.activemq/activemq-jdbc-store/5.11-SNAPSHOT/activemq-jdbc-store-5.11-SNAPSHOT.pom
[JENKINS] Archiving <https://builds.apache.org/job/ActiveMQ/ws/activemq-jdbc-store/target/activemq-jdbc-store-5.11-SNAPSHOT.jar>
to org.apache.activemq/activemq-jdbc-store/5.11-SNAPSHOT/activemq-jdbc-store-5.11-SNAPSHOT.jar
No artifacts from ActiveMQ ? ActiveMQ :: JDBC Store #1475 to compare, so performing full copy
of artifacts
[JENKINS] Archiving <https://builds.apache.org/job/ActiveMQ/ws/activemq-rar/pom.xml>
to org.apache.activemq/activemq-rar/5.11-SNAPSHOT/activemq-rar-5.11-SNAPSHOT.pom
Sending artifact delta relative to ActiveMQ ? ActiveMQ :: RAR #1472
Archived 1 artifacts
Archive block size is 32768
Received 0 blocks and 13597 bytes
Compression is 0.0%
Took 1.8 sec
[JENKINS] Archiving <https://builds.apache.org/job/ActiveMQ/ws/activemq-tooling/activemq-memtest-maven-plugin/pom.xml>
to org.apache.activemq.tooling/activemq-memtest-maven-plugin/5.11-SNAPSHOT/activemq-memtest-maven-plugin-5.11-SNAPSHOT.pom
[JENKINS] Archiving <https://builds.apache.org/job/ActiveMQ/ws/activemq-tooling/activemq-memtest-maven-plugin/target/activemq-memtest-maven-plugin-5.11-SNAPSHOT.jar>
to org.apache.activemq.tooling/activemq-memtest-maven-plugin/5.11-SNAPSHOT/activemq-memtest-maven-plugin-5.11-SNAPSHOT.jar
Sending artifact delta relative to ActiveMQ ? ActiveMQ :: Memory Usage Test Plugin #1472
Archived 2 artifacts
Archive block size is 32768
Received 0 blocks and 30544 bytes
Compression is 0.0%
Took 0.28 sec
[JENKINS] Archiving <https://builds.apache.org/job/ActiveMQ/ws/activemq-tooling/activemq-perf-maven-plugin/pom.xml>
to org.apache.activemq.tooling/activemq-perf-maven-plugin/5.11-SNAPSHOT/activemq-perf-maven-plugin-5.11-SNAPSHOT.pom
[JENKINS] Archiving <https://builds.apache.org/job/ActiveMQ/ws/activemq-tooling/activemq-perf-maven-plugin/target/activemq-perf-maven-plugin-5.11-SNAPSHOT.jar>
to org.apache.activemq.tooling/activemq-perf-maven-plugin/5.11-SNAPSHOT/activemq-perf-maven-plugin-5.11-SNAPSHOT.jar
Sending artifact delta relative to ActiveMQ ? ActiveMQ :: Performance Test Plugin #1472
Archived 2 artifacts
Archive block size is 32768
Received 0 blocks and 87799 bytes
Compression is 0.0%
Took 2.4 sec
[JENKINS] Archiving <https://builds.apache.org/job/ActiveMQ/ws/activemq-amqp/pom.xml>
to org.apache.activemq/activemq-amqp/5.11-SNAPSHOT/activemq-amqp-5.11-SNAPSHOT.pom
[JENKINS] Archiving <https://builds.apache.org/job/ActiveMQ/ws/activemq-amqp/target/activemq-amqp-5.11-SNAPSHOT.jar>
to org.apache.activemq/activemq-amqp/5.11-SNAPSHOT/activemq-amqp-5.11-SNAPSHOT.jar
No artifacts from ActiveMQ ? ActiveMQ :: AMQP #1475 to compare, so performing full copy of
artifacts
[JENKINS] Archiving <https://builds.apache.org/job/ActiveMQ/ws/activemq-itests-spring31/pom.xml>
to org.apache.activemq/activemq-itests-spring31/5.11-SNAPSHOT/activemq-itests-spring31-5.11-SNAPSHOT.pom
Sending artifact delta relative to ActiveMQ ? ActiveMQ :: Integration Test :: Spring 3.1 #1472
Archived 1 artifacts
Archive block size is 32768
Received 0 blocks and 3005 bytes
Compression is 0.0%
Took 0.14 sec
[JENKINS] Archiving <https://builds.apache.org/job/ActiveMQ/ws/assembly/pom.xml> to
org.apache.activemq/apache-activemq/5.11-SNAPSHOT/apache-activemq-5.11-SNAPSHOT.pom
Sending artifact delta relative to ActiveMQ ? ActiveMQ :: Assembly #1472
Archived 1 artifacts
Archive block size is 32768
Received 0 blocks and 18054 bytes
Compression is 0.0%
Took 3.4 sec
[JENKINS] Archiving <https://builds.apache.org/job/ActiveMQ/ws/activemq-jms-pool/pom.xml>
to org.apache.activemq/activemq-jms-pool/5.11-SNAPSHOT/activemq-jms-pool-5.11-SNAPSHOT.pom
[JENKINS] Archiving <https://builds.apache.org/job/ActiveMQ/ws/activemq-jms-pool/target/activemq-jms-pool-5.11-SNAPSHOT.jar>
to org.apache.activemq/activemq-jms-pool/5.11-SNAPSHOT/activemq-jms-pool-5.11-SNAPSHOT.jar
No artifacts from ActiveMQ ? ActiveMQ :: Generic JMS Pool #1475 to compare, so performing
full copy of artifacts
[JENKINS] Archiving <https://builds.apache.org/job/ActiveMQ/ws/activemq-log4j-appender/pom.xml>
to org.apache.activemq/activemq-log4j-appender/5.11-SNAPSHOT/activemq-log4j-appender-5.11-SNAPSHOT.pom
[JENKINS] Archiving <https://builds.apache.org/job/ActiveMQ/ws/activemq-log4j-appender/target/activemq-log4j-appender-5.11-SNAPSHOT.jar>
to org.apache.activemq/activemq-log4j-appender/5.11-SNAPSHOT/activemq-log4j-appender-5.11-SNAPSHOT.jar
Sending artifact delta relative to ActiveMQ ? ActiveMQ :: Log4j Appender #1472
Archived 2 artifacts
Archive block size is 32768
Received 0 blocks and 17923 bytes
Compression is 0.0%
Took 2.3 sec
[JENKINS] Archiving <https://builds.apache.org/job/ActiveMQ/ws/activemq-runtime-config/pom.xml>
to org.apache.activemq/activemq-runtime-config/5.11-SNAPSHOT/activemq-runtime-config-5.11-SNAPSHOT.pom
[JENKINS] Archiving <https://builds.apache.org/job/ActiveMQ/ws/activemq-runtime-config/target/activemq-runtime-config-5.11-SNAPSHOT.jar>
to org.apache.activemq/activemq-runtime-config/5.11-SNAPSHOT/activemq-runtime-config-5.11-SNAPSHOT.jar
Sending artifact delta relative to ActiveMQ ? ActiveMQ :: Runtime Configuration #1472
Archived 2 artifacts
Archive block size is 32768
Received 0 blocks and 1636682 bytes
Compression is 0.0%
Took 2.7 sec
[JENKINS] Archiving <https://builds.apache.org/job/ActiveMQ/ws/activemq-pool/pom.xml>
to org.apache.activemq/activemq-pool/5.11-SNAPSHOT/activemq-pool-5.11-SNAPSHOT.pom
[JENKINS] Archiving <https://builds.apache.org/job/ActiveMQ/ws/activemq-pool/target/activemq-pool-5.11-SNAPSHOT.jar>
to org.apache.activemq/activemq-pool/5.11-SNAPSHOT/activemq-pool-5.11-SNAPSHOT.jar
No artifacts from ActiveMQ ? ActiveMQ :: Pool #1475 to compare, so performing full copy of
artifacts
[JENKINS] Archiving <https://builds.apache.org/job/ActiveMQ/ws/activemq-stomp/pom.xml>
to org.apache.activemq/activemq-stomp/5.11-SNAPSHOT/activemq-stomp-5.11-SNAPSHOT.pom
[JENKINS] Archiving <https://builds.apache.org/job/ActiveMQ/ws/activemq-stomp/target/activemq-stomp-5.11-SNAPSHOT.jar>
to org.apache.activemq/activemq-stomp/5.11-SNAPSHOT/activemq-stomp-5.11-SNAPSHOT.jar
No artifacts from ActiveMQ ? ActiveMQ :: STOMP Protocol #1475 to compare, so performing full
copy of artifacts
[JENKINS] Archiving <https://builds.apache.org/job/ActiveMQ/ws/activemq-run/dependency-reduced-pom.xml>
to org.apache.activemq/activemq-run/5.11-SNAPSHOT/activemq-run-5.11-SNAPSHOT.pom
[JENKINS] Archiving <https://builds.apache.org/job/ActiveMQ/ws/activemq-run/target/activemq-run-5.11-SNAPSHOT.jar>
to org.apache.activemq/activemq-run/5.11-SNAPSHOT/activemq-run-5.11-SNAPSHOT.jar
Sending artifact delta relative to ActiveMQ ? ActiveMQ :: Run Jar #1472
Archived 2 artifacts
Archive block size is 32768
Received 0 blocks and 18924 bytes
Compression is 0.0%
Took 0.21 sec
[JENKINS] Archiving <https://builds.apache.org/job/ActiveMQ/ws/activemq-mqtt/pom.xml>
to org.apache.activemq/activemq-mqtt/5.11-SNAPSHOT/activemq-mqtt-5.11-SNAPSHOT.pom
[JENKINS] Archiving <https://builds.apache.org/job/ActiveMQ/ws/activemq-mqtt/target/activemq-mqtt-5.11-SNAPSHOT.jar>
to org.apache.activemq/activemq-mqtt/5.11-SNAPSHOT/activemq-mqtt-5.11-SNAPSHOT.jar
No artifacts from ActiveMQ ? ActiveMQ :: MQTT Protocol #1475 to compare, so performing full
copy of artifacts
[JENKINS] Archiving <https://builds.apache.org/job/ActiveMQ/ws/activemq-shiro/pom.xml>
to org.apache.activemq/activemq-shiro/5.11-SNAPSHOT/activemq-shiro-5.11-SNAPSHOT.pom
Sending artifact delta relative to ActiveMQ ? ActiveMQ :: Shiro #1472
Archived 1 artifacts
Archive block size is 32768
Received 0 blocks and 7059 bytes
Compression is 0.0%
Took 0.2 sec
[JENKINS] Archiving <https://builds.apache.org/job/ActiveMQ/ws/activemq-console/pom.xml>
to org.apache.activemq/activemq-console/5.11-SNAPSHOT/activemq-console-5.11-SNAPSHOT.pom
[JENKINS] Archiving <https://builds.apache.org/job/ActiveMQ/ws/activemq-console/target/activemq-console-5.11-SNAPSHOT.jar>
to org.apache.activemq/activemq-console/5.11-SNAPSHOT/activemq-console-5.11-SNAPSHOT.jar
No artifacts from ActiveMQ ? ActiveMQ :: Console #1475 to compare, so performing full copy
of artifacts
[JENKINS] Archiving <https://builds.apache.org/job/ActiveMQ/ws/activemq-camel/pom.xml>
to org.apache.activemq/activemq-camel/5.11-SNAPSHOT/activemq-camel-5.11-SNAPSHOT.pom
Sending artifact delta relative to ActiveMQ ? ActiveMQ :: Camel #1472
Archived 1 artifacts
Archive block size is 32768
Received 0 blocks and 6843 bytes
Compression is 0.0%
Took 0.2 sec
[JENKINS] Archiving <https://builds.apache.org/job/ActiveMQ/ws/activemq-blueprint/pom.xml>
to org.apache.activemq/activemq-blueprint/5.11-SNAPSHOT/activemq-blueprint-5.11-SNAPSHOT.pom
[JENKINS] Archiving <https://builds.apache.org/job/ActiveMQ/ws/activemq-blueprint/target/activemq-blueprint-5.11-SNAPSHOT.jar>
to org.apache.activemq/activemq-blueprint/5.11-SNAPSHOT/activemq-blueprint-5.11-SNAPSHOT.jar
Sending artifact delta relative to ActiveMQ ? ActiveMQ :: Blueprint #1472
Archived 2 artifacts
Archive block size is 32768
Received 0 blocks and 11744 bytes
Compression is 0.0%
Took 0.21 sec
[JENKINS] Archiving <https://builds.apache.org/job/ActiveMQ/ws/activemq-client/pom.xml>
to org.apache.activemq/activemq-client/5.11-SNAPSHOT/activemq-client-5.11-SNAPSHOT.pom
[JENKINS] Archiving <https://builds.apache.org/job/ActiveMQ/ws/activemq-client/target/activemq-client-5.11-SNAPSHOT.jar>
to org.apache.activemq/activemq-client/5.11-SNAPSHOT/activemq-client-5.11-SNAPSHOT.jar
No artifacts from ActiveMQ ? ActiveMQ :: Client #1475 to compare, so performing full copy
of artifacts
[JENKINS] Archiving <https://builds.apache.org/job/ActiveMQ/ws/pom.xml> to org.apache.activemq/activemq-parent/5.11-SNAPSHOT/activemq-parent-5.11-SNAPSHOT.pom
No artifacts from ActiveMQ ? ActiveMQ #1475 to compare, so performing full copy of artifacts
[JENKINS] Archiving <https://builds.apache.org/job/ActiveMQ/ws/activemq-karaf-itest/pom.xml>
to org.apache.activemq/activemq-karaf-itest/5.11-SNAPSHOT/activemq-karaf-itest-5.11-SNAPSHOT.pom
Sending artifact delta relative to ActiveMQ ? ActiveMQ :: Karaf Integration Tests #1472
Archived 1 artifacts
Archive block size is 32768
Received 0 blocks and 8731 bytes
Compression is 0.0%
Took 0.14 sec
[JENKINS] Archiving <https://builds.apache.org/job/ActiveMQ/ws/activemq-broker/pom.xml>
to org.apache.activemq/activemq-broker/5.11-SNAPSHOT/activemq-broker-5.11-SNAPSHOT.pom
[JENKINS] Archiving <https://builds.apache.org/job/ActiveMQ/ws/activemq-broker/target/activemq-broker-5.11-SNAPSHOT.jar>
to org.apache.activemq/activemq-broker/5.11-SNAPSHOT/activemq-broker-5.11-SNAPSHOT.jar
[JENKINS] Archiving <https://builds.apache.org/job/ActiveMQ/ws/activemq-broker/target/activemq-broker-5.11-SNAPSHOT-tests.jar>
to org.apache.activemq/activemq-broker/5.11-SNAPSHOT/activemq-broker-5.11-SNAPSHOT-tests.jar
No artifacts from ActiveMQ ? ActiveMQ :: Broker #1475 to compare, so performing full copy
of artifacts
[JENKINS] Archiving <https://builds.apache.org/job/ActiveMQ/ws/activemq-ra/pom.xml>
to org.apache.activemq/activemq-ra/5.11-SNAPSHOT/activemq-ra-5.11-SNAPSHOT.pom
[JENKINS] Archiving <https://builds.apache.org/job/ActiveMQ/ws/activemq-ra/target/activemq-ra-5.11-SNAPSHOT.jar>
to org.apache.activemq/activemq-ra/5.11-SNAPSHOT/activemq-ra-5.11-SNAPSHOT.jar
[JENKINS] Archiving <https://builds.apache.org/job/ActiveMQ/ws/activemq-ra/target/xbean/activemq-ra.xsd>
to org.apache.activemq/activemq-ra/5.11-SNAPSHOT/activemq-ra-5.11-SNAPSHOT.xsd
[JENKINS] Archiving <https://builds.apache.org/job/ActiveMQ/ws/activemq-ra/target/xbean/activemq-ra.xsd.html>
to org.apache.activemq/activemq-ra/5.11-SNAPSHOT/activemq-ra-5.11-SNAPSHOT-schema.html
[JENKINS] Archiving <https://builds.apache.org/job/ActiveMQ/ws/activemq-ra/target/xbean/activemq-ra.xsd.html>
to org.apache.activemq/activemq-ra/5.11-SNAPSHOT/activemq-ra-5.11-SNAPSHOT.xsd.html
No artifacts from ActiveMQ ? ActiveMQ :: RA #1475 to compare, so performing full copy of artifacts
[JENKINS] Archiving <https://builds.apache.org/job/ActiveMQ/ws/activemq-spring/pom.xml>
to org.apache.activemq/activemq-spring/5.11-SNAPSHOT/activemq-spring-5.11-SNAPSHOT.pom
[JENKINS] Archiving <https://builds.apache.org/job/ActiveMQ/ws/activemq-spring/target/activemq-spring-5.11-SNAPSHOT.jar>
to org.apache.activemq/activemq-spring/5.11-SNAPSHOT/activemq-spring-5.11-SNAPSHOT.jar
[JENKINS] Archiving <https://builds.apache.org/job/ActiveMQ/ws/activemq-spring/target/classes/activemq.xsd>
to org.apache.activemq/activemq-spring/5.11-SNAPSHOT/activemq-spring-5.11-SNAPSHOT.xsd
[JENKINS] Archiving <https://builds.apache.org/job/ActiveMQ/ws/activemq-spring/target/classes/activemq.xsd.html>
to org.apache.activemq/activemq-spring/5.11-SNAPSHOT/activemq-spring-5.11-SNAPSHOT-schema.html
No artifacts from ActiveMQ ? ActiveMQ :: Spring #1475 to compare, so performing full copy
of artifacts
[JENKINS] Archiving <https://builds.apache.org/job/ActiveMQ/ws/activemq-all/pom.xml>
to org.apache.activemq/activemq-all/5.11-SNAPSHOT/activemq-all-5.11-SNAPSHOT.pom
Sending artifact delta relative to ActiveMQ ? ActiveMQ :: All JAR bundle #1472
Archived 1 artifacts
Archive block size is 32768
Received 0 blocks and 15390 bytes
Compression is 0.0%
Took 0.29 sec
[JENKINS] Archiving <https://builds.apache.org/job/ActiveMQ/ws/activemq-kahadb-store/pom.xml>
to org.apache.activemq/activemq-kahadb-store/5.11-SNAPSHOT/activemq-kahadb-store-5.11-SNAPSHOT.pom
[JENKINS] Archiving <https://builds.apache.org/job/ActiveMQ/ws/activemq-kahadb-store/target/activemq-kahadb-store-5.11-SNAPSHOT.jar>
to org.apache.activemq/activemq-kahadb-store/5.11-SNAPSHOT/activemq-kahadb-store-5.11-SNAPSHOT.jar
No artifacts from ActiveMQ ? ActiveMQ :: KahaDB Store #1475 to compare, so performing full
copy of artifacts
[JENKINS] Archiving <https://builds.apache.org/job/ActiveMQ/ws/activemq-jaas/pom.xml>
to org.apache.activemq/activemq-jaas/5.11-SNAPSHOT/activemq-jaas-5.11-SNAPSHOT.pom
[JENKINS] Archiving <https://builds.apache.org/job/ActiveMQ/ws/activemq-jaas/target/activemq-jaas-5.11-SNAPSHOT.jar>
to org.apache.activemq/activemq-jaas/5.11-SNAPSHOT/activemq-jaas-5.11-SNAPSHOT.jar
No artifacts from ActiveMQ ? ActiveMQ :: JAAS #1475 to compare, so performing full copy of
artifacts
[JENKINS] Archiving <https://builds.apache.org/job/ActiveMQ/ws/activemq-tooling/pom.xml>
to org.apache.activemq.tooling/activemq-tooling/5.11-SNAPSHOT/activemq-tooling-5.11-SNAPSHOT.pom
Sending artifact delta relative to ActiveMQ ? ActiveMQ :: Tooling #1472
Archived 1 artifacts
Archive block size is 32768
Received 0 blocks and 1679 bytes
Compression is 0.0%
Took 0.21 sec
[JENKINS] Archiving <https://builds.apache.org/job/ActiveMQ/ws/activemq-partition/pom.xml>
to org.apache.activemq/activemq-partition/5.11-SNAPSHOT/activemq-partition-5.11-SNAPSHOT.pom
[JENKINS] Archiving <https://builds.apache.org/job/ActiveMQ/ws/activemq-partition/target/activemq-partition-5.11-SNAPSHOT.jar>
to org.apache.activemq/activemq-partition/5.11-SNAPSHOT/activemq-partition-5.11-SNAPSHOT.jar
No artifacts from ActiveMQ ? ActiveMQ :: Partition Management #1475 to compare, so performing
full copy of artifacts
[JENKINS] Archiving <https://builds.apache.org/job/ActiveMQ/ws/activemq-web/pom.xml>
to org.apache.activemq/activemq-web/5.11-SNAPSHOT/activemq-web-5.11-SNAPSHOT.pom
Sending artifact delta relative to ActiveMQ ? ActiveMQ :: Web #1472
Archived 1 artifacts
Archive block size is 32768
Received 0 blocks and 4485 bytes
Compression is 0.0%
Took 0.45 sec
[JENKINS] Archiving <https://builds.apache.org/job/ActiveMQ/ws/activemq-leveldb-store/pom.xml>
to org.apache.activemq/activemq-leveldb-store/5.11-SNAPSHOT/activemq-leveldb-store-5.11-SNAPSHOT.pom
[JENKINS] Archiving <https://builds.apache.org/job/ActiveMQ/ws/activemq-leveldb-store/target/activemq-leveldb-store-5.11-SNAPSHOT.jar>
to org.apache.activemq/activemq-leveldb-store/5.11-SNAPSHOT/activemq-leveldb-store-5.11-SNAPSHOT.jar
No artifacts from ActiveMQ ? ActiveMQ :: LevelDB Store #1475 to compare, so performing full
copy of artifacts
[JENKINS] Archiving <https://builds.apache.org/job/ActiveMQ/ws/activemq-fileserver/pom.xml>
to org.apache.activemq/activemq-fileserver/5.11-SNAPSHOT/activemq-fileserver-5.11-SNAPSHOT.pom
Sending artifact delta relative to ActiveMQ ? ActiveMQ :: File Server #1472
Archived 1 artifacts
Archive block size is 32768
Received 0 blocks and 3739 bytes
Compression is 0.0%
Took 0.2 sec
[JENKINS] Archiving <https://builds.apache.org/job/ActiveMQ/ws/activemq-karaf/pom.xml>
to org.apache.activemq/activemq-karaf/5.11-SNAPSHOT/activemq-karaf-5.11-SNAPSHOT.pom
Sending artifact delta relative to ActiveMQ ? ActiveMQ :: Apache Karaf #1472
Archived 1 artifacts
Archive block size is 32768
Received 0 blocks and 6902 bytes
Compression is 0.0%
Took 0.15 sec
[JENKINS] Archiving <https://builds.apache.org/job/ActiveMQ/ws/activemq-http/pom.xml>
to org.apache.activemq/activemq-http/5.11-SNAPSHOT/activemq-http-5.11-SNAPSHOT.pom
Sending artifact delta relative to ActiveMQ ? ActiveMQ :: HTTP Protocol Support #1472
Archived 1 artifacts
Archive block size is 32768
Received 0 blocks and 7154 bytes
Compression is 0.0%
Took 0.2 sec
Sending e-mails to: dev@activemq.apache.org
Sending e-mails to: dev@activemq.apache.org
channel stopped
[locks-and-latches] Releasing all the locks
[locks-and-latches] All the locks released

Mime
View raw message