activemq-dev mailing list archives

Site index · List index
Message view « Date » · « Thread »
Top « Date » · « Thread »
From Apache Jenkins Server <jenk...@builds.apache.org>
Subject Build failed in Jenkins: ActiveMQ » ActiveMQ :: Unit Tests #1452
Date Wed, 04 Jun 2014 16:43:56 GMT
See <https://builds.apache.org/job/ActiveMQ/org.apache.activemq$activemq-unit-tests/1452/changes>

Changes:

[dejan] [maven-release-plugin] prepare release activemq-5.10.0

[dejan] [maven-release-plugin] prepare for next development iteration

------------------------------------------
[...truncated 354 lines...]
[15:13:43] Tests run: 12, Failures: 0, Errors: 0, Skipped: 0, Time elapsed: 82.673 sec - in
org.apache.activemq.broker.policy.AbortSlowConsumer1Test
[15:13:44] Running org.apache.activemq.broker.policy.AbortSlowConsumer2Test
[15:13:55] Tests run: 2, Failures: 0, Errors: 0, Skipped: 0, Time elapsed: 11.043 sec - in
org.apache.activemq.broker.policy.AbortSlowConsumer2Test
[15:13:56] Running org.apache.activemq.broker.policy.DeadLetterTest
[15:15:18] Tests run: 4, Failures: 0, Errors: 0, Skipped: 0, Time elapsed: 82.388 sec - in
org.apache.activemq.broker.policy.DeadLetterTest
[15:15:19] Running org.apache.activemq.broker.policy.DestinationCursorConfigTest
[15:15:21] Tests run: 2, Failures: 0, Errors: 0, Skipped: 0, Time elapsed: 1.931 sec - in
org.apache.activemq.broker.policy.DestinationCursorConfigTest
[15:15:21] Running org.apache.activemq.broker.policy.DiscardingDeadLetterPolicyTest
[15:17:24] Tests run: 4, Failures: 0, Errors: 0, Skipped: 0, Time elapsed: 122.754 sec - in
org.apache.activemq.broker.policy.DiscardingDeadLetterPolicyTest
[15:17:25] Running org.apache.activemq.broker.policy.IndividualDeadLetterTest
[15:19:19] Tests run: 5, Failures: 0, Errors: 0, Skipped: 0, Time elapsed: 114.478 sec - in
org.apache.activemq.broker.policy.IndividualDeadLetterTest
[15:19:20] Running org.apache.activemq.broker.policy.IndividualDeadLetterViaXmlTest
[15:20:43] Tests run: 4, Failures: 0, Errors: 0, Skipped: 0, Time elapsed: 83.619 sec - in
org.apache.activemq.broker.policy.IndividualDeadLetterViaXmlTest
[15:20:44] Running org.apache.activemq.broker.policy.MessageGroupConfigTest
[15:20:49] Tests run: 5, Failures: 0, Errors: 0, Skipped: 0, Time elapsed: 4.843 sec - in
org.apache.activemq.broker.policy.MessageGroupConfigTest
[15:20:49] Running org.apache.activemq.broker.policy.MessageListenerDeadLetterTest
[15:20:53] Tests run: 4, Failures: 0, Errors: 0, Skipped: 0, Time elapsed: 3.314 sec - in
org.apache.activemq.broker.policy.MessageListenerDeadLetterTest
[15:20:53] Running org.apache.activemq.broker.policy.NoConsumerDeadLetterTest
[15:20:56] Tests run: 5, Failures: 0, Errors: 0, Skipped: 0, Time elapsed: 2.266 sec - in
org.apache.activemq.broker.policy.NoConsumerDeadLetterTest
[15:20:56] Running org.apache.activemq.broker.policy.NoRetryDeadLetterTest
[15:20:58] Tests run: 4, Failures: 0, Errors: 0, Skipped: 0, Time elapsed: 1.545 sec - in
org.apache.activemq.broker.policy.NoRetryDeadLetterTest
[15:20:58] Running org.apache.activemq.broker.policy.PerDurableConsumerDeadLetterTest
[15:22:21] Tests run: 4, Failures: 0, Errors: 0, Skipped: 0, Time elapsed: 82.453 sec - in
org.apache.activemq.broker.policy.PerDurableConsumerDeadLetterTest
[15:22:21] Running org.apache.activemq.broker.policy.PriorityNetworkDispatchPolicyTest
[15:22:22] Tests run: 1, Failures: 0, Errors: 0, Skipped: 0, Time elapsed: 0.789 sec - in
org.apache.activemq.broker.policy.PriorityNetworkDispatchPolicyTest
[15:22:22] Running org.apache.activemq.broker.policy.SecureDLQTest
[15:22:28] Tests run: 4, Failures: 0, Errors: 0, Skipped: 0, Time elapsed: 5.449 sec - in
org.apache.activemq.broker.policy.SecureDLQTest
[15:22:28] Running org.apache.activemq.broker.policy.StrictOrderDispatchPolicyTest
[15:23:04] Tests run: 8, Failures: 0, Errors: 0, Skipped: 0, Time elapsed: 35.232 sec - in
org.apache.activemq.broker.policy.StrictOrderDispatchPolicyTest
[15:23:04] Running org.apache.activemq.broker.region.DestinationGCTest
[15:23:19] Tests run: 2, Failures: 0, Errors: 0, Skipped: 0, Time elapsed: 14.972 sec - in
org.apache.activemq.broker.region.DestinationGCTest
[15:23:20] Running org.apache.activemq.broker.region.DestinationRemoveRestartTest
[15:23:24] Tests run: 2, Failures: 0, Errors: 0, Skipped: 0, Time elapsed: 4.149 sec - in
org.apache.activemq.broker.region.DestinationRemoveRestartTest
[15:23:24] Running org.apache.activemq.broker.region.QueueDuplicatesFromStoreTest
[15:24:57] Tests run: 2, Failures: 0, Errors: 0, Skipped: 0, Time elapsed: 92.702 sec - in
org.apache.activemq.broker.region.QueueDuplicatesFromStoreTest
[15:24:57] Running org.apache.activemq.broker.region.QueueOptimizedDispatchExceptionTest
[15:24:58] Tests run: 1, Failures: 0, Errors: 0, Skipped: 0, Time elapsed: 0.694 sec - in
org.apache.activemq.broker.region.QueueOptimizedDispatchExceptionTest
[15:24:58] Running org.apache.activemq.broker.region.QueuePurgeTest
[15:34:59] Running org.apache.activemq.broker.region.QueueResendDuringShutdownTest
[15:35:09] Tests run: 3, Failures: 0, Errors: 0, Skipped: 0, Time elapsed: 10.267 sec - in
org.apache.activemq.broker.region.QueueResendDuringShutdownTest
[15:35:10] Running org.apache.activemq.broker.region.SubscriptionAddRemoveQueueTest
[15:35:14] Tests run: 1, Failures: 0, Errors: 0, Skipped: 0, Time elapsed: 4.164 sec - in
org.apache.activemq.broker.region.SubscriptionAddRemoveQueueTest
[15:35:15] Running org.apache.activemq.broker.region.UniquePropertyMessageEvictionStrategyTest
[15:35:27] Tests run: 1, Failures: 0, Errors: 0, Skipped: 0, Time elapsed: 12.01 sec - in
org.apache.activemq.broker.region.UniquePropertyMessageEvictionStrategyTest
[15:35:28] Running org.apache.activemq.broker.region.cursors.CursorDurableTest
[15:35:33] Tests run: 2, Failures: 0, Errors: 0, Skipped: 0, Time elapsed: 5.876 sec - in
org.apache.activemq.broker.region.cursors.CursorDurableTest
[15:35:34] Running org.apache.activemq.broker.region.cursors.CursorQueueStoreTest
[15:37:19] Tests run: 5, Failures: 0, Errors: 0, Skipped: 0, Time elapsed: 104.63 sec - in
org.apache.activemq.broker.region.cursors.CursorQueueStoreTest
[15:37:19] Running org.apache.activemq.broker.region.cursors.NegativeQueueTest
[15:42:53] Tests run: 4, Failures: 0, Errors: 0, Skipped: 0, Time elapsed: 333.374 sec - in
org.apache.activemq.broker.region.cursors.NegativeQueueTest
[15:42:53] Running org.apache.activemq.broker.region.cursors.OrderPendingListTest
[15:42:54] Tests run: 9, Failures: 0, Errors: 0, Skipped: 0, Time elapsed: 0.26 sec - in org.apache.activemq.broker.region.cursors.OrderPendingListTest
[15:42:54] Running org.apache.activemq.broker.region.cursors.PrioritizedPendingListTest
[15:42:54] Tests run: 7, Failures: 0, Errors: 0, Skipped: 0, Time elapsed: 0.287 sec - in
org.apache.activemq.broker.region.cursors.PrioritizedPendingListTest
[15:42:54] Running org.apache.activemq.broker.region.cursors.StoreBasedCursorTest
[15:43:09] Tests run: 5, Failures: 0, Errors: 0, Skipped: 0, Time elapsed: 14.994 sec - in
org.apache.activemq.broker.region.cursors.StoreBasedCursorTest
[15:43:10] Running org.apache.activemq.broker.region.cursors.StoreQueueCursorJDBCNoDuplicateTest
[15:43:15] Tests run: 1, Failures: 0, Errors: 0, Skipped: 0, Time elapsed: 5.461 sec - in
org.apache.activemq.broker.region.cursors.StoreQueueCursorJDBCNoDuplicateTest
[15:43:16] Running org.apache.activemq.broker.region.cursors.StoreQueueCursorKahaDBNoDuplicateTest
[15:43:17] Tests run: 1, Failures: 0, Errors: 0, Skipped: 0, Time elapsed: 1.632 sec - in
org.apache.activemq.broker.region.cursors.StoreQueueCursorKahaDBNoDuplicateTest
[15:43:18] Running org.apache.activemq.broker.region.cursors.StoreQueueCursorLevelDBNoDuplicateTest
[15:43:20] Tests run: 1, Failures: 0, Errors: 0, Skipped: 0, Time elapsed: 1.871 sec - in
org.apache.activemq.broker.region.cursors.StoreQueueCursorLevelDBNoDuplicateTest
[15:43:20] Running org.apache.activemq.broker.region.cursors.StoreQueueCursorMemoryNoDuplicateTest
[15:43:21] Tests run: 1, Failures: 0, Errors: 0, Skipped: 0, Time elapsed: 0.671 sec - in
org.apache.activemq.broker.region.cursors.StoreQueueCursorMemoryNoDuplicateTest
[15:43:21] Running org.apache.activemq.broker.region.cursors.StoreQueueCursorNoDuplicateTest
[15:43:23] Tests run: 1, Failures: 0, Errors: 0, Skipped: 0, Time elapsed: 1.86 sec - in org.apache.activemq.broker.region.cursors.StoreQueueCursorNoDuplicateTest
[15:43:23] Running org.apache.activemq.broker.region.group.MessageGroupHashBucketTest
[15:43:23] Tests run: 2, Failures: 0, Errors: 0, Skipped: 0, Time elapsed: 0.058 sec - in
org.apache.activemq.broker.region.group.MessageGroupHashBucketTest
[15:43:24] Running org.apache.activemq.broker.region.group.MessageGroupMapTest
[15:43:24] Tests run: 2, Failures: 0, Errors: 0, Skipped: 0, Time elapsed: 0.057 sec - in
org.apache.activemq.broker.region.group.MessageGroupMapTest
[15:43:24] Running org.apache.activemq.broker.region.group.MessageGroupTest
[15:43:25] Tests run: 3, Failures: 0, Errors: 0, Skipped: 0, Time elapsed: 1.447 sec - in
org.apache.activemq.broker.region.group.MessageGroupTest
[15:43:26] Running org.apache.activemq.broker.scheduler.JmsCronSchedulerTest
[15:46:01] Tests run: 2, Failures: 0, Errors: 0, Skipped: 0, Time elapsed: 155.433 sec - in
org.apache.activemq.broker.scheduler.JmsCronSchedulerTest
[15:46:02] Running org.apache.activemq.broker.scheduler.JmsSchedulerTest
[15:47:52] Tests run: 6, Failures: 0, Errors: 0, Skipped: 0, Time elapsed: 109.88 sec - in
org.apache.activemq.broker.scheduler.JmsSchedulerTest
[15:47:52] Running org.apache.activemq.broker.scheduler.JobSchedulerBrokerShutdownTest
[15:48:00] Tests run: 1, Failures: 0, Errors: 0, Skipped: 0, Time elapsed: 8.263 sec - in
org.apache.activemq.broker.scheduler.JobSchedulerBrokerShutdownTest
[15:48:01] Running org.apache.activemq.broker.scheduler.JobSchedulerManagementTest
[15:49:26] Tests run: 7, Failures: 0, Errors: 0, Skipped: 0, Time elapsed: 85.292 sec - in
org.apache.activemq.broker.scheduler.JobSchedulerManagementTest
[15:49:26] Running org.apache.activemq.broker.scheduler.JobSchedulerStoreTest
[15:49:44] Tests run: 1, Failures: 0, Errors: 0, Skipped: 0, Time elapsed: 17.507 sec - in
org.apache.activemq.broker.scheduler.JobSchedulerStoreTest
[15:49:44] Running org.apache.activemq.broker.scheduler.JobSchedulerTest
[15:50:16] Tests run: 9, Failures: 0, Errors: 0, Skipped: 0, Time elapsed: 32.048 sec - in
org.apache.activemq.broker.scheduler.JobSchedulerTest
[15:50:16] Running org.apache.activemq.broker.scheduler.JobSchedulerTxTest
[15:50:32] Tests run: 2, Failures: 0, Errors: 0, Skipped: 0, Time elapsed: 15.968 sec - in
org.apache.activemq.broker.scheduler.JobSchedulerTxTest
[15:50:33] Running org.apache.activemq.broker.scheduler.LostScheduledMessagesTest
[15:51:07] Tests run: 2, Failures: 0, Errors: 0, Skipped: 0, Time elapsed: 34.347 sec - in
org.apache.activemq.broker.scheduler.LostScheduledMessagesTest
[15:51:07] Running org.apache.activemq.broker.store.DefaultStoreBrokerTest
[15:53:35] Tests run: 129, Failures: 0, Errors: 0, Skipped: 0, Time elapsed: 147.506 sec -
in org.apache.activemq.broker.store.DefaultStoreBrokerTest
[15:53:35] Running org.apache.activemq.broker.store.DefaultStoreRecoveryBrokerTest
[15:54:24] Tests run: 9, Failures: 0, Errors: 0, Skipped: 0, Time elapsed: 48.857 sec - in
org.apache.activemq.broker.store.DefaultStoreRecoveryBrokerTest
[15:54:25] Running org.apache.activemq.broker.store.RecoverExpiredMessagesTest
[15:55:04] Tests run: 4, Failures: 0, Errors: 0, Skipped: 0, Time elapsed: 38.887 sec - in
org.apache.activemq.broker.store.RecoverExpiredMessagesTest
[15:55:04] Running org.apache.activemq.broker.util.PluginBrokerTest
[15:55:07] Tests run: 1, Failures: 0, Errors: 0, Skipped: 0, Time elapsed: 2.695 sec - in
org.apache.activemq.broker.util.PluginBrokerTest
[15:55:07] Running org.apache.activemq.broker.util.RedeliveryPluginTest
[15:55:08] Tests run: 1, Failures: 0, Errors: 0, Skipped: 0, Time elapsed: 0.43 sec - in org.apache.activemq.broker.util.RedeliveryPluginTest
[15:55:08] Running org.apache.activemq.broker.util.TimeStampingBrokerPluginTest
[15:55:11] Tests run: 3, Failures: 0, Errors: 0, Skipped: 0, Time elapsed: 3.014 sec - in
org.apache.activemq.broker.util.TimeStampingBrokerPluginTest
[15:55:12] Running org.apache.activemq.broker.util.TraceBrokerPathPluginTest
[15:55:13] Tests run: 1, Failures: 0, Errors: 0, Skipped: 0, Time elapsed: 1.144 sec - in
org.apache.activemq.broker.util.TraceBrokerPathPluginTest
[15:55:14] Running org.apache.activemq.broker.virtual.CompositeQueueTest
[15:55:16] Tests run: 1, Failures: 0, Errors: 0, Skipped: 0, Time elapsed: 1.911 sec - in
org.apache.activemq.broker.virtual.CompositeQueueTest
[15:55:16] Running org.apache.activemq.broker.virtual.CompositeTopicTest
[15:55:19] Tests run: 1, Failures: 0, Errors: 0, Skipped: 0, Time elapsed: 2.864 sec - in
org.apache.activemq.broker.virtual.CompositeTopicTest
[15:55:19] Running org.apache.activemq.broker.virtual.DestinationInterceptorDurableSubTest
[15:55:21] Tests run: 1, Failures: 0, Errors: 0, Skipped: 0, Time elapsed: 1.797 sec - in
org.apache.activemq.broker.virtual.DestinationInterceptorDurableSubTest
[15:55:22] Running org.apache.activemq.broker.virtual.FilteredQueueTest
[15:55:25] Tests run: 1, Failures: 0, Errors: 0, Skipped: 0, Time elapsed: 3.286 sec - in
org.apache.activemq.broker.virtual.FilteredQueueTest
[15:55:26] Running org.apache.activemq.broker.virtual.MirroredQueueCorrectMemoryUsageTest
[15:58:15] Tests run: 1, Failures: 0, Errors: 0, Skipped: 0, Time elapsed: 169.894 sec - in
org.apache.activemq.broker.virtual.MirroredQueueCorrectMemoryUsageTest
[15:58:16] Running org.apache.activemq.broker.virtual.MirroredQueueTest
[15:58:17] Tests run: 2, Failures: 0, Errors: 0, Skipped: 0, Time elapsed: 1.094 sec - in
org.apache.activemq.broker.virtual.MirroredQueueTest
[15:58:18] Running org.apache.activemq.broker.virtual.MirroredQueueUsingVirtualTopicQueueTest
[15:58:20] Tests run: 2, Failures: 0, Errors: 0, Skipped: 0, Time elapsed: 2.082 sec - in
org.apache.activemq.broker.virtual.MirroredQueueUsingVirtualTopicQueueTest
[15:58:20] Running org.apache.activemq.broker.virtual.VirtualDestPerfTest
[15:58:21] Tests run: 2, Failures: 0, Errors: 0, Skipped: 2, Time elapsed: 0.083 sec - in
org.apache.activemq.broker.virtual.VirtualDestPerfTest
[15:58:21] Running org.apache.activemq.broker.virtual.VirtualTopicDLQTest
[15:58:29] Tests run: 1, Failures: 0, Errors: 0, Skipped: 0, Time elapsed: 8.36 sec - in org.apache.activemq.broker.virtual.VirtualTopicDLQTest
[15:58:29] Running org.apache.activemq.broker.virtual.VirtualTopicDisconnectSelectorTest
[15:58:33] Tests run: 2, Failures: 0, Errors: 0, Skipped: 0, Time elapsed: 3.784 sec - in
org.apache.activemq.broker.virtual.VirtualTopicDisconnectSelectorTest
[15:58:34] Running org.apache.activemq.broker.virtual.VirtualTopicPubSubTest
[15:58:36] Tests run: 2, Failures: 0, Errors: 0, Skipped: 0, Time elapsed: 2.203 sec - in
org.apache.activemq.broker.virtual.VirtualTopicPubSubTest
[15:58:37] Running org.apache.activemq.broker.virtual.VirtualTopicPubSubUsingXBeanTest
[15:58:39] Tests run: 2, Failures: 0, Errors: 0, Skipped: 0, Time elapsed: 2.217 sec - in
org.apache.activemq.broker.virtual.VirtualTopicPubSubUsingXBeanTest
[15:58:39] Running org.apache.activemq.broker.virtual.VirtualTopicSelectorTest
[15:58:41] Tests run: 1, Failures: 0, Errors: 0, Skipped: 0, Time elapsed: 1.04 sec - in org.apache.activemq.broker.virtual.VirtualTopicSelectorTest
[15:58:41] Running org.apache.activemq.broker.virtual.VirtualTopicsAndDurableSubsTest
[15:59:01] Tests run: 25, Failures: 0, Errors: 0, Skipped: 0, Time elapsed: 20.029 sec - in
org.apache.activemq.broker.virtual.VirtualTopicsAndDurableSubsTest
[15:59:02] Running org.apache.activemq.bugs.AMQ1687Test
[15:59:03] Tests run: 1, Failures: 0, Errors: 0, Skipped: 0, Time elapsed: 1.232 sec - in
org.apache.activemq.bugs.AMQ1687Test
[15:59:04] Running org.apache.activemq.bugs.AMQ1853Test
[15:59:11] Tests run: 1, Failures: 0, Errors: 0, Skipped: 0, Time elapsed: 7.877 sec - in
org.apache.activemq.bugs.AMQ1853Test
[15:59:12] Running org.apache.activemq.bugs.AMQ1893Test
[16:03:45] Tests run: 1, Failures: 0, Errors: 0, Skipped: 0, Time elapsed: 273.241 sec - in
org.apache.activemq.bugs.AMQ1893Test
[16:03:46] Running org.apache.activemq.bugs.AMQ1917Test
[16:03:52] Tests run: 1, Failures: 0, Errors: 0, Skipped: 0, Time elapsed: 6.093 sec - in
org.apache.activemq.bugs.AMQ1917Test
[16:03:52] Running org.apache.activemq.bugs.AMQ1936Test
[16:06:10] Tests run: 1, Failures: 0, Errors: 0, Skipped: 0, Time elapsed: 138.147 sec - in
org.apache.activemq.bugs.AMQ1936Test
[16:06:11] Running org.apache.activemq.bugs.AMQ2021Test
[16:06:26] Tests run: 1, Failures: 0, Errors: 0, Skipped: 0, Time elapsed: 14.987 sec - in
org.apache.activemq.bugs.AMQ2021Test
[16:06:27] Running org.apache.activemq.bugs.AMQ2084Test
[16:06:33] Tests run: 2, Failures: 0, Errors: 0, Skipped: 0, Time elapsed: 6.377 sec - in
org.apache.activemq.bugs.AMQ2084Test
[16:06:34] Running org.apache.activemq.bugs.AMQ2103Test
[16:06:35] Tests run: 2, Failures: 0, Errors: 0, Skipped: 0, Time elapsed: 1.062 sec - in
org.apache.activemq.bugs.AMQ2103Test
[16:06:35] Running org.apache.activemq.bugs.AMQ2149LevelDBTest
[16:14:39] Tests run: 4, Failures: 2, Errors: 0, Skipped: 0, Time elapsed: 484.157 sec <<<
FAILURE! - in org.apache.activemq.bugs.AMQ2149LevelDBTest
[16:14:39] testQueueTransactionalOrderWithRestart(org.apache.activemq.bugs.AMQ2149LevelDBTest)
 Time elapsed: 61.919 sec  <<< FAILURE!
[16:14:39] java.lang.AssertionError: No exceptions
[16:14:39] 	at org.junit.Assert.fail(Assert.java:88)
[16:14:39] 	at org.junit.Assert.assertTrue(Assert.java:41)
[16:14:39] 	at org.apache.activemq.bugs.AMQ2149Test.verifyOrderedMessageReceipt(AMQ2149Test.java:560)
[16:14:39] 	at org.apache.activemq.bugs.AMQ2149Test.doTestTransactionalOrderWithRestart(AMQ2149Test.java:435)
[16:14:39] 	at org.apache.activemq.bugs.AMQ2149Test.testQueueTransactionalOrderWithRestart(AMQ2149Test.java:412)
[16:14:39] 	at sun.reflect.NativeMethodAccessorImpl.invoke0(Native Method)
[16:14:39] 	at sun.reflect.NativeMethodAccessorImpl.invoke(NativeMethodAccessorImpl.java:39)
[16:14:39] 	at sun.reflect.DelegatingMethodAccessorImpl.invoke(DelegatingMethodAccessorImpl.java:25)
[16:14:39] 	at java.lang.reflect.Method.invoke(Method.java:597)
[16:14:39] 	at org.junit.runners.model.FrameworkMethod$1.runReflectiveCall(FrameworkMethod.java:47)
[16:14:39] 	at org.junit.internal.runners.model.ReflectiveCallable.run(ReflectiveCallable.java:12)
[16:14:39] 	at org.junit.runners.model.FrameworkMethod.invokeExplosively(FrameworkMethod.java:44)
[16:14:39] 	at org.junit.internal.runners.statements.InvokeMethod.evaluate(InvokeMethod.java:17)
[16:14:39] 	at org.junit.internal.runners.statements.FailOnTimeout$StatementThread.run(FailOnTimeout.java:74)
[16:14:39] 
[16:14:39] testTopicTransactionalOrderWithRestart(org.apache.activemq.bugs.AMQ2149LevelDBTest)
 Time elapsed: 240.584 sec  <<< FAILURE!
[16:14:39] java.lang.AssertionError: No timeout waiting for senders/receivers to complete
[16:14:39] 	at org.junit.Assert.fail(Assert.java:88)
[16:14:39] 	at org.junit.Assert.assertTrue(Assert.java:41)
[16:14:39] 	at org.apache.activemq.bugs.AMQ2149Test.verifyOrderedMessageReceipt(AMQ2149Test.java:549)
[16:14:39] 	at org.apache.activemq.bugs.AMQ2149Test.doTestTransactionalOrderWithRestart(AMQ2149Test.java:435)
[16:14:39] 	at org.apache.activemq.bugs.AMQ2149Test.testTopicTransactionalOrderWithRestart(AMQ2149Test.java:417)
[16:14:39] 	at sun.reflect.NativeMethodAccessorImpl.invoke0(Native Method)
[16:14:39] 	at sun.reflect.NativeMethodAccessorImpl.invoke(NativeMethodAccessorImpl.java:39)
[16:14:39] 	at sun.reflect.DelegatingMethodAccessorImpl.invoke(DelegatingMethodAccessorImpl.java:25)
[16:14:39] 	at java.lang.reflect.Method.invoke(Method.java:597)
[16:14:39] 	at org.junit.runners.model.FrameworkMethod$1.runReflectiveCall(FrameworkMethod.java:47)
[16:14:39] 	at org.junit.internal.runners.model.ReflectiveCallable.run(ReflectiveCallable.java:12)
[16:14:39] 	at org.junit.runners.model.FrameworkMethod.invokeExplosively(FrameworkMethod.java:44)
[16:14:39] 	at org.junit.internal.runners.statements.InvokeMethod.evaluate(InvokeMethod.java:17)
[16:14:39] 	at org.junit.internal.runners.statements.FailOnTimeout$StatementThread.run(FailOnTimeout.java:74)
[16:14:39] 
[16:14:42] Running org.apache.activemq.bugs.AMQ2149Test
[16:25:47] Tests run: 4, Failures: 2, Errors: 0, Skipped: 0, Time elapsed: 664.799 sec <<<
FAILURE! - in org.apache.activemq.bugs.AMQ2149Test
[16:25:47] testQueueTransactionalOrderWithRestart(org.apache.activemq.bugs.AMQ2149Test)  Time
elapsed: 242.117 sec  <<< FAILURE!
[16:25:47] java.lang.AssertionError: No timeout waiting for senders/receivers to complete
[16:25:47] 	at org.junit.Assert.fail(Assert.java:88)
[16:25:47] 	at org.junit.Assert.assertTrue(Assert.java:41)
[16:25:47] 	at org.apache.activemq.bugs.AMQ2149Test.verifyOrderedMessageReceipt(AMQ2149Test.java:549)
[16:25:47] 	at org.apache.activemq.bugs.AMQ2149Test.doTestTransactionalOrderWithRestart(AMQ2149Test.java:435)
[16:25:47] 	at org.apache.activemq.bugs.AMQ2149Test.testQueueTransactionalOrderWithRestart(AMQ2149Test.java:412)
[16:25:47] 
[16:25:47] testTopicTransactionalOrderWithRestart(org.apache.activemq.bugs.AMQ2149Test)  Time
elapsed: 240.761 sec  <<< FAILURE!
[16:25:47] java.lang.AssertionError: No timeout waiting for senders/receivers to complete
[16:25:47] 	at org.junit.Assert.fail(Assert.java:88)
[16:25:47] 	at org.junit.Assert.assertTrue(Assert.java:41)
[16:25:47] 	at org.apache.activemq.bugs.AMQ2149Test.verifyOrderedMessageReceipt(AMQ2149Test.java:549)
[16:25:47] 	at org.apache.activemq.bugs.AMQ2149Test.doTestTransactionalOrderWithRestart(AMQ2149Test.java:435)
[16:25:47] 	at org.apache.activemq.bugs.AMQ2149Test.testTopicTransactionalOrderWithRestart(AMQ2149Test.java:417)
[16:25:47] 
[16:25:48] Running org.apache.activemq.bugs.AMQ2171Test
[16:25:53] Tests run: 2, Failures: 0, Errors: 0, Skipped: 0, Time elapsed: 4.789 sec - in
org.apache.activemq.bugs.AMQ2171Test
[16:25:53] Running org.apache.activemq.bugs.AMQ2200Test
[16:25:56] Tests run: 1, Failures: 0, Errors: 0, Skipped: 0, Time elapsed: 2.965 sec - in
org.apache.activemq.bugs.AMQ2200Test
[16:25:57] Running org.apache.activemq.bugs.AMQ2213Test
[16:26:00] Tests run: 3, Failures: 0, Errors: 0, Skipped: 0, Time elapsed: 3.343 sec - in
org.apache.activemq.bugs.AMQ2213Test
[16:26:01] Running org.apache.activemq.bugs.AMQ2314Test
[16:27:40] Tests run: 2, Failures: 0, Errors: 0, Skipped: 0, Time elapsed: 99.476 sec - in
org.apache.activemq.bugs.AMQ2314Test
[16:27:41] Running org.apache.activemq.bugs.AMQ2356Test
[16:30:05] Tests run: 1, Failures: 0, Errors: 0, Skipped: 0, Time elapsed: 143.89 sec - in
org.apache.activemq.bugs.AMQ2356Test
[16:30:05] Running org.apache.activemq.bugs.AMQ2364Test
[16:30:22] Tests run: 1, Failures: 0, Errors: 0, Skipped: 0, Time elapsed: 17.252 sec - in
org.apache.activemq.bugs.AMQ2364Test
[16:30:23] Running org.apache.activemq.bugs.AMQ2383Test
[16:30:24] Tests run: 1, Failures: 0, Errors: 0, Skipped: 0, Time elapsed: 0.797 sec - in
org.apache.activemq.bugs.AMQ2383Test
[16:30:24] Running org.apache.activemq.bugs.AMQ2401Test
[16:30:33] Tests run: 1, Failures: 0, Errors: 0, Skipped: 0, Time elapsed: 9.604 sec - in
org.apache.activemq.bugs.AMQ2401Test
[16:30:34] Running org.apache.activemq.bugs.AMQ2413Test
[16:31:52] Tests run: 8, Failures: 0, Errors: 0, Skipped: 0, Time elapsed: 78.577 sec - in
org.apache.activemq.bugs.AMQ2413Test
[16:31:53] Running org.apache.activemq.bugs.AMQ2439Test
[16:32:10] Tests run: 1, Failures: 0, Errors: 0, Skipped: 0, Time elapsed: 17.424 sec - in
org.apache.activemq.bugs.AMQ2439Test
[16:32:11] Running org.apache.activemq.bugs.AMQ2489Test
[16:32:16] Tests run: 2, Failures: 0, Errors: 0, Skipped: 0, Time elapsed: 5.097 sec - in
org.apache.activemq.bugs.AMQ2489Test
[16:32:17] Running org.apache.activemq.bugs.AMQ2512Test
[16:33:30] Tests run: 1, Failures: 0, Errors: 0, Skipped: 0, Time elapsed: 73.077 sec - in
org.apache.activemq.bugs.AMQ2512Test
[16:33:30] Running org.apache.activemq.bugs.AMQ2513Test
[16:33:33] Tests run: 1, Failures: 0, Errors: 0, Skipped: 0, Time elapsed: 2.642 sec - in
org.apache.activemq.bugs.AMQ2513Test
[16:33:33] Running org.apache.activemq.bugs.AMQ2528Test
[16:33:34] Tests run: 1, Failures: 0, Errors: 0, Skipped: 0, Time elapsed: 1.032 sec - in
org.apache.activemq.bugs.AMQ2528Test
[16:33:35] Running org.apache.activemq.bugs.AMQ2571Test
[16:33:36] Tests run: 1, Failures: 0, Errors: 0, Skipped: 0, Time elapsed: 0.816 sec - in
org.apache.activemq.bugs.AMQ2571Test
[16:33:36] Running org.apache.activemq.bugs.AMQ2580Test
[16:33:46] Tests run: 5, Failures: 0, Errors: 0, Skipped: 0, Time elapsed: 9.779 sec - in
org.apache.activemq.bugs.AMQ2580Test
[16:33:46] Running org.apache.activemq.bugs.AMQ2584ConcurrentDlqTest
[16:34:51] Tests run: 1, Failures: 0, Errors: 0, Skipped: 0, Time elapsed: 65.069 sec - in
org.apache.activemq.bugs.AMQ2584ConcurrentDlqTest
[16:34:52] Running org.apache.activemq.bugs.AMQ2584Test
[16:34:59] 
[16:34:59] Results :
[16:34:59] 
[16:34:59] Failed tests: 
[16:34:59]   DbRestartJDBCQueueMasterSlaveLeaseQuiesceTest>CombinationTestSupport.runBare:113->CombinationTestSupport.runBare:107->QueueMasterSlaveTestSupport.testVirtualTopicFailover:132
slave started
[16:34:59]   AMQ2149LevelDBTest>AMQ2149Test.testQueueTransactionalOrderWithRestart:412->AMQ2149Test.doTestTransactionalOrderWithRestart:435->AMQ2149Test.verifyOrderedMessageReceipt:560
No exceptions
[16:34:59]   AMQ2149LevelDBTest>AMQ2149Test.testTopicTransactionalOrderWithRestart:417->AMQ2149Test.doTestTransactionalOrderWithRestart:435->AMQ2149Test.verifyOrderedMessageReceipt:549
No timeout waiting for senders/receivers to complete
[16:34:59]   AMQ2149Test.testQueueTransactionalOrderWithRestart:412->doTestTransactionalOrderWithRestart:435->verifyOrderedMessageReceipt:549
No timeout waiting for senders/receivers to complete
[16:34:59]   AMQ2149Test.testTopicTransactionalOrderWithRestart:417->doTestTransactionalOrderWithRestart:435->verifyOrderedMessageReceipt:549
No timeout waiting for senders/receivers to complete
[16:34:59] 
[16:34:59] Tests run: 1441, Failures: 5, Errors: 0, Skipped: 3
[16:34:59] 
[JENKINS] Recording test results
[16:36:15] 

Mime
View raw message