activemq-dev mailing list archives

Site index · List index
Message view « Date » · « Thread »
Top « Date » · « Thread »
From Apache Jenkins Server <jenk...@builds.apache.org>
Subject Build failed in Jenkins: ActiveMQ » ActiveMQ :: Unit Tests #1461
Date Fri, 13 Jun 2014 05:36:03 GMT
See <https://builds.apache.org/job/ActiveMQ/org.apache.activemq$activemq-unit-tests/1461/>

------------------------------------------
[...truncated 246 lines...]
[03:53:58] Running org.apache.activemq.broker.CreateDestinationsOnStartupViaXBeanTest
[03:54:04] Tests run: 1, Failures: 0, Errors: 0, Skipped: 0, Time elapsed: 6.77 sec - in org.apache.activemq.broker.CreateDestinationsOnStartupViaXBeanTest
[03:54:06] Running org.apache.activemq.broker.DedicatedTaskRunnerBrokerTest
[03:54:58] Tests run: 129, Failures: 0, Errors: 0, Skipped: 0, Time elapsed: 52.588 sec -
in org.apache.activemq.broker.DedicatedTaskRunnerBrokerTest
[03:55:00] Running org.apache.activemq.broker.DoubleSubscriptionTest
[03:55:02] Tests run: 1, Failures: 0, Errors: 0, Skipped: 0, Time elapsed: 2.139 sec - in
org.apache.activemq.broker.DoubleSubscriptionTest
[03:55:03] Running org.apache.activemq.broker.DurablePersistentFalseRestartTest
[03:55:10] Tests run: 1, Failures: 0, Errors: 0, Skipped: 0, Time elapsed: 7.013 sec - in
org.apache.activemq.broker.DurablePersistentFalseRestartTest
[03:55:11] Running org.apache.activemq.broker.JdbcXARecoveryBrokerTest
[03:59:37] Tests run: 17, Failures: 0, Errors: 0, Skipped: 0, Time elapsed: 265.617 sec -
in org.apache.activemq.broker.JdbcXARecoveryBrokerTest
[03:59:38] Running org.apache.activemq.broker.MessageExpirationTest
[04:00:10] Tests run: 17, Failures: 0, Errors: 0, Skipped: 0, Time elapsed: 32.571 sec - in
org.apache.activemq.broker.MessageExpirationTest
[04:00:12] Running org.apache.activemq.broker.OutOfOrderXMLTest
[04:00:16] Tests run: 1, Failures: 0, Errors: 0, Skipped: 0, Time elapsed: 4.237 sec - in
org.apache.activemq.broker.OutOfOrderXMLTest
[04:00:17] Running org.apache.activemq.broker.QueueMbeanRestartTest
[04:00:57] Tests run: 3, Failures: 0, Errors: 0, Skipped: 0, Time elapsed: 39.382 sec - in
org.apache.activemq.broker.QueueMbeanRestartTest
[04:00:58] Running org.apache.activemq.broker.ReconnectWithJMXEnabledTest
[04:01:03] Tests run: 1, Failures: 0, Errors: 0, Skipped: 0, Time elapsed: 5.207 sec - in
org.apache.activemq.broker.ReconnectWithJMXEnabledTest
[04:01:04] Running org.apache.activemq.broker.RecoveryBrokerTest
[04:02:00] Tests run: 9, Failures: 0, Errors: 0, Skipped: 0, Time elapsed: 55.725 sec - in
org.apache.activemq.broker.RecoveryBrokerTest
[04:02:02] Running org.apache.activemq.broker.RedeliveryRestartTest
[04:03:12] Tests run: 12, Failures: 0, Errors: 0, Skipped: 0, Time elapsed: 70.911 sec - in
org.apache.activemq.broker.RedeliveryRestartTest
[04:03:14] Running org.apache.activemq.broker.SpringTest
[04:03:19] Tests run: 1, Failures: 0, Errors: 0, Skipped: 0, Time elapsed: 5.203 sec - in
org.apache.activemq.broker.SpringTest
[04:03:21] Running org.apache.activemq.broker.TopicSubscriptionTest
[04:03:46] Tests run: 8, Failures: 0, Errors: 0, Skipped: 0, Time elapsed: 25.188 sec - in
org.apache.activemq.broker.TopicSubscriptionTest
[04:03:47] Running org.apache.activemq.broker.XARecoveryBrokerTest
[04:06:53] Tests run: 17, Failures: 0, Errors: 0, Skipped: 0, Time elapsed: 185.633 sec -
in org.apache.activemq.broker.XARecoveryBrokerTest
[04:06:56] Running org.apache.activemq.broker.advisory.AdvisoryBrokerTest
[04:07:07] Tests run: 6, Failures: 0, Errors: 0, Skipped: 0, Time elapsed: 10.637 sec - in
org.apache.activemq.broker.advisory.AdvisoryBrokerTest
[04:07:10] Running org.apache.activemq.broker.advisory.AdvisoryDuplexNetworkBridgeTest
[04:07:28] Tests run: 2, Failures: 0, Errors: 0, Skipped: 0, Time elapsed: 18.519 sec - in
org.apache.activemq.broker.advisory.AdvisoryDuplexNetworkBridgeTest
[04:07:30] Running org.apache.activemq.broker.advisory.AdvisoryJmxTest
[04:07:33] Tests run: 1, Failures: 0, Errors: 0, Skipped: 0, Time elapsed: 3.597 sec - in
org.apache.activemq.broker.advisory.AdvisoryJmxTest
[04:07:34] Running org.apache.activemq.broker.advisory.AdvisoryNetworkBridgeTest
[04:07:45] Tests run: 2, Failures: 0, Errors: 0, Skipped: 0, Time elapsed: 10.872 sec - in
org.apache.activemq.broker.advisory.AdvisoryNetworkBridgeTest
[04:07:46] Running org.apache.activemq.broker.ft.DbRestartJDBCQueueMasterSlaveLeaseQuiesceTest
[04:08:57] Tests run: 4, Failures: 1, Errors: 0, Skipped: 0, Time elapsed: 70.302 sec <<<
FAILURE! - in org.apache.activemq.broker.ft.DbRestartJDBCQueueMasterSlaveLeaseQuiesceTest
[04:08:57] testVirtualTopicFailover(org.apache.activemq.broker.ft.DbRestartJDBCQueueMasterSlaveLeaseQuiesceTest)
 Time elapsed: 28.289 sec  <<< FAILURE!
[04:08:57] junit.framework.AssertionFailedError: slave started
[04:08:57] 	at junit.framework.Assert.fail(Assert.java:57)
[04:08:57] 	at junit.framework.Assert.assertTrue(Assert.java:22)
[04:08:57] 	at junit.framework.TestCase.assertTrue(TestCase.java:192)
[04:08:57] 	at org.apache.activemq.broker.ft.QueueMasterSlaveTestSupport.testVirtualTopicFailover(QueueMasterSlaveTestSupport.java:132)
[04:08:57] 	at sun.reflect.NativeMethodAccessorImpl.invoke0(Native Method)
[04:08:57] 	at sun.reflect.NativeMethodAccessorImpl.invoke(NativeMethodAccessorImpl.java:39)
[04:08:57] 	at sun.reflect.DelegatingMethodAccessorImpl.invoke(DelegatingMethodAccessorImpl.java:25)
[04:08:57] 	at java.lang.reflect.Method.invoke(Method.java:597)
[04:08:57] 	at junit.framework.TestCase.runTest(TestCase.java:176)
[04:08:57] 	at junit.framework.TestCase.runBare(TestCase.java:141)
[04:08:57] 	at org.apache.activemq.CombinationTestSupport.runBare(CombinationTestSupport.java:107)
[04:08:57] 	at org.apache.activemq.CombinationTestSupport.runBare(CombinationTestSupport.java:113)
[04:08:57] 	at junit.framework.TestResult$1.protect(TestResult.java:122)
[04:08:57] 	at junit.framework.TestResult.runProtected(TestResult.java:142)
[04:08:57] 	at junit.framework.TestResult.run(TestResult.java:125)
[04:08:57] 	at junit.framework.TestCase.run(TestCase.java:129)
[04:08:57] 	at junit.framework.TestSuite.runTest(TestSuite.java:255)
[04:08:57] 	at junit.framework.TestSuite.run(TestSuite.java:250)
[04:08:57] 	at org.junit.internal.runners.JUnit38ClassRunner.run(JUnit38ClassRunner.java:84)
[04:08:57] 	at org.apache.maven.surefire.junit4.JUnit4Provider.execute(JUnit4Provider.java:264)
[04:08:57] 	at org.apache.maven.surefire.junit4.JUnit4Provider.executeTestSet(JUnit4Provider.java:153)
[04:08:57] 	at org.apache.maven.surefire.junit4.JUnit4Provider.invoke(JUnit4Provider.java:124)
[04:08:57] 	at org.apache.maven.surefire.booter.ForkedBooter.invokeProviderInSameClassLoader(ForkedBooter.java:200)
[04:08:57] 	at org.apache.maven.surefire.booter.ForkedBooter.runSuitesInProcess(ForkedBooter.java:153)
[04:08:57] 	at org.apache.maven.surefire.booter.ForkedBooter.main(ForkedBooter.java:103)
[04:08:57] 
[04:08:58] Running org.apache.activemq.broker.ft.DbRestartJDBCQueueMasterSlaveLeaseTest
[04:10:37] Tests run: 3, Failures: 0, Errors: 0, Skipped: 0, Time elapsed: 99.202 sec - in
org.apache.activemq.broker.ft.DbRestartJDBCQueueMasterSlaveLeaseTest
[04:10:38] Running org.apache.activemq.broker.ft.DbRestartJDBCQueueMasterSlaveTest
[04:13:18] Tests run: 3, Failures: 1, Errors: 0, Skipped: 0, Time elapsed: 159.8 sec <<<
FAILURE! - in org.apache.activemq.broker.ft.DbRestartJDBCQueueMasterSlaveTest
[04:13:18] testSendReceive(org.apache.activemq.broker.ft.DbRestartJDBCQueueMasterSlaveTest)
 Time elapsed: 130.564 sec  <<< FAILURE!
[04:13:18] junit.framework.AssertionFailedError: Not enough messages received expected:<500>
but was:<499>
[04:13:18] 	at junit.framework.Assert.fail(Assert.java:57)
[04:13:18] 	at junit.framework.Assert.failNotEquals(Assert.java:329)
[04:13:18] 	at junit.framework.Assert.assertEquals(Assert.java:78)
[04:13:18] 	at junit.framework.Assert.assertEquals(Assert.java:234)
[04:13:18] 	at junit.framework.TestCase.assertEquals(TestCase.java:401)
[04:13:18] 	at org.apache.activemq.JmsSendReceiveTestSupport.assertMessagesReceivedAreValid(JmsSendReceiveTestSupport.java:148)
[04:13:18] 	at org.apache.activemq.JmsSendReceiveTestSupport.assertMessagesAreReceived(JmsSendReceiveTestSupport.java:126)
[04:13:18] 	at org.apache.activemq.JmsSendReceiveTestSupport.testSendReceive(JmsSendReceiveTestSupport.java:103)
[04:13:18] 	at sun.reflect.NativeMethodAccessorImpl.invoke0(Native Method)
[04:13:18] 	at sun.reflect.NativeMethodAccessorImpl.invoke(NativeMethodAccessorImpl.java:39)
[04:13:18] 	at sun.reflect.DelegatingMethodAccessorImpl.invoke(DelegatingMethodAccessorImpl.java:25)
[04:13:18] 	at java.lang.reflect.Method.invoke(Method.java:597)
[04:13:18] 	at junit.framework.TestCase.runTest(TestCase.java:176)
[04:13:18] 	at junit.framework.TestCase.runBare(TestCase.java:141)
[04:13:18] 	at org.apache.activemq.CombinationTestSupport.runBare(CombinationTestSupport.java:107)
[04:13:18] 	at org.apache.activemq.CombinationTestSupport.runBare(CombinationTestSupport.java:113)
[04:13:18] 	at junit.framework.TestResult$1.protect(TestResult.java:122)
[04:13:18] 	at junit.framework.TestResult.runProtected(TestResult.java:142)
[04:13:18] 	at junit.framework.TestResult.run(TestResult.java:125)
[04:13:18] 	at junit.framework.TestCase.run(TestCase.java:129)
[04:13:18] 	at junit.framework.TestSuite.runTest(TestSuite.java:255)
[04:13:18] 	at junit.framework.TestSuite.run(TestSuite.java:250)
[04:13:18] 	at org.junit.internal.runners.JUnit38ClassRunner.run(JUnit38ClassRunner.java:84)
[04:13:18] 	at org.apache.maven.surefire.junit4.JUnit4Provider.execute(JUnit4Provider.java:264)
[04:13:18] 	at org.apache.maven.surefire.junit4.JUnit4Provider.executeTestSet(JUnit4Provider.java:153)
[04:13:18] 	at org.apache.maven.surefire.junit4.JUnit4Provider.invoke(JUnit4Provider.java:124)
[04:13:18] 	at org.apache.maven.surefire.booter.ForkedBooter.invokeProviderInSameClassLoader(ForkedBooter.java:200)
[04:13:18] 	at org.apache.maven.surefire.booter.ForkedBooter.runSuitesInProcess(ForkedBooter.java:153)
[04:13:18] 	at org.apache.maven.surefire.booter.ForkedBooter.main(ForkedBooter.java:103)
[04:13:18] 
[04:13:20] Running org.apache.activemq.broker.ft.DbRestartJDBCQueueTest
[04:14:33] Tests run: 1, Failures: 0, Errors: 0, Skipped: 0, Time elapsed: 73.748 sec - in
org.apache.activemq.broker.ft.DbRestartJDBCQueueTest
[04:14:34] Running org.apache.activemq.broker.ft.JDBCQueueMasterSlaveTest
[04:15:47] Tests run: 3, Failures: 0, Errors: 0, Skipped: 0, Time elapsed: 72.36 sec - in
org.apache.activemq.broker.ft.JDBCQueueMasterSlaveTest
[04:15:48] Running org.apache.activemq.broker.ft.QueueMasterSlaveSingleUrlTest
[04:17:06] Tests run: 3, Failures: 0, Errors: 0, Skipped: 0, Time elapsed: 77.677 sec - in
org.apache.activemq.broker.ft.QueueMasterSlaveSingleUrlTest
[04:17:07] Running org.apache.activemq.broker.ft.QueueMasterSlaveTestUsingSharedFileTest
[04:18:04] Tests run: 3, Failures: 0, Errors: 0, Skipped: 0, Time elapsed: 56.682 sec - in
org.apache.activemq.broker.ft.QueueMasterSlaveTestUsingSharedFileTest
[04:18:05] Running org.apache.activemq.broker.ft.kahaDbJdbcLeaseQueueMasterSlaveTest
[04:18:39] Tests run: 3, Failures: 0, Errors: 0, Skipped: 0, Time elapsed: 34.35 sec - in
org.apache.activemq.broker.ft.kahaDbJdbcLeaseQueueMasterSlaveTest
[04:18:40] Running org.apache.activemq.broker.ft.mKahaDbQueueMasterSlaveTest
[04:19:39] Tests run: 3, Failures: 0, Errors: 0, Skipped: 0, Time elapsed: 58.677 sec - in
org.apache.activemq.broker.ft.mKahaDbQueueMasterSlaveTest
[04:19:40] Running org.apache.activemq.broker.jmx.BrokerViewSlowStoreStartupTest
[04:19:43] Tests run: 1, Failures: 0, Errors: 0, Skipped: 0, Time elapsed: 3.547 sec - in
org.apache.activemq.broker.jmx.BrokerViewSlowStoreStartupTest
[04:19:45] Running org.apache.activemq.broker.jmx.HealthViewMBeanTest
[04:19:54] Tests run: 1, Failures: 0, Errors: 0, Skipped: 0, Time elapsed: 9.106 sec - in
org.apache.activemq.broker.jmx.HealthViewMBeanTest
[04:19:55] Running org.apache.activemq.broker.jmx.Log4JConfigTest
[04:20:22] Tests run: 8, Failures: 0, Errors: 0, Skipped: 0, Time elapsed: 26.919 sec - in
org.apache.activemq.broker.jmx.Log4JConfigTest
[04:20:23] Running org.apache.activemq.broker.jmx.MBeanOperationTimeoutTest
[04:20:58] Tests run: 1, Failures: 0, Errors: 0, Skipped: 0, Time elapsed: 34.406 sec - in
org.apache.activemq.broker.jmx.MBeanOperationTimeoutTest
[04:20:59] Running org.apache.activemq.broker.jmx.MBeanTest
[04:21:46] Tests run: 24, Failures: 0, Errors: 0, Skipped: 0, Time elapsed: 46.752 sec - in
org.apache.activemq.broker.jmx.MBeanTest
[04:21:47] Running org.apache.activemq.broker.jmx.PurgeTest
[04:22:48] Tests run: 4, Failures: 0, Errors: 0, Skipped: 0, Time elapsed: 60.645 sec - in
org.apache.activemq.broker.jmx.PurgeTest
[04:22:49] Running org.apache.activemq.broker.jmx.TransportConnectorMBeanTest
[04:22:55] Tests run: 4, Failures: 0, Errors: 0, Skipped: 0, Time elapsed: 5.787 sec - in
org.apache.activemq.broker.jmx.TransportConnectorMBeanTest
[04:22:56] Running org.apache.activemq.broker.mKahaDBXARecoveryBrokerTest
[04:26:45] Tests run: 17, Failures: 0, Errors: 0, Skipped: 0, Time elapsed: 228.297 sec -
in org.apache.activemq.broker.mKahaDBXARecoveryBrokerTest
[04:26:46] Running org.apache.activemq.broker.mLevelDBXARecoveryBrokerTest
[04:28:59] Killed
[04:28:59] Running org.apache.activemq.broker.message.security.MessageAuthenticationTest
[04:29:00] Tests run: 1, Failures: 0, Errors: 0, Skipped: 0, Time elapsed: 1.042 sec - in
org.apache.activemq.broker.message.security.MessageAuthenticationTest
[04:29:01] Running org.apache.activemq.broker.partition.SpringPartitionBrokerTest
[04:29:03] Tests run: 1, Failures: 0, Errors: 0, Skipped: 0, Time elapsed: 1.765 sec - in
org.apache.activemq.broker.partition.SpringPartitionBrokerTest
[04:29:03] Running org.apache.activemq.broker.policy.AbortSlowAckConsumer0Test
[04:31:45] Tests run: 16, Failures: 0, Errors: 0, Skipped: 0, Time elapsed: 161.616 sec -
in org.apache.activemq.broker.policy.AbortSlowAckConsumer0Test
[04:31:45] Running org.apache.activemq.broker.policy.AbortSlowAckConsumer1Test
[04:33:07] Tests run: 12, Failures: 0, Errors: 0, Skipped: 0, Time elapsed: 81.751 sec - in
org.apache.activemq.broker.policy.AbortSlowAckConsumer1Test
[04:33:08] Running org.apache.activemq.broker.policy.AbortSlowAckConsumer2Test
[04:33:19] Tests run: 2, Failures: 0, Errors: 0, Skipped: 0, Time elapsed: 11.104 sec - in
org.apache.activemq.broker.policy.AbortSlowAckConsumer2Test
[04:33:19] Running org.apache.activemq.broker.policy.AbortSlowConsumer0Test
[04:34:30] Tests run: 10, Failures: 0, Errors: 0, Skipped: 0, Time elapsed: 70.363 sec - in
org.apache.activemq.broker.policy.AbortSlowConsumer0Test
[04:34:30] Running org.apache.activemq.broker.policy.AbortSlowConsumer1Test
[04:35:52] Tests run: 12, Failures: 0, Errors: 0, Skipped: 0, Time elapsed: 81.766 sec - in
org.apache.activemq.broker.policy.AbortSlowConsumer1Test
[04:35:53] Running org.apache.activemq.broker.policy.AbortSlowConsumer2Test
[04:36:04] Tests run: 2, Failures: 0, Errors: 0, Skipped: 0, Time elapsed: 11.61 sec - in
org.apache.activemq.broker.policy.AbortSlowConsumer2Test
[04:36:05] Running org.apache.activemq.broker.policy.DeadLetterTest
[04:37:27] Tests run: 4, Failures: 0, Errors: 0, Skipped: 0, Time elapsed: 82.2 sec - in org.apache.activemq.broker.policy.DeadLetterTest
[04:37:28] Running org.apache.activemq.broker.policy.DestinationCursorConfigTest
[04:37:30] Tests run: 2, Failures: 0, Errors: 0, Skipped: 0, Time elapsed: 1.944 sec - in
org.apache.activemq.broker.policy.DestinationCursorConfigTest
[04:37:30] Running org.apache.activemq.broker.policy.DiscardingDeadLetterPolicyTest
[04:39:33] Tests run: 4, Failures: 0, Errors: 0, Skipped: 0, Time elapsed: 122.231 sec - in
org.apache.activemq.broker.policy.DiscardingDeadLetterPolicyTest
[04:39:33] Running org.apache.activemq.broker.policy.IndividualDeadLetterTest
[04:41:29] Tests run: 5, Failures: 0, Errors: 0, Skipped: 0, Time elapsed: 115.99 sec - in
org.apache.activemq.broker.policy.IndividualDeadLetterTest
[04:41:30] Running org.apache.activemq.broker.policy.IndividualDeadLetterViaXmlTest
[04:42:53] Tests run: 4, Failures: 0, Errors: 0, Skipped: 0, Time elapsed: 83.648 sec - in
org.apache.activemq.broker.policy.IndividualDeadLetterViaXmlTest
[04:42:54] Running org.apache.activemq.broker.policy.MessageGroupConfigTest
[04:43:00] Tests run: 5, Failures: 0, Errors: 0, Skipped: 0, Time elapsed: 5.865 sec - in
org.apache.activemq.broker.policy.MessageGroupConfigTest
[04:43:00] Running org.apache.activemq.broker.policy.MessageListenerDeadLetterTest
[04:43:04] Tests run: 4, Failures: 0, Errors: 0, Skipped: 0, Time elapsed: 3.496 sec - in
org.apache.activemq.broker.policy.MessageListenerDeadLetterTest
[04:43:05] Running org.apache.activemq.broker.policy.NoConsumerDeadLetterTest
[04:43:07] Tests run: 5, Failures: 0, Errors: 0, Skipped: 0, Time elapsed: 2.32 sec - in org.apache.activemq.broker.policy.NoConsumerDeadLetterTest
[04:43:08] Running org.apache.activemq.broker.policy.NoRetryDeadLetterTest
[04:43:09] Tests run: 4, Failures: 0, Errors: 0, Skipped: 0, Time elapsed: 1.598 sec - in
org.apache.activemq.broker.policy.NoRetryDeadLetterTest
[04:43:10] Running org.apache.activemq.broker.policy.PerDurableConsumerDeadLetterTest
[04:44:33] Tests run: 4, Failures: 0, Errors: 0, Skipped: 0, Time elapsed: 82.959 sec - in
org.apache.activemq.broker.policy.PerDurableConsumerDeadLetterTest
[04:44:33] Running org.apache.activemq.broker.policy.PriorityNetworkDispatchPolicyTest
[04:44:34] Tests run: 1, Failures: 0, Errors: 0, Skipped: 0, Time elapsed: 0.796 sec - in
org.apache.activemq.broker.policy.PriorityNetworkDispatchPolicyTest
[04:44:34] Running org.apache.activemq.broker.policy.SecureDLQTest
[04:44:40] Tests run: 4, Failures: 0, Errors: 0, Skipped: 0, Time elapsed: 5.466 sec - in
org.apache.activemq.broker.policy.SecureDLQTest
[04:44:40] Running org.apache.activemq.broker.policy.StrictOrderDispatchPolicyTest
[04:44:46] Tests run: 8, Failures: 0, Errors: 0, Skipped: 0, Time elapsed: 5.243 sec - in
org.apache.activemq.broker.policy.StrictOrderDispatchPolicyTest
[04:44:46] Running org.apache.activemq.broker.region.DestinationGCTest
[04:45:01] Tests run: 2, Failures: 0, Errors: 0, Skipped: 0, Time elapsed: 14.996 sec - in
org.apache.activemq.broker.region.DestinationGCTest
[04:45:02] Running org.apache.activemq.broker.region.DestinationRemoveRestartTest
[04:45:06] Tests run: 2, Failures: 0, Errors: 0, Skipped: 0, Time elapsed: 4.453 sec - in
org.apache.activemq.broker.region.DestinationRemoveRestartTest
[04:45:07] Running org.apache.activemq.broker.region.QueueDuplicatesFromStoreTest
[04:47:43] Tests run: 2, Failures: 0, Errors: 0, Skipped: 0, Time elapsed: 156.307 sec - in
org.apache.activemq.broker.region.QueueDuplicatesFromStoreTest
[04:47:43] Running org.apache.activemq.broker.region.QueueOptimizedDispatchExceptionTest
[04:47:44] Tests run: 1, Failures: 0, Errors: 0, Skipped: 0, Time elapsed: 0.695 sec - in
org.apache.activemq.broker.region.QueueOptimizedDispatchExceptionTest
[04:47:44] Running org.apache.activemq.broker.region.QueuePurgeTest
[04:57:44] Running org.apache.activemq.broker.region.QueueResendDuringShutdownTest
[04:57:55] Tests run: 3, Failures: 0, Errors: 0, Skipped: 0, Time elapsed: 10.346 sec - in
org.apache.activemq.broker.region.QueueResendDuringShutdownTest
[04:57:55] Running org.apache.activemq.broker.region.SubscriptionAddRemoveQueueTest
[04:57:59] Tests run: 1, Failures: 0, Errors: 0, Skipped: 0, Time elapsed: 4.136 sec - in
org.apache.activemq.broker.region.SubscriptionAddRemoveQueueTest
[04:58:01] Running org.apache.activemq.broker.region.UniquePropertyMessageEvictionStrategyTest
[04:58:13] Tests run: 1, Failures: 0, Errors: 0, Skipped: 0, Time elapsed: 12.084 sec - in
org.apache.activemq.broker.region.UniquePropertyMessageEvictionStrategyTest
[04:58:13] Running org.apache.activemq.broker.region.cursors.CursorDurableTest
[04:58:33] Tests run: 2, Failures: 0, Errors: 0, Skipped: 0, Time elapsed: 19.604 sec - in
org.apache.activemq.broker.region.cursors.CursorDurableTest
[04:58:33] Running org.apache.activemq.broker.region.cursors.CursorQueueStoreTest
[05:00:32] Tests run: 5, Failures: 0, Errors: 0, Skipped: 0, Time elapsed: 118.815 sec - in
org.apache.activemq.broker.region.cursors.CursorQueueStoreTest
[05:00:33] Running org.apache.activemq.broker.region.cursors.NegativeQueueTest
[05:10:33] Running org.apache.activemq.broker.region.cursors.OrderPendingListTest
[05:10:33] Tests run: 9, Failures: 0, Errors: 0, Skipped: 0, Time elapsed: 0.263 sec - in
org.apache.activemq.broker.region.cursors.OrderPendingListTest
[05:10:34] Running org.apache.activemq.broker.region.cursors.PrioritizedPendingListTest
[05:10:34] Tests run: 7, Failures: 0, Errors: 0, Skipped: 0, Time elapsed: 0.277 sec - in
org.apache.activemq.broker.region.cursors.PrioritizedPendingListTest
[05:10:34] Running org.apache.activemq.broker.region.cursors.StoreBasedCursorTest
[05:15:13] Tests run: 5, Failures: 0, Errors: 0, Skipped: 0, Time elapsed: 279.368 sec - in
org.apache.activemq.broker.region.cursors.StoreBasedCursorTest
[05:15:14] Running org.apache.activemq.broker.region.cursors.StoreQueueCursorJDBCNoDuplicateTest
[05:15:24] Tests run: 1, Failures: 0, Errors: 0, Skipped: 0, Time elapsed: 9.895 sec - in
org.apache.activemq.broker.region.cursors.StoreQueueCursorJDBCNoDuplicateTest
[05:15:24] Running org.apache.activemq.broker.region.cursors.StoreQueueCursorKahaDBNoDuplicateTest
[05:15:26] Tests run: 1, Failures: 0, Errors: 0, Skipped: 0, Time elapsed: 2.095 sec - in
org.apache.activemq.broker.region.cursors.StoreQueueCursorKahaDBNoDuplicateTest
[05:15:27] Running org.apache.activemq.broker.region.cursors.StoreQueueCursorLevelDBNoDuplicateTest
[05:15:29] Tests run: 1, Failures: 0, Errors: 0, Skipped: 0, Time elapsed: 2.044 sec - in
org.apache.activemq.broker.region.cursors.StoreQueueCursorLevelDBNoDuplicateTest
[05:15:29] Running org.apache.activemq.broker.region.cursors.StoreQueueCursorMemoryNoDuplicateTest
[05:15:30] Tests run: 1, Failures: 0, Errors: 0, Skipped: 0, Time elapsed: 0.676 sec - in
org.apache.activemq.broker.region.cursors.StoreQueueCursorMemoryNoDuplicateTest
[05:15:30] Running org.apache.activemq.broker.region.cursors.StoreQueueCursorNoDuplicateTest
[05:15:32] Tests run: 1, Failures: 0, Errors: 0, Skipped: 0, Time elapsed: 2.148 sec - in
org.apache.activemq.broker.region.cursors.StoreQueueCursorNoDuplicateTest
[05:15:33] Running org.apache.activemq.broker.region.group.MessageGroupHashBucketTest
[05:15:33] Tests run: 2, Failures: 0, Errors: 0, Skipped: 0, Time elapsed: 0.064 sec - in
org.apache.activemq.broker.region.group.MessageGroupHashBucketTest
[05:15:33] Running org.apache.activemq.broker.region.group.MessageGroupMapTest
[05:15:33] Tests run: 2, Failures: 0, Errors: 0, Skipped: 0, Time elapsed: 0.06 sec - in org.apache.activemq.broker.region.group.MessageGroupMapTest
[05:15:33] Running org.apache.activemq.broker.region.group.MessageGroupTest
[05:15:35] Tests run: 3, Failures: 0, Errors: 0, Skipped: 0, Time elapsed: 1.502 sec - in
org.apache.activemq.broker.region.group.MessageGroupTest
[05:15:36] Running org.apache.activemq.broker.scheduler.JmsCronSchedulerTest
[05:18:02] Tests run: 2, Failures: 0, Errors: 0, Skipped: 0, Time elapsed: 146.476 sec - in
org.apache.activemq.broker.scheduler.JmsCronSchedulerTest
[05:18:02] Running org.apache.activemq.broker.scheduler.JmsSchedulerTest
[05:19:54] Tests run: 6, Failures: 0, Errors: 0, Skipped: 0, Time elapsed: 111.816 sec - in
org.apache.activemq.broker.scheduler.JmsSchedulerTest
[05:19:54] Running org.apache.activemq.broker.scheduler.JobSchedulerBrokerShutdownTest
[05:20:03] Tests run: 1, Failures: 0, Errors: 0, Skipped: 0, Time elapsed: 8.772 sec - in
org.apache.activemq.broker.scheduler.JobSchedulerBrokerShutdownTest
[05:20:04] Running org.apache.activemq.broker.scheduler.JobSchedulerManagementTest
[05:21:35] Tests run: 7, Failures: 0, Errors: 0, Skipped: 0, Time elapsed: 91.4 sec - in org.apache.activemq.broker.scheduler.JobSchedulerManagementTest
[05:21:35] Running org.apache.activemq.broker.scheduler.JobSchedulerStoreTest
[05:22:26] Tests run: 1, Failures: 0, Errors: 0, Skipped: 0, Time elapsed: 50.607 sec - in
org.apache.activemq.broker.scheduler.JobSchedulerStoreTest
[05:22:26] Running org.apache.activemq.broker.scheduler.JobSchedulerTest
[05:23:23] Tests run: 9, Failures: 0, Errors: 0, Skipped: 0, Time elapsed: 56.364 sec - in
org.apache.activemq.broker.scheduler.JobSchedulerTest
[05:23:23] Running org.apache.activemq.broker.scheduler.JobSchedulerTxTest
[05:23:40] Tests run: 2, Failures: 0, Errors: 0, Skipped: 0, Time elapsed: 17.055 sec - in
org.apache.activemq.broker.scheduler.JobSchedulerTxTest
[05:23:40] Running org.apache.activemq.broker.scheduler.LostScheduledMessagesTest
[05:24:17] Tests run: 2, Failures: 0, Errors: 0, Skipped: 0, Time elapsed: 36.195 sec - in
org.apache.activemq.broker.scheduler.LostScheduledMessagesTest
[05:24:17] Running org.apache.activemq.broker.store.DefaultStoreBrokerTest
[05:27:10] Tests run: 129, Failures: 0, Errors: 0, Skipped: 0, Time elapsed: 173.123 sec -
in org.apache.activemq.broker.store.DefaultStoreBrokerTest
[05:27:11] Running org.apache.activemq.broker.store.DefaultStoreRecoveryBrokerTest
[05:28:04] Tests run: 9, Failures: 0, Errors: 0, Skipped: 0, Time elapsed: 53.229 sec - in
org.apache.activemq.broker.store.DefaultStoreRecoveryBrokerTest
[05:28:04] Running org.apache.activemq.broker.store.RecoverExpiredMessagesTest
[05:28:59] 
[05:28:59] Results :
[05:28:59] 
[05:28:59] Failed tests: 
[05:28:59]   DbRestartJDBCQueueMasterSlaveLeaseQuiesceTest>CombinationTestSupport.runBare:113->CombinationTestSupport.runBare:107->QueueMasterSlaveTestSupport.testVirtualTopicFailover:132
slave started
[05:28:59]   DbRestartJDBCQueueMasterSlaveTest>CombinationTestSupport.runBare:113->CombinationTestSupport.runBare:107->JmsSendReceiveTestSupport.testSendReceive:103->JmsSendReceiveTestSupport.assertMessagesAreReceived:126->JmsSendReceiveTestSupport.assertMessagesReceivedAreValid:148
Not enough messages received expected:<500> but was:<499>
[05:28:59] 
[05:28:59] Tests run: 1323, Failures: 2, Errors: 0, Skipped: 1
[05:28:59] 
[JENKINS] Recording test results
[05:29:01] Tests run: 4, Failures: 0, Errors: 0, Skipped: 0, Time elapsed: 56.332 sec - in
org.apache.activemq.broker.store.RecoverExpiredMessagesTest
[05:29:22] 

Mime
View raw message