activemq-dev mailing list archives

Site index · List index
Message view « Date » · « Thread »
Top « Date » · « Thread »
From Apache Jenkins Server <jenk...@builds.apache.org>
Subject Build failed in Jenkins: ActiveMQ » ActiveMQ :: Unit Tests #1445
Date Wed, 12 Mar 2014 09:57:00 GMT
See <https://builds.apache.org/job/ActiveMQ/org.apache.activemq$activemq-unit-tests/1445/changes>

Changes:

[gtully] https://issues.apache.org/jira/browse/AMQ-5087 - fix up test use of initial delay

[gtully] https://issues.apache.org/jira/browse/AMQ-4656 - fix regression for FilePendingDurableSubscriberMessageStoragePolicy

------------------------------------------
[...truncated 357 lines...]
[08:17:12] Tests run: 1, Failures: 0, Errors: 0, Skipped: 0, Time elapsed: 1.546 sec - in
org.apache.activemq.broker.jmx.BrokerViewSlowStoreStartupTest
[08:17:12] Running org.apache.activemq.broker.jmx.HealthViewMBeanTest
[08:17:17] Tests run: 1, Failures: 0, Errors: 0, Skipped: 0, Time elapsed: 4.783 sec - in
org.apache.activemq.broker.jmx.HealthViewMBeanTest
[08:17:18] Running org.apache.activemq.broker.jmx.MBeanOperationTimeoutTest
[08:17:34] Tests run: 1, Failures: 0, Errors: 0, Skipped: 0, Time elapsed: 16.754 sec - in
org.apache.activemq.broker.jmx.MBeanOperationTimeoutTest
[08:17:35] Running org.apache.activemq.broker.jmx.MBeanTest
[08:18:08] Tests run: 24, Failures: 0, Errors: 0, Skipped: 0, Time elapsed: 33.3 sec - in
org.apache.activemq.broker.jmx.MBeanTest
[08:18:09] Running org.apache.activemq.broker.jmx.PurgeTest
[08:18:47] Tests run: 4, Failures: 0, Errors: 0, Skipped: 0, Time elapsed: 37.966 sec - in
org.apache.activemq.broker.jmx.PurgeTest
[08:18:48] Running org.apache.activemq.broker.jmx.TransportConnectorMBeanTest
[08:18:50] Tests run: 4, Failures: 0, Errors: 0, Skipped: 0, Time elapsed: 2.048 sec - in
org.apache.activemq.broker.jmx.TransportConnectorMBeanTest
[08:18:50] Running org.apache.activemq.broker.mKahaDBXARecoveryBrokerTest
[08:21:55] Tests run: 17, Failures: 0, Errors: 0, Skipped: 0, Time elapsed: 184.797 sec -
in org.apache.activemq.broker.mKahaDBXARecoveryBrokerTest
[08:21:56] Running org.apache.activemq.broker.mLevelDBXARecoveryBrokerTest
[08:24:29] Tests run: 17, Failures: 0, Errors: 0, Skipped: 0, Time elapsed: 152.753 sec -
in org.apache.activemq.broker.mLevelDBXARecoveryBrokerTest
[08:24:29] Running org.apache.activemq.broker.message.security.MessageAuthenticationTest
[08:24:30] Tests run: 1, Failures: 0, Errors: 0, Skipped: 0, Time elapsed: 1.124 sec - in
org.apache.activemq.broker.message.security.MessageAuthenticationTest
[08:24:31] Running org.apache.activemq.broker.partition.SpringPartitionBrokerTest
[08:24:33] Tests run: 1, Failures: 0, Errors: 0, Skipped: 0, Time elapsed: 1.857 sec - in
org.apache.activemq.broker.partition.SpringPartitionBrokerTest
[08:24:33] Running org.apache.activemq.broker.policy.AbortSlowAckConsumer0Test
[08:25:42] Tests run: 8, Failures: 0, Errors: 0, Skipped: 0, Time elapsed: 68.675 sec - in
org.apache.activemq.broker.policy.AbortSlowAckConsumer0Test
[08:25:42] Running org.apache.activemq.broker.policy.AbortSlowAckConsumer1Test
[08:27:04] Tests run: 12, Failures: 0, Errors: 0, Skipped: 0, Time elapsed: 81.807 sec - in
org.apache.activemq.broker.policy.AbortSlowAckConsumer1Test
[08:27:05] Running org.apache.activemq.broker.policy.AbortSlowAckConsumer2Test
[08:27:16] Tests run: 2, Failures: 0, Errors: 0, Skipped: 0, Time elapsed: 11.195 sec - in
org.apache.activemq.broker.policy.AbortSlowAckConsumer2Test
[08:27:17] Running org.apache.activemq.broker.policy.AbortSlowConsumer0Test
[08:27:40] Tests run: 5, Failures: 0, Errors: 0, Skipped: 0, Time elapsed: 23.469 sec - in
org.apache.activemq.broker.policy.AbortSlowConsumer0Test
[08:27:41] Running org.apache.activemq.broker.policy.AbortSlowConsumer1Test
[08:29:03] Tests run: 12, Failures: 0, Errors: 0, Skipped: 0, Time elapsed: 81.826 sec - in
org.apache.activemq.broker.policy.AbortSlowConsumer1Test
[08:29:03] Running org.apache.activemq.broker.policy.AbortSlowConsumer2Test
[08:29:14] Tests run: 2, Failures: 0, Errors: 0, Skipped: 0, Time elapsed: 11.179 sec - in
org.apache.activemq.broker.policy.AbortSlowConsumer2Test
[08:29:15] Running org.apache.activemq.broker.policy.DeadLetterTest
[08:30:37] Tests run: 4, Failures: 0, Errors: 0, Skipped: 0, Time elapsed: 82.311 sec - in
org.apache.activemq.broker.policy.DeadLetterTest
[08:30:38] Running org.apache.activemq.broker.policy.DestinationCursorConfigTest
[08:30:40] Tests run: 2, Failures: 0, Errors: 0, Skipped: 0, Time elapsed: 2.106 sec - in
org.apache.activemq.broker.policy.DestinationCursorConfigTest
[08:30:41] Running org.apache.activemq.broker.policy.DiscardingDeadLetterPolicyTest
[08:32:43] Tests run: 4, Failures: 0, Errors: 0, Skipped: 0, Time elapsed: 122.287 sec - in
org.apache.activemq.broker.policy.DiscardingDeadLetterPolicyTest
[08:32:44] Running org.apache.activemq.broker.policy.IndividualDeadLetterTest
[08:34:38] Tests run: 5, Failures: 0, Errors: 0, Skipped: 0, Time elapsed: 114.447 sec - in
org.apache.activemq.broker.policy.IndividualDeadLetterTest
[08:34:39] Running org.apache.activemq.broker.policy.IndividualDeadLetterViaXmlTest
[08:36:03] Tests run: 4, Failures: 0, Errors: 0, Skipped: 0, Time elapsed: 83.842 sec - in
org.apache.activemq.broker.policy.IndividualDeadLetterViaXmlTest
[08:36:03] Running org.apache.activemq.broker.policy.MessageGroupConfigTest
[08:36:08] Tests run: 5, Failures: 0, Errors: 0, Skipped: 0, Time elapsed: 5.092 sec - in
org.apache.activemq.broker.policy.MessageGroupConfigTest
[08:36:09] Running org.apache.activemq.broker.policy.MessageListenerDeadLetterTest
[08:36:12] Tests run: 4, Failures: 0, Errors: 0, Skipped: 0, Time elapsed: 3.452 sec - in
org.apache.activemq.broker.policy.MessageListenerDeadLetterTest
[08:36:13] Running org.apache.activemq.broker.policy.NoConsumerDeadLetterTest
[08:36:15] Tests run: 5, Failures: 0, Errors: 0, Skipped: 0, Time elapsed: 2.424 sec - in
org.apache.activemq.broker.policy.NoConsumerDeadLetterTest
[08:36:16] Running org.apache.activemq.broker.policy.NoRetryDeadLetterTest
[08:36:18] Tests run: 4, Failures: 0, Errors: 0, Skipped: 0, Time elapsed: 1.672 sec - in
org.apache.activemq.broker.policy.NoRetryDeadLetterTest
[08:36:18] Running org.apache.activemq.broker.policy.PerDurableConsumerDeadLetterTest
[08:37:41] Tests run: 4, Failures: 0, Errors: 0, Skipped: 0, Time elapsed: 82.31 sec - in
org.apache.activemq.broker.policy.PerDurableConsumerDeadLetterTest
[08:37:41] Running org.apache.activemq.broker.policy.PriorityNetworkDispatchPolicyTest
[08:37:42] Tests run: 1, Failures: 0, Errors: 0, Skipped: 0, Time elapsed: 0.856 sec - in
org.apache.activemq.broker.policy.PriorityNetworkDispatchPolicyTest
[08:37:42] Running org.apache.activemq.broker.policy.StrictOrderDispatchPolicyTest
[08:37:48] Tests run: 8, Failures: 0, Errors: 0, Skipped: 0, Time elapsed: 5.662 sec - in
org.apache.activemq.broker.policy.StrictOrderDispatchPolicyTest
[08:37:49] Running org.apache.activemq.broker.region.DestinationGCTest
[08:38:04] Tests run: 2, Failures: 0, Errors: 0, Skipped: 0, Time elapsed: 15.055 sec - in
org.apache.activemq.broker.region.DestinationGCTest
[08:38:04] Running org.apache.activemq.broker.region.DestinationRemoveRestartTest
[08:38:09] Tests run: 2, Failures: 0, Errors: 0, Skipped: 0, Time elapsed: 4.872 sec - in
org.apache.activemq.broker.region.DestinationRemoveRestartTest
[08:38:10] Running org.apache.activemq.broker.region.QueueDuplicatesFromStoreTest
[08:40:38] Tests run: 2, Failures: 0, Errors: 0, Skipped: 0, Time elapsed: 148.547 sec - in
org.apache.activemq.broker.region.QueueDuplicatesFromStoreTest
[08:40:39] Running org.apache.activemq.broker.region.QueueOptimizedDispatchExceptionTest
[08:40:39] Tests run: 1, Failures: 0, Errors: 0, Skipped: 0, Time elapsed: 0.763 sec - in
org.apache.activemq.broker.region.QueueOptimizedDispatchExceptionTest
[08:40:40] Running org.apache.activemq.broker.region.QueuePurgeTest
[08:50:40] Running org.apache.activemq.broker.region.SubscriptionAddRemoveQueueTest
[08:50:45] Tests run: 1, Failures: 0, Errors: 0, Skipped: 0, Time elapsed: 4.468 sec - in
org.apache.activemq.broker.region.SubscriptionAddRemoveQueueTest
[08:50:46] Running org.apache.activemq.broker.region.UniquePropertyMessageEvictionStrategyTest
[08:50:58] Tests run: 1, Failures: 0, Errors: 0, Skipped: 0, Time elapsed: 12.18 sec - in
org.apache.activemq.broker.region.UniquePropertyMessageEvictionStrategyTest
[08:50:59] Running org.apache.activemq.broker.region.cursors.CursorDurableTest
[08:51:14] Tests run: 2, Failures: 0, Errors: 0, Skipped: 0, Time elapsed: 15.123 sec - in
org.apache.activemq.broker.region.cursors.CursorDurableTest
[08:51:14] Running org.apache.activemq.broker.region.cursors.CursorQueueStoreTest
[08:53:18] Tests run: 5, Failures: 0, Errors: 0, Skipped: 0, Time elapsed: 123.252 sec - in
org.apache.activemq.broker.region.cursors.CursorQueueStoreTest
[08:53:18] Running org.apache.activemq.broker.region.cursors.NegativeQueueTest
[09:00:59] Tests run: 4, Failures: 0, Errors: 0, Skipped: 0, Time elapsed: 460.888 sec - in
org.apache.activemq.broker.region.cursors.NegativeQueueTest
[09:01:00] Running org.apache.activemq.broker.region.cursors.OrderPendingListTest
[09:01:00] Tests run: 9, Failures: 0, Errors: 0, Skipped: 0, Time elapsed: 0.267 sec - in
org.apache.activemq.broker.region.cursors.OrderPendingListTest
[09:01:00] Running org.apache.activemq.broker.region.cursors.PrioritizedPendingListTest
[09:01:01] Tests run: 7, Failures: 0, Errors: 0, Skipped: 0, Time elapsed: 0.278 sec - in
org.apache.activemq.broker.region.cursors.PrioritizedPendingListTest
[09:01:01] Running org.apache.activemq.broker.region.cursors.StoreBasedCursorTest
[09:01:16] Tests run: 5, Failures: 0, Errors: 0, Skipped: 0, Time elapsed: 15.323 sec - in
org.apache.activemq.broker.region.cursors.StoreBasedCursorTest
[09:01:17] Running org.apache.activemq.broker.region.cursors.StoreQueueCursorJDBCNoDuplicateTest
[09:01:23] Tests run: 1, Failures: 0, Errors: 0, Skipped: 0, Time elapsed: 6.555 sec - in
org.apache.activemq.broker.region.cursors.StoreQueueCursorJDBCNoDuplicateTest
[09:01:24] Running org.apache.activemq.broker.region.cursors.StoreQueueCursorKahaDBNoDuplicateTest
[09:01:25] Tests run: 1, Failures: 0, Errors: 0, Skipped: 0, Time elapsed: 1.657 sec - in
org.apache.activemq.broker.region.cursors.StoreQueueCursorKahaDBNoDuplicateTest
[09:01:26] Running org.apache.activemq.broker.region.cursors.StoreQueueCursorLevelDBNoDuplicateTest
[09:01:28] Tests run: 1, Failures: 0, Errors: 0, Skipped: 0, Time elapsed: 1.894 sec - in
org.apache.activemq.broker.region.cursors.StoreQueueCursorLevelDBNoDuplicateTest
[09:01:28] Running org.apache.activemq.broker.region.cursors.StoreQueueCursorMemoryNoDuplicateTest
[09:01:29] Tests run: 1, Failures: 0, Errors: 0, Skipped: 0, Time elapsed: 0.732 sec - in
org.apache.activemq.broker.region.cursors.StoreQueueCursorMemoryNoDuplicateTest
[09:01:29] Running org.apache.activemq.broker.region.cursors.StoreQueueCursorNoDuplicateTest
[09:01:31] Tests run: 1, Failures: 0, Errors: 0, Skipped: 0, Time elapsed: 1.67 sec - in org.apache.activemq.broker.region.cursors.StoreQueueCursorNoDuplicateTest
[09:01:31] Running org.apache.activemq.broker.region.group.MessageGroupHashBucketTest
[09:01:31] Tests run: 2, Failures: 0, Errors: 0, Skipped: 0, Time elapsed: 0.054 sec - in
org.apache.activemq.broker.region.group.MessageGroupHashBucketTest
[09:01:32] Running org.apache.activemq.broker.region.group.MessageGroupMapTest
[09:01:32] Tests run: 2, Failures: 0, Errors: 0, Skipped: 0, Time elapsed: 0.053 sec - in
org.apache.activemq.broker.region.group.MessageGroupMapTest
[09:01:32] Running org.apache.activemq.broker.region.group.MessageGroupTest
[09:01:34] Tests run: 3, Failures: 0, Errors: 0, Skipped: 0, Time elapsed: 1.587 sec - in
org.apache.activemq.broker.region.group.MessageGroupTest
[09:01:34] Running org.apache.activemq.broker.scheduler.JmsCronSchedulerTest
[09:04:01] Tests run: 2, Failures: 0, Errors: 0, Skipped: 0, Time elapsed: 146.965 sec - in
org.apache.activemq.broker.scheduler.JmsCronSchedulerTest
[09:04:02] Running org.apache.activemq.broker.scheduler.JmsSchedulerTest
[09:05:50] Tests run: 6, Failures: 0, Errors: 0, Skipped: 0, Time elapsed: 108.479 sec - in
org.apache.activemq.broker.scheduler.JmsSchedulerTest
[09:05:50] Running org.apache.activemq.broker.scheduler.JobSchedulerBrokerShutdownTest
[09:05:59] Tests run: 1, Failures: 0, Errors: 0, Skipped: 0, Time elapsed: 8.329 sec - in
org.apache.activemq.broker.scheduler.JobSchedulerBrokerShutdownTest
[09:05:59] Running org.apache.activemq.broker.scheduler.JobSchedulerManagementTest
[09:07:35] Tests run: 7, Failures: 0, Errors: 0, Skipped: 0, Time elapsed: 95.287 sec - in
org.apache.activemq.broker.scheduler.JobSchedulerManagementTest
[09:07:35] Running org.apache.activemq.broker.scheduler.JobSchedulerStoreTest
[09:07:47] Tests run: 1, Failures: 0, Errors: 0, Skipped: 0, Time elapsed: 12.006 sec - in
org.apache.activemq.broker.scheduler.JobSchedulerStoreTest
[09:07:47] Running org.apache.activemq.broker.scheduler.JobSchedulerTest
[09:08:16] Tests run: 9, Failures: 0, Errors: 0, Skipped: 0, Time elapsed: 28.823 sec - in
org.apache.activemq.broker.scheduler.JobSchedulerTest
[09:08:16] Running org.apache.activemq.broker.scheduler.JobSchedulerTxTest
[09:08:32] Tests run: 2, Failures: 0, Errors: 0, Skipped: 0, Time elapsed: 15.2 sec - in org.apache.activemq.broker.scheduler.JobSchedulerTxTest
[09:08:32] Running org.apache.activemq.broker.scheduler.LostScheduledMessagesTest
[09:09:06] Tests run: 2, Failures: 0, Errors: 0, Skipped: 0, Time elapsed: 34.383 sec - in
org.apache.activemq.broker.scheduler.LostScheduledMessagesTest
[09:09:07] Running org.apache.activemq.broker.store.DefaultStoreBrokerTest
[09:11:47] Tests run: 129, Failures: 0, Errors: 0, Skipped: 0, Time elapsed: 160.109 sec -
in org.apache.activemq.broker.store.DefaultStoreBrokerTest
[09:11:47] Running org.apache.activemq.broker.store.DefaultStoreRecoveryBrokerTest
[09:12:39] Tests run: 9, Failures: 0, Errors: 0, Skipped: 0, Time elapsed: 51.537 sec - in
org.apache.activemq.broker.store.DefaultStoreRecoveryBrokerTest
[09:12:39] Running org.apache.activemq.broker.store.RecoverExpiredMessagesTest
[09:13:24] Tests run: 4, Failures: 0, Errors: 0, Skipped: 0, Time elapsed: 44.567 sec - in
org.apache.activemq.broker.store.RecoverExpiredMessagesTest
[09:13:25] Running org.apache.activemq.broker.util.PluginBrokerTest
[09:13:27] Tests run: 1, Failures: 0, Errors: 0, Skipped: 0, Time elapsed: 2.823 sec - in
org.apache.activemq.broker.util.PluginBrokerTest
[09:13:28] Running org.apache.activemq.broker.util.RedeliveryPluginTest
[09:13:28] Tests run: 1, Failures: 0, Errors: 0, Skipped: 0, Time elapsed: 0.484 sec - in
org.apache.activemq.broker.util.RedeliveryPluginTest
[09:13:29] Running org.apache.activemq.broker.util.TimeStampingBrokerPluginTest
[09:13:32] Tests run: 3, Failures: 0, Errors: 0, Skipped: 0, Time elapsed: 3.117 sec - in
org.apache.activemq.broker.util.TimeStampingBrokerPluginTest
[09:13:32] Running org.apache.activemq.broker.util.TraceBrokerPathPluginTest
[09:13:34] Tests run: 1, Failures: 0, Errors: 0, Skipped: 0, Time elapsed: 1.254 sec - in
org.apache.activemq.broker.util.TraceBrokerPathPluginTest
[09:13:34] Running org.apache.activemq.broker.virtual.CompositeQueueTest
[09:13:36] Tests run: 1, Failures: 0, Errors: 0, Skipped: 0, Time elapsed: 1.721 sec - in
org.apache.activemq.broker.virtual.CompositeQueueTest
[09:13:36] Running org.apache.activemq.broker.virtual.CompositeTopicTest
[09:13:39] Tests run: 1, Failures: 0, Errors: 0, Skipped: 0, Time elapsed: 2.805 sec - in
org.apache.activemq.broker.virtual.CompositeTopicTest
[09:13:40] Running org.apache.activemq.broker.virtual.DestinationInterceptorDurableSubTest
[09:13:42] Tests run: 1, Failures: 0, Errors: 0, Skipped: 0, Time elapsed: 1.906 sec - in
org.apache.activemq.broker.virtual.DestinationInterceptorDurableSubTest
[09:13:42] Running org.apache.activemq.broker.virtual.FilteredQueueTest
[09:13:45] Tests run: 1, Failures: 0, Errors: 0, Skipped: 0, Time elapsed: 3.042 sec - in
org.apache.activemq.broker.virtual.FilteredQueueTest
[09:13:46] Running org.apache.activemq.broker.virtual.MirroredQueueCorrectMemoryUsageTest
[09:17:22] Tests run: 1, Failures: 0, Errors: 0, Skipped: 0, Time elapsed: 215.702 sec - in
org.apache.activemq.broker.virtual.MirroredQueueCorrectMemoryUsageTest
[09:17:22] Running org.apache.activemq.broker.virtual.MirroredQueueTest
[09:17:23] Tests run: 2, Failures: 0, Errors: 0, Skipped: 0, Time elapsed: 1.194 sec - in
org.apache.activemq.broker.virtual.MirroredQueueTest
[09:17:24] Running org.apache.activemq.broker.virtual.MirroredQueueUsingVirtualTopicQueueTest
[09:17:25] Tests run: 2, Failures: 0, Errors: 0, Skipped: 0, Time elapsed: 1.227 sec - in
org.apache.activemq.broker.virtual.MirroredQueueUsingVirtualTopicQueueTest
[09:17:26] Running org.apache.activemq.broker.virtual.VirtualTopicDLQTest
[09:17:34] Tests run: 1, Failures: 0, Errors: 0, Skipped: 0, Time elapsed: 8.308 sec - in
org.apache.activemq.broker.virtual.VirtualTopicDLQTest
[09:17:35] Running org.apache.activemq.broker.virtual.VirtualTopicDisconnectSelectorTest
[09:17:39] Tests run: 2, Failures: 0, Errors: 0, Skipped: 0, Time elapsed: 4.802 sec - in
org.apache.activemq.broker.virtual.VirtualTopicDisconnectSelectorTest
[09:17:40] Running org.apache.activemq.broker.virtual.VirtualTopicPubSubTest
[09:17:41] Tests run: 2, Failures: 0, Errors: 0, Skipped: 0, Time elapsed: 1.339 sec - in
org.apache.activemq.broker.virtual.VirtualTopicPubSubTest
[09:17:42] Running org.apache.activemq.broker.virtual.VirtualTopicPubSubUsingXBeanTest
[09:17:43] Tests run: 2, Failures: 0, Errors: 0, Skipped: 0, Time elapsed: 1.355 sec - in
org.apache.activemq.broker.virtual.VirtualTopicPubSubUsingXBeanTest
[09:17:44] Running org.apache.activemq.broker.virtual.VirtualTopicSelectorTest
[09:17:46] Tests run: 1, Failures: 0, Errors: 0, Skipped: 0, Time elapsed: 2.189 sec - in
org.apache.activemq.broker.virtual.VirtualTopicSelectorTest
[09:17:47] Running org.apache.activemq.broker.virtual.VirtualTopicsAndDurableSubsTest
[09:18:07] Tests run: 25, Failures: 0, Errors: 0, Skipped: 0, Time elapsed: 20.242 sec - in
org.apache.activemq.broker.virtual.VirtualTopicsAndDurableSubsTest
[09:18:08] Running org.apache.activemq.bugs.AMQ1687Test
[09:18:09] Tests run: 1, Failures: 0, Errors: 0, Skipped: 0, Time elapsed: 1.373 sec - in
org.apache.activemq.bugs.AMQ1687Test
[09:18:10] Running org.apache.activemq.bugs.AMQ1853Test
[09:18:17] Tests run: 1, Failures: 0, Errors: 0, Skipped: 0, Time elapsed: 7.773 sec - in
org.apache.activemq.bugs.AMQ1853Test
[09:18:18] Running org.apache.activemq.bugs.AMQ1893Test
[09:23:36] Tests run: 1, Failures: 0, Errors: 0, Skipped: 0, Time elapsed: 318.029 sec - in
org.apache.activemq.bugs.AMQ1893Test
[09:23:36] Running org.apache.activemq.bugs.AMQ1917Test
[09:23:43] Tests run: 1, Failures: 0, Errors: 0, Skipped: 0, Time elapsed: 6.228 sec - in
org.apache.activemq.bugs.AMQ1917Test
[09:23:43] Running org.apache.activemq.bugs.AMQ1936Test
[09:26:10] Tests run: 1, Failures: 0, Errors: 0, Skipped: 0, Time elapsed: 146.734 sec - in
org.apache.activemq.bugs.AMQ1936Test
[09:26:11] Running org.apache.activemq.bugs.AMQ2021Test
[09:26:33] Tests run: 1, Failures: 0, Errors: 0, Skipped: 0, Time elapsed: 22.7 sec - in org.apache.activemq.bugs.AMQ2021Test
[09:26:34] Running org.apache.activemq.bugs.AMQ2084Test
[09:26:40] Tests run: 2, Failures: 0, Errors: 0, Skipped: 0, Time elapsed: 6.54 sec - in org.apache.activemq.bugs.AMQ2084Test
[09:26:41] Running org.apache.activemq.bugs.AMQ2103Test
[09:26:42] Tests run: 2, Failures: 0, Errors: 0, Skipped: 0, Time elapsed: 1.177 sec - in
org.apache.activemq.bugs.AMQ2103Test
[09:26:43] Running org.apache.activemq.bugs.AMQ2149LevelDBTest
[09:30:21] Tests run: 4, Failures: 0, Errors: 0, Skipped: 0, Time elapsed: 217.721 sec - in
org.apache.activemq.bugs.AMQ2149LevelDBTest
[09:30:21] Running org.apache.activemq.bugs.AMQ2149Test
[09:43:27] Tests run: 4, Failures: 0, Errors: 3, Skipped: 0, Time elapsed: 786.005 sec <<<
FAILURE! - in org.apache.activemq.bugs.AMQ2149Test
[09:43:27] testQueueTransactionalOrderWithRestart(org.apache.activemq.bugs.AMQ2149Test)  Time
elapsed: 300.233 sec  <<< ERROR!
[09:43:27] java.lang.Exception: test timed out after 300000 milliseconds
[09:43:27] 	at java.lang.Object.wait(Native Method)
[09:43:27] 	at java.lang.Thread.join(Thread.java:1194)
[09:43:27] 	at org.apache.activemq.bugs.AMQ2149Test.verifyOrderedMessageReceipt(AMQ2149Test.java:524)
[09:43:27] 	at org.apache.activemq.bugs.AMQ2149Test.doTestTransactionalOrderWithRestart(AMQ2149Test.java:434)
[09:43:27] 	at org.apache.activemq.bugs.AMQ2149Test.testQueueTransactionalOrderWithRestart(AMQ2149Test.java:411)
[09:43:27] 
[09:43:27] testOrderWithRestart(org.apache.activemq.bugs.AMQ2149Test)  Time elapsed: 1.992
sec  <<< ERROR!
[09:43:27] javax.jms.InvalidClientIDException: Broker: testOrderWithRestart - Client: queue://test.dest.0
already connected from tcp://127.0.0.1:49581
[09:43:27] 	at org.apache.activemq.broker.region.RegionBroker.addConnection(RegionBroker.java:242)
[09:43:27] 	at org.apache.activemq.broker.jmx.ManagedRegionBroker.addConnection(ManagedRegionBroker.java:231)
[09:43:27] 	at org.apache.activemq.broker.BrokerFilter.addConnection(BrokerFilter.java:92)
[09:43:27] 	at org.apache.activemq.advisory.AdvisoryBroker.addConnection(AdvisoryBroker.java:89)
[09:43:27] 	at org.apache.activemq.broker.BrokerFilter.addConnection(BrokerFilter.java:92)
[09:43:27] 	at org.apache.activemq.broker.BrokerFilter.addConnection(BrokerFilter.java:92)
[09:43:27] 	at org.apache.activemq.broker.MutableBrokerFilter.addConnection(MutableBrokerFilter.java:97)
[09:43:27] 	at org.apache.activemq.broker.TransportConnection.processAddConnection(TransportConnection.java:764)
[09:43:27] 	at org.apache.activemq.broker.jmx.ManagedTransportConnection.processAddConnection(ManagedTransportConnection.java:79)
[09:43:27] 	at org.apache.activemq.command.ConnectionInfo.visit(ConnectionInfo.java:139)
[09:43:27] 	at org.apache.activemq.broker.TransportConnection.service(TransportConnection.java:294)
[09:43:27] 	at org.apache.activemq.broker.TransportConnection$1.onCommand(TransportConnection.java:148)
[09:43:27] 	at org.apache.activemq.transport.MutexTransport.onCommand(MutexTransport.java:50)
[09:43:27] 	at org.apache.activemq.transport.WireFormatNegotiator.onCommand(WireFormatNegotiator.java:113)
[09:43:27] 	at org.apache.activemq.transport.AbstractInactivityMonitor.onCommand(AbstractInactivityMonitor.java:270)
[09:43:27] 	at org.apache.activemq.transport.TransportSupport.doConsume(TransportSupport.java:83)
[09:43:27] 	at org.apache.activemq.transport.tcp.TcpTransport.doRun(TcpTransport.java:214)
[09:43:27] 	at org.apache.activemq.transport.tcp.TcpTransport.run(TcpTransport.java:196)
[09:43:27] 	at java.lang.Thread.run(Thread.java:662)
[09:43:27] 
[09:43:27] testTopicTransactionalOrderWithRestart(org.apache.activemq.bugs.AMQ2149Test)  Time
elapsed: 300.254 sec  <<< ERROR!
[09:43:27] java.lang.Exception: test timed out after 300000 milliseconds
[09:43:27] 	at java.lang.Object.wait(Native Method)
[09:43:27] 	at java.lang.Thread.join(Thread.java:1194)
[09:43:27] 	at org.apache.activemq.bugs.AMQ2149Test.verifyOrderedMessageReceipt(AMQ2149Test.java:524)
[09:43:27] 	at org.apache.activemq.bugs.AMQ2149Test.doTestTransactionalOrderWithRestart(AMQ2149Test.java:434)
[09:43:27] 	at org.apache.activemq.bugs.AMQ2149Test.testTopicTransactionalOrderWithRestart(AMQ2149Test.java:416)
[09:43:27] 
[09:43:33] Running org.apache.activemq.bugs.AMQ2171Test
[09:43:38] Tests run: 2, Failures: 0, Errors: 0, Skipped: 0, Time elapsed: 5.224 sec - in
org.apache.activemq.bugs.AMQ2171Test
[09:43:39] Running org.apache.activemq.bugs.AMQ2200Test
[09:43:42] Tests run: 1, Failures: 0, Errors: 0, Skipped: 0, Time elapsed: 2.87 sec - in org.apache.activemq.bugs.AMQ2200Test
[09:43:42] Running org.apache.activemq.bugs.AMQ2213Test
[09:43:46] Tests run: 3, Failures: 0, Errors: 0, Skipped: 0, Time elapsed: 3.408 sec - in
org.apache.activemq.bugs.AMQ2213Test
[09:43:46] Running org.apache.activemq.bugs.AMQ2314Test
[09:45:26] Tests run: 2, Failures: 0, Errors: 0, Skipped: 0, Time elapsed: 100.222 sec - in
org.apache.activemq.bugs.AMQ2314Test
[09:45:27] Running org.apache.activemq.bugs.AMQ2356Test
[09:48:05] Tests run: 1, Failures: 0, Errors: 0, Skipped: 0, Time elapsed: 158.299 sec - in
org.apache.activemq.bugs.AMQ2356Test
[09:48:06] Running org.apache.activemq.bugs.AMQ2364Test
[09:48:09] Tests run: 1, Failures: 0, Errors: 0, Skipped: 0, Time elapsed: 3.859 sec - in
org.apache.activemq.bugs.AMQ2364Test
[09:48:10] Running org.apache.activemq.bugs.AMQ2383Test
[09:48:11] Tests run: 1, Failures: 0, Errors: 0, Skipped: 0, Time elapsed: 0.928 sec - in
org.apache.activemq.bugs.AMQ2383Test
[09:48:11] Running org.apache.activemq.bugs.AMQ2401Test
[09:48:24] Tests run: 1, Failures: 0, Errors: 0, Skipped: 0, Time elapsed: 12.561 sec - in
org.apache.activemq.bugs.AMQ2401Test
[09:48:24] Running org.apache.activemq.bugs.AMQ2413Test
[09:49:46] Tests run: 8, Failures: 0, Errors: 0, Skipped: 0, Time elapsed: 82.36 sec - in
org.apache.activemq.bugs.AMQ2413Test
[09:49:47] Running org.apache.activemq.bugs.AMQ2439Test
[09:50:15] Tests run: 1, Failures: 0, Errors: 0, Skipped: 0, Time elapsed: 28.244 sec - in
org.apache.activemq.bugs.AMQ2439Test
[09:50:16] Running org.apache.activemq.bugs.AMQ2489Test
[09:50:21] Tests run: 2, Failures: 0, Errors: 0, Skipped: 0, Time elapsed: 5.203 sec - in
org.apache.activemq.bugs.AMQ2489Test
[09:50:22] Running org.apache.activemq.bugs.AMQ2512Test
[09:50:40] 
[09:50:40] Results :
[09:50:40] 
[09:50:40] Failed tests: 
[09:50:40]   DbRestartJDBCQueueMasterSlaveLeaseQuiesceTest>CombinationTestSupport.runBare:113->CombinationTestSupport.runBare:107->QueueMasterSlaveTestSupport.testVirtualTopicFailover:132
slave started
[09:50:40]   QueueMasterSlaveSingleUrlTest>CombinationTestSupport.runBare:113->CombinationTestSupport.runBare:107->QueueMasterSlaveTestSupport.testAdvisory:153
Didn't received advisory
[09:50:40] 
[09:50:40] Tests in error: 
[09:50:40]   AMQ2149Test.testQueueTransactionalOrderWithRestart:411->doTestTransactionalOrderWithRestart:434->verifyOrderedMessageReceipt:524->Object.wait:-2
? 
[09:50:40]   AMQ2149Test.testOrderWithRestart ? InvalidClientID Broker: testOrderWithRestar...
[09:50:40]   AMQ2149Test.testTopicTransactionalOrderWithRestart:416->doTestTransactionalOrderWithRestart:434->verifyOrderedMessageReceipt:524->Object.wait:-2
? 
[09:50:40] 
[09:50:40] Tests run: 1399, Failures: 2, Errors: 3, Skipped: 0
[09:50:40] 
[JENKINS] Recording test results
[09:51:23] 

Mime
View raw message