activemq-dev mailing list archives

Site index · List index
Message view « Date » · « Thread »
Top « Date » · « Thread »
From Apache Jenkins Server <jenk...@builds.apache.org>
Subject Build failed in Jenkins: ActiveMQ #1384
Date Mon, 07 Oct 2013 15:37:58 GMT
See <https://builds.apache.org/job/ActiveMQ/1384/changes>

Changes:

[claus.ibsen] Added details how to disable login in web consoles.

------------------------------------------
[...truncated 1637 lines...]
INFO:                                                                         
Oct 7, 2013 1:20:46 PM org.apache.maven.cli.event.ExecutionEventLogger projectStarted
INFO: ------------------------------------------------------------------------
Oct 7, 2013 1:20:46 PM org.apache.maven.cli.event.ExecutionEventLogger projectStarted
INFO: Building ActiveMQ :: Spring 5.9-SNAPSHOT
Oct 7, 2013 1:20:46 PM org.apache.maven.cli.event.ExecutionEventLogger projectStarted
INFO: ------------------------------------------------------------------------
Oct 7, 2013 1:20:47 PM org.apache.maven.cli.event.ExecutionEventLogger mojoStarted
INFO: 
Oct 7, 2013 1:20:47 PM org.apache.maven.cli.event.ExecutionEventLogger mojoStarted
INFO: --- maven-clean-plugin:2.5:clean (default-clean) @ activemq-spring ---
[INFO] Deleting <https://builds.apache.org/job/ActiveMQ/ws/activemq-spring/target>
Oct 7, 2013 1:20:48 PM org.apache.maven.cli.event.ExecutionEventLogger mojoStarted
INFO: 
Oct 7, 2013 1:20:48 PM org.apache.maven.cli.event.ExecutionEventLogger mojoStarted
INFO: --- maven-enforcer-plugin:1.0.1:enforce (default) @ activemq-spring ---
Oct 7, 2013 1:20:54 PM org.apache.maven.cli.event.ExecutionEventLogger mojoStarted
INFO: 
Oct 7, 2013 1:20:54 PM org.apache.maven.cli.event.ExecutionEventLogger mojoStarted
INFO: --- maven-consolets-plugin:1.30:install (default) @ activemq-spring ---
Oct 7, 2013 1:20:54 PM org.apache.maven.cli.event.ExecutionEventLogger mojoStarted
INFO: 
Oct 7, 2013 1:20:54 PM org.apache.maven.cli.event.ExecutionEventLogger mojoStarted
INFO: --- maven-bundle-plugin:2.3.7:cleanVersions (cleanVersions) @ activemq-spring ---
Oct 7, 2013 1:20:55 PM org.apache.maven.cli.event.ExecutionEventLogger mojoStarted
INFO: 
Oct 7, 2013 1:20:55 PM org.apache.maven.cli.event.ExecutionEventLogger mojoStarted
INFO: --- maven-remote-resources-plugin:1.3:process (default) @ activemq-spring ---
Oct 7, 2013 1:20:56 PM org.apache.maven.cli.event.ExecutionEventLogger mojoStarted
INFO: 
Oct 7, 2013 1:20:56 PM org.apache.maven.cli.event.ExecutionEventLogger mojoStarted
INFO: --- maven-resources-plugin:2.5:resources (default-resources) @ activemq-spring ---
[13:20:56] [debug] execute contextualize
[INFO] Using 'UTF-8' encoding to copy filtered resources.
[INFO] Copying 1 resource
[INFO] Copying 3 resources
Oct 7, 2013 1:20:56 PM org.apache.maven.cli.event.ExecutionEventLogger mojoStarted
INFO: 
Oct 7, 2013 1:20:56 PM org.apache.maven.cli.event.ExecutionEventLogger mojoStarted
INFO: --- maven-compiler-plugin:2.5.1:compile (default-compile) @ activemq-spring ---
[INFO] Compiling 20 source files to <https://builds.apache.org/job/ActiveMQ/ws/activemq-spring/target/classes>
Oct 7, 2013 1:20:58 PM org.apache.maven.cli.event.ExecutionEventLogger mojoStarted
INFO: 
Oct 7, 2013 1:20:58 PM org.apache.maven.cli.event.ExecutionEventLogger mojoStarted
INFO: --- maven-xbean-plugin:3.12:mapping (default) @ activemq-spring ---
[INFO] Generating META-INF properties file: <https://builds.apache.org/job/ActiveMQ/ws/activemq-spring/target/classes/META-INF/services/org/apache/xbean/spring/http/activemq.apache.org/schema/core>
for namespace: http://activemq.apache.org/schema/core
[INFO] Generating Spring 2.0 handler mapping: <https://builds.apache.org/job/ActiveMQ/ws/activemq-spring/target/classes/META-INF/spring.handlers>
for namespace: http://activemq.apache.org/schema/core
[INFO] Generating HTML documentation file: <https://builds.apache.org/job/ActiveMQ/ws/activemq-spring/target/classes/activemq.xsd.html>
for namespace: http://activemq.apache.org/schema/core
[13:21:15] Warning, could not load class: T: java.lang.ClassNotFoundException: T
[13:21:15] Warning, could not load class: T: java.lang.ClassNotFoundException: T
[13:21:15] Warning, could not load class: T: java.lang.ClassNotFoundException: T
[13:21:15] Warning, could not load class: T: java.lang.ClassNotFoundException: T
[INFO] Generating XSD file: <https://builds.apache.org/job/ActiveMQ/ws/activemq-spring/target/classes/activemq.xsd>
for namespace: http://activemq.apache.org/schema/core
[INFO] Generating WIKI documentation file: <https://builds.apache.org/job/ActiveMQ/ws/activemq-spring/target/classes/activemq.xsd.wiki>
for namespace: http://activemq.apache.org/schema/core
[INFO] ...done.
Oct 7, 2013 1:21:16 PM org.apache.maven.cli.event.ExecutionEventLogger mojoStarted
INFO: 
Oct 7, 2013 1:21:16 PM org.apache.maven.cli.event.ExecutionEventLogger mojoStarted
INFO: --- maven-resources-plugin:2.5:testResources (default-testResources) @ activemq-spring
---
[13:21:16] [debug] execute contextualize
[INFO] Using 'UTF-8' encoding to copy filtered resources.
[INFO] Copying 7 resources
[INFO] Copying 3 resources
Oct 7, 2013 1:21:16 PM org.apache.maven.cli.event.ExecutionEventLogger mojoStarted
INFO: 
Oct 7, 2013 1:21:16 PM org.apache.maven.cli.event.ExecutionEventLogger mojoStarted
INFO: --- maven-compiler-plugin:2.5.1:testCompile (default-testCompile) @ activemq-spring
---
[INFO] Compiling 11 source files to <https://builds.apache.org/job/ActiveMQ/ws/activemq-spring/target/test-classes>
Oct 7, 2013 1:21:16 PM org.apache.maven.cli.event.ExecutionEventLogger mojoStarted
INFO: 
Oct 7, 2013 1:21:16 PM org.apache.maven.cli.event.ExecutionEventLogger mojoStarted
INFO: --- maven-surefire-plugin:2.10:test (default-test) @ activemq-spring ---
[INFO] Surefire report directory: <https://builds.apache.org/job/ActiveMQ/ws/activemq-spring/target/surefire-reports>
[13:21:16] 
[13:21:16] -------------------------------------------------------
[13:21:16]  T E S T S
[13:21:16] -------------------------------------------------------
[13:21:16] Running org.apache.activemq.spring.ListenerTest
[13:21:25] Tests run: 2, Failures: 0, Errors: 0, Skipped: 0, Time elapsed: 9.14 sec
[13:21:25] Running org.apache.activemq.spring.SpringTest
[13:21:28] Tests run: 1, Failures: 0, Errors: 0, Skipped: 0, Time elapsed: 2.183 sec
[13:21:28] Running org.apache.activemq.spring.ParallelXATransactionTest
[13:21:45] Tests run: 1, Failures: 0, Errors: 0, Skipped: 0, Time elapsed: 17.237 sec
[13:21:45] Running org.apache.activemq.store.leveldb.LevelDBConfigTest
[13:21:48] Tests run: 1, Failures: 0, Errors: 0, Skipped: 0, Time elapsed: 3.17 sec
[13:21:48] Running org.apache.bugs.AMQ1730Test
[13:22:05] Tests run: 1, Failures: 0, Errors: 0, Skipped: 0, Time elapsed: 16.967 sec
[13:22:05] Running org.apache.bugs.LoadBalanceTest
[13:22:09] Tests run: 2, Failures: 0, Errors: 0, Skipped: 1, Time elapsed: 4.043 sec
[13:22:09] Running org.apache.bugs.AMQ2754Test
[13:22:25] Tests run: 1, Failures: 0, Errors: 0, Skipped: 0, Time elapsed: 16.046 sec
[13:22:25] 
[13:22:25] Results :
[13:22:25] 
[13:22:25] Tests run: 9, Failures: 0, Errors: 0, Skipped: 1
[13:22:25] 
[JENKINS] Recording test results
Oct 7, 2013 1:22:26 PM org.apache.maven.cli.event.ExecutionEventLogger mojoStarted
INFO: 
Oct 7, 2013 1:22:26 PM org.apache.maven.cli.event.ExecutionEventLogger mojoStarted
INFO: --- maven-jar-plugin:2.4:jar (default-jar) @ activemq-spring ---
[INFO] Building jar: <https://builds.apache.org/job/ActiveMQ/ws/activemq-spring/target/activemq-spring-5.9-SNAPSHOT.jar>
Oct 7, 2013 1:22:26 PM org.apache.maven.cli.event.ExecutionEventLogger mojoStarted
INFO: 
Oct 7, 2013 1:22:26 PM org.apache.maven.cli.event.ExecutionEventLogger mojoStarted
INFO: --- maven-site-plugin:3.1:attach-descriptor (attach-descriptor) @ activemq-spring ---
Oct 7, 2013 1:22:27 PM org.apache.maven.cli.event.ExecutionEventLogger mojoStarted
INFO: 
Oct 7, 2013 1:22:27 PM org.apache.maven.cli.event.ExecutionEventLogger mojoStarted
INFO: --- ianal-maven-plugin:1.0-alpha-1:verify-legal-files (default) @ activemq-spring ---
[INFO] Checking legal files in: activemq-spring-5.9-SNAPSHOT.jar
Oct 7, 2013 1:22:27 PM org.apache.maven.cli.event.ExecutionEventLogger mojoStarted
INFO: 
Oct 7, 2013 1:22:27 PM org.apache.maven.cli.event.ExecutionEventLogger mojoStarted
INFO: --- maven-install-plugin:2.3.1:install (default-install) @ activemq-spring ---
[INFO] Installing <https://builds.apache.org/job/ActiveMQ/ws/activemq-spring/target/activemq-spring-5.9-SNAPSHOT.jar>
to /home/jenkins/jenkins-slave/maven-repositories/0/org/apache/activemq/activemq-spring/5.9-SNAPSHOT/activemq-spring-5.9-SNAPSHOT.jar
[INFO] Installing <https://builds.apache.org/job/ActiveMQ/ws/activemq-spring/pom.xml>
to /home/jenkins/jenkins-slave/maven-repositories/0/org/apache/activemq/activemq-spring/5.9-SNAPSHOT/activemq-spring-5.9-SNAPSHOT.pom
[INFO] Installing <https://builds.apache.org/job/ActiveMQ/ws/activemq-spring/target/classes/activemq.xsd>
to /home/jenkins/jenkins-slave/maven-repositories/0/org/apache/activemq/activemq-spring/5.9-SNAPSHOT/activemq-spring-5.9-SNAPSHOT.xsd
[INFO] Installing <https://builds.apache.org/job/ActiveMQ/ws/activemq-spring/target/classes/activemq.xsd.html>
to /home/jenkins/jenkins-slave/maven-repositories/0/org/apache/activemq/activemq-spring/5.9-SNAPSHOT/activemq-spring-5.9-SNAPSHOT-schema.html
[13:22:27] [13:22:27] Oct 7, 2013 1:22:32 PM org.apache.maven.cli.event.ExecutionEventLogger
projectStarted
INFO:                                                                         
Oct 7, 2013 1:22:32 PM org.apache.maven.cli.event.ExecutionEventLogger projectStarted
INFO: ------------------------------------------------------------------------
Oct 7, 2013 1:22:32 PM org.apache.maven.cli.event.ExecutionEventLogger projectStarted
INFO: Building ActiveMQ :: AMQP 5.9-SNAPSHOT
Oct 7, 2013 1:22:32 PM org.apache.maven.cli.event.ExecutionEventLogger projectStarted
INFO: ------------------------------------------------------------------------
Oct 7, 2013 1:22:33 PM org.apache.maven.cli.event.ExecutionEventLogger mojoStarted
INFO: 
Oct 7, 2013 1:22:33 PM org.apache.maven.cli.event.ExecutionEventLogger mojoStarted
INFO: --- maven-clean-plugin:2.5:clean (default-clean) @ activemq-amqp ---
[INFO] Deleting <https://builds.apache.org/job/ActiveMQ/ws/activemq-amqp/target>
Oct 7, 2013 1:22:33 PM org.apache.maven.cli.event.ExecutionEventLogger mojoStarted
INFO: 
Oct 7, 2013 1:22:33 PM org.apache.maven.cli.event.ExecutionEventLogger mojoStarted
INFO: --- maven-enforcer-plugin:1.0.1:enforce (default) @ activemq-amqp ---
Oct 7, 2013 1:22:34 PM org.apache.maven.cli.event.ExecutionEventLogger mojoStarted
INFO: 
Oct 7, 2013 1:22:34 PM org.apache.maven.cli.event.ExecutionEventLogger mojoStarted
INFO: --- maven-consolets-plugin:1.30:install (default) @ activemq-amqp ---
Oct 7, 2013 1:22:34 PM org.apache.maven.cli.event.ExecutionEventLogger mojoStarted
INFO: 
Oct 7, 2013 1:22:34 PM org.apache.maven.cli.event.ExecutionEventLogger mojoStarted
INFO: --- maven-bundle-plugin:2.3.7:cleanVersions (cleanVersions) @ activemq-amqp ---
Oct 7, 2013 1:22:34 PM org.apache.maven.cli.event.ExecutionEventLogger mojoStarted
INFO: 
Oct 7, 2013 1:22:34 PM org.apache.maven.cli.event.ExecutionEventLogger mojoStarted
INFO: --- maven-remote-resources-plugin:1.3:process (default) @ activemq-amqp ---
Oct 7, 2013 1:22:34 PM org.apache.maven.cli.event.ExecutionEventLogger mojoStarted
INFO: 
Oct 7, 2013 1:22:34 PM org.apache.maven.cli.event.ExecutionEventLogger mojoStarted
INFO: --- maven-resources-plugin:2.5:resources (default-resources) @ activemq-amqp ---
[13:22:34] [debug] execute contextualize
[INFO] Using 'UTF-8' encoding to copy filtered resources.
[INFO] Copying 5 resources
[INFO] Copying 3 resources
Oct 7, 2013 1:22:34 PM org.apache.maven.cli.event.ExecutionEventLogger mojoStarted
INFO: 
Oct 7, 2013 1:22:34 PM org.apache.maven.cli.event.ExecutionEventLogger mojoStarted
INFO: --- maven-compiler-plugin:2.5.1:compile (default-compile) @ activemq-amqp ---
[INFO] Compiling 18 source files to <https://builds.apache.org/job/ActiveMQ/ws/activemq-amqp/target/classes>
[WARNING] <https://builds.apache.org/job/ActiveMQ/ws/activemq-amqp/src/main/java/org/apache/activemq/transport/amqp/AmqpProtocolConverter.java>:[154,43]
[deprecation] output(byte[],int,int) in org.apache.qpid.proton.engine.Transport has been deprecated
[WARNING] <https://builds.apache.org/job/ActiveMQ/ws/activemq-amqp/src/main/java/org/apache/activemq/transport/amqp/AmqpProtocolConverter.java>:[214,43]
[deprecation] input(byte[],int,int) in org.apache.qpid.proton.engine.Transport has been deprecated
[WARNING] <https://builds.apache.org/job/ActiveMQ/ws/activemq-amqp/src/main/java/org/apache/activemq/transport/amqp/AmqpProtocolConverter.java>:[599,30]
[deprecation] MessageImpl() in org.apache.qpid.proton.message.impl.MessageImpl has been deprecated
Oct 7, 2013 1:22:34 PM org.apache.maven.cli.event.ExecutionEventLogger mojoStarted
INFO: 
Oct 7, 2013 1:22:34 PM org.apache.maven.cli.event.ExecutionEventLogger mojoStarted
INFO: --- maven-resources-plugin:2.5:testResources (default-testResources) @ activemq-amqp
---
[13:22:34] [debug] execute contextualize
[INFO] Using 'UTF-8' encoding to copy filtered resources.
[INFO] Copying 7 resources
[INFO] Copying 3 resources
Oct 7, 2013 1:22:35 PM org.apache.maven.cli.event.ExecutionEventLogger mojoStarted
INFO: 
Oct 7, 2013 1:22:35 PM org.apache.maven.cli.event.ExecutionEventLogger mojoStarted
INFO: --- maven-compiler-plugin:2.5.1:testCompile (default-testCompile) @ activemq-amqp ---
[INFO] Compiling 16 source files to <https://builds.apache.org/job/ActiveMQ/ws/activemq-amqp/target/test-classes>
Oct 7, 2013 1:22:35 PM org.apache.maven.cli.event.ExecutionEventLogger mojoStarted
INFO: 
Oct 7, 2013 1:22:35 PM org.apache.maven.cli.event.ExecutionEventLogger mojoStarted
INFO: --- maven-surefire-plugin:2.10:test (default-test) @ activemq-amqp ---
[INFO] Surefire report directory: <https://builds.apache.org/job/ActiveMQ/ws/activemq-amqp/target/surefire-reports>
[13:22:35] 
[13:22:35] -------------------------------------------------------
[13:22:35]  T E S T S
[13:22:35] -------------------------------------------------------
[13:22:35] Running org.apache.activemq.transport.amqp.SimpleAMQPAuthTest
[13:22:46] Tests run: 4, Failures: 0, Errors: 0, Skipped: 0, Time elapsed: 10.429 sec
[13:22:46] Running org.apache.activemq.transport.amqp.AMQ4563Test
[13:23:45] Tests run: 4, Failures: 0, Errors: 0, Skipped: 0, Time elapsed: 59.208 sec
[13:23:45] Running org.apache.activemq.transport.amqp.JMSClientTest
[13:24:01] Tests run: 5, Failures: 0, Errors: 0, Skipped: 0, Time elapsed: 16.138 sec
[13:24:01] Running org.apache.activemq.transport.amqp.AmqpTransformerTest
[13:24:08] Tests run: 3, Failures: 0, Errors: 0, Skipped: 0, Time elapsed: 6.549 sec
[13:24:08] Running org.apache.activemq.transport.amqp.AMQ4696Test
[13:24:12] Tests run: 1, Failures: 0, Errors: 0, Skipped: 0, Time elapsed: 4.02 sec
[13:24:12] Running org.apache.activemq.transport.amqp.joram.JoramJmsNioTest
[13:30:15] Tests run: 179, Failures: 0, Errors: 0, Skipped: 0, Time elapsed: 363.491 sec
[13:30:15] Running org.apache.activemq.transport.amqp.joram.JoramSslTest
[13:37:01] Tests run: 179, Failures: 0, Errors: 0, Skipped: 0, Time elapsed: 406.231 sec
[13:37:01] Running org.apache.activemq.transport.amqp.joram.JoramJmsTest
Sending e-mails to: dev@activemq.apache.org
Sending e-mails to: dev@activemq.apache.org
[locks-and-latches] Releasing all the locks
[locks-and-latches] All the locks released
ERROR: Failed to parse POMs
hudson.remoting.ChannelClosedException: channel is already closed
	at hudson.remoting.Channel.send(Channel.java:516)
	at hudson.remoting.Request.call(Request.java:129)
	at hudson.remoting.Channel.call(Channel.java:714)
	at hudson.remoting.RemoteInvocationHandler.invoke(RemoteInvocationHandler.java:167)
	at com.sun.proxy.$Proxy42.isAlive(Unknown Source)
	at hudson.Launcher$RemoteLauncher$ProcImpl.isAlive(Launcher.java:930)
	at hudson.maven.ProcessCache$MavenProcess.call(ProcessCache.java:165)
	at hudson.maven.MavenModuleSetBuild$MavenModuleSetBuildExecution.doRun(MavenModuleSetBuild.java:813)
	at hudson.model.AbstractBuild$AbstractBuildExecution.run(AbstractBuild.java:567)
	at hudson.model.Run.execute(Run.java:1603)
	at hudson.maven.MavenModuleSetBuild.run(MavenModuleSetBuild.java:506)
	at hudson.model.ResourceController.execute(ResourceController.java:88)
	at hudson.model.Executor.run(Executor.java:246)
Caused by: java.io.IOException: Unexpected termination of the channel
	at hudson.remoting.SynchronousCommandTransport$ReaderThread.run(SynchronousCommandTransport.java:50)
Caused by: java.io.EOFException
	at java.io.ObjectInputStream$BlockDataInputStream.peekByte(ObjectInputStream.java:2596)
	at java.io.ObjectInputStream.readObject0(ObjectInputStream.java:1316)
	at java.io.ObjectInputStream.readObject(ObjectInputStream.java:370)
	at hudson.remoting.Command.readFrom(Command.java:92)
	at hudson.remoting.ClassicCommandTransport.read(ClassicCommandTransport.java:71)
	at hudson.remoting.SynchronousCommandTransport$ReaderThread.run(SynchronousCommandTransport.java:48)
FATAL: channel is already closed
hudson.remoting.ChannelClosedException: channel is already closed
	at hudson.remoting.Channel.send(Channel.java:516)
	at hudson.remoting.Request.call(Request.java:129)
	at hudson.remoting.Channel.call(Channel.java:714)
	at hudson.Launcher$RemoteLauncher.kill(Launcher.java:887)
	at hudson.model.AbstractBuild$AbstractBuildExecution.run(AbstractBuild.java:590)
	at hudson.model.Run.execute(Run.java:1603)
	at hudson.maven.MavenModuleSetBuild.run(MavenModuleSetBuild.java:506)
	at hudson.model.ResourceController.execute(ResourceController.java:88)
	at hudson.model.Executor.run(Executor.java:246)
Caused by: java.io.IOException: Unexpected termination of the channel
	at hudson.remoting.SynchronousCommandTransport$ReaderThread.run(SynchronousCommandTransport.java:50)
Caused by: java.io.EOFException
	at java.io.ObjectInputStream$BlockDataInputStream.peekByte(ObjectInputStream.java:2596)
	at java.io.ObjectInputStream.readObject0(ObjectInputStream.java:1316)
	at java.io.ObjectInputStream.readObject(ObjectInputStream.java:370)
	at hudson.remoting.Command.readFrom(Command.java:92)
	at hudson.remoting.ClassicCommandTransport.read(ClassicCommandTransport.java:71)
	at hudson.remoting.SynchronousCommandTransport$ReaderThread.run(SynchronousCommandTransport.java:48)

Mime
View raw message