activemq-dev mailing list archives

Site index · List index
Message view « Date » · « Thread »
Top « Date » · « Thread »
From Apache Jenkins Server <jenk...@builds.apache.org>
Subject Build failed in Jenkins: ActiveMQ #1380
Date Fri, 04 Oct 2013 03:41:21 GMT
See <https://builds.apache.org/job/ActiveMQ/1380/changes>

Changes:

[gtully] https://issues.apache.org/jira/browse/AMQ-4682 - remove unecessary stack trace from
info log re no mapping to getContents - usefull only for dev/debug

[hiram] Avoid logging ZooKeeper related exceptions during a replicated leveldb store shutdown.

[claus.ibsen] Use karaf 2.3.3

[claus.ibsen] Fixed karaf itest. Testing by hot deploying by copying a .xml file into deploy
folder need to be done differently.

[claus.ibsen] Disabled test

[gtully] https://issues.apache.org/jira/browse/AMQ-4682 - take account of granularity of filesystem
lastModified in tests, > 2seconds, resolved intermittent failures

------------------------------------------
[...truncated 1666 lines...]
Oct 4, 2013 1:21:53 AM org.apache.maven.cli.event.ExecutionEventLogger mojoStarted
INFO: 
Oct 4, 2013 1:21:53 AM org.apache.maven.cli.event.ExecutionEventLogger mojoStarted
INFO: --- maven-xbean-plugin:3.12:mapping (default) @ activemq-spring ---
[INFO] Generating META-INF properties file: <https://builds.apache.org/job/ActiveMQ/ws/activemq-spring/target/classes/META-INF/services/org/apache/xbean/spring/http/activemq.apache.org/schema/core>
for namespace: http://activemq.apache.org/schema/core
[INFO] Generating Spring 2.0 handler mapping: <https://builds.apache.org/job/ActiveMQ/ws/activemq-spring/target/classes/META-INF/spring.handlers>
for namespace: http://activemq.apache.org/schema/core
[INFO] Generating HTML documentation file: <https://builds.apache.org/job/ActiveMQ/ws/activemq-spring/target/classes/activemq.xsd.html>
for namespace: http://activemq.apache.org/schema/core
[01:21:58] Warning, could not load class: T: java.lang.ClassNotFoundException: T
[01:21:58] Warning, could not load class: T: java.lang.ClassNotFoundException: T
[01:21:59] Warning, could not load class: T: java.lang.ClassNotFoundException: T
[01:21:59] Warning, could not load class: T: java.lang.ClassNotFoundException: T
[INFO] Generating XSD file: <https://builds.apache.org/job/ActiveMQ/ws/activemq-spring/target/classes/activemq.xsd>
for namespace: http://activemq.apache.org/schema/core
[INFO] Generating WIKI documentation file: <https://builds.apache.org/job/ActiveMQ/ws/activemq-spring/target/classes/activemq.xsd.wiki>
for namespace: http://activemq.apache.org/schema/core
[INFO] ...done.
Oct 4, 2013 1:21:59 AM org.apache.maven.cli.event.ExecutionEventLogger mojoStarted
INFO: 
Oct 4, 2013 1:21:59 AM org.apache.maven.cli.event.ExecutionEventLogger mojoStarted
INFO: --- maven-resources-plugin:2.5:testResources (default-testResources) @ activemq-spring
---
[01:21:59] [debug] execute contextualize
[INFO] Using 'UTF-8' encoding to copy filtered resources.
[INFO] Copying 7 resources
[INFO] Copying 3 resources
Oct 4, 2013 1:21:59 AM org.apache.maven.cli.event.ExecutionEventLogger mojoStarted
INFO: 
Oct 4, 2013 1:21:59 AM org.apache.maven.cli.event.ExecutionEventLogger mojoStarted
INFO: --- maven-compiler-plugin:2.5.1:testCompile (default-testCompile) @ activemq-spring
---
[INFO] Compiling 11 source files to <https://builds.apache.org/job/ActiveMQ/ws/activemq-spring/target/test-classes>
Oct 4, 2013 1:22:00 AM org.apache.maven.cli.event.ExecutionEventLogger mojoStarted
INFO: 
Oct 4, 2013 1:22:00 AM org.apache.maven.cli.event.ExecutionEventLogger mojoStarted
INFO: --- maven-surefire-plugin:2.10:test (default-test) @ activemq-spring ---
[INFO] Surefire report directory: <https://builds.apache.org/job/ActiveMQ/ws/activemq-spring/target/surefire-reports>
[01:22:00] 
[01:22:00] -------------------------------------------------------
[01:22:00]  T E S T S
[01:22:00] -------------------------------------------------------
[01:22:00] Running org.apache.activemq.spring.ListenerTest
[01:22:09] Tests run: 2, Failures: 0, Errors: 0, Skipped: 0, Time elapsed: 8.976 sec
[01:22:09] Running org.apache.activemq.spring.SpringTest
[01:22:11] Tests run: 1, Failures: 0, Errors: 0, Skipped: 0, Time elapsed: 2.193 sec
[01:22:11] Running org.apache.activemq.spring.ParallelXATransactionTest
[01:22:28] Tests run: 1, Failures: 0, Errors: 0, Skipped: 0, Time elapsed: 17.093 sec
[01:22:28] Running org.apache.activemq.store.leveldb.LevelDBConfigTest
[01:22:32] Tests run: 1, Failures: 0, Errors: 0, Skipped: 0, Time elapsed: 3.585 sec
[01:22:32] Running org.apache.bugs.AMQ1730Test
[01:22:49] Tests run: 1, Failures: 0, Errors: 0, Skipped: 0, Time elapsed: 17.447 sec
[01:22:49] Running org.apache.bugs.LoadBalanceTest
[01:22:53] Tests run: 2, Failures: 0, Errors: 0, Skipped: 1, Time elapsed: 4.03 sec
[01:22:53] Running org.apache.bugs.AMQ2754Test
[01:23:09] Tests run: 1, Failures: 0, Errors: 0, Skipped: 0, Time elapsed: 16.043 sec
[01:23:10] 
[01:23:10] Results :
[01:23:10] 
[01:23:10] Tests run: 9, Failures: 0, Errors: 0, Skipped: 1
[01:23:10] 
[JENKINS] Recording test results
Oct 4, 2013 1:23:11 AM org.apache.maven.cli.event.ExecutionEventLogger mojoStarted
INFO: 
Oct 4, 2013 1:23:11 AM org.apache.maven.cli.event.ExecutionEventLogger mojoStarted
INFO: --- maven-jar-plugin:2.4:jar (default-jar) @ activemq-spring ---
[INFO] Building jar: <https://builds.apache.org/job/ActiveMQ/ws/activemq-spring/target/activemq-spring-5.9-SNAPSHOT.jar>
Oct 4, 2013 1:23:11 AM org.apache.maven.cli.event.ExecutionEventLogger mojoStarted
INFO: 
Oct 4, 2013 1:23:11 AM org.apache.maven.cli.event.ExecutionEventLogger mojoStarted
INFO: --- maven-site-plugin:3.1:attach-descriptor (attach-descriptor) @ activemq-spring ---
Oct 4, 2013 1:23:11 AM org.apache.maven.cli.event.ExecutionEventLogger mojoStarted
INFO: 
Oct 4, 2013 1:23:11 AM org.apache.maven.cli.event.ExecutionEventLogger mojoStarted
INFO: --- ianal-maven-plugin:1.0-alpha-1:verify-legal-files (default) @ activemq-spring ---
[INFO] Checking legal files in: activemq-spring-5.9-SNAPSHOT.jar
Oct 4, 2013 1:23:11 AM org.apache.maven.cli.event.ExecutionEventLogger mojoStarted
INFO: 
Oct 4, 2013 1:23:11 AM org.apache.maven.cli.event.ExecutionEventLogger mojoStarted
INFO: --- maven-install-plugin:2.3.1:install (default-install) @ activemq-spring ---
[INFO] Installing <https://builds.apache.org/job/ActiveMQ/ws/activemq-spring/target/activemq-spring-5.9-SNAPSHOT.jar>
to /home/jenkins/jenkins-slave/maven-repositories/0/org/apache/activemq/activemq-spring/5.9-SNAPSHOT/activemq-spring-5.9-SNAPSHOT.jar
[INFO] Installing <https://builds.apache.org/job/ActiveMQ/ws/activemq-spring/pom.xml>
to /home/jenkins/jenkins-slave/maven-repositories/0/org/apache/activemq/activemq-spring/5.9-SNAPSHOT/activemq-spring-5.9-SNAPSHOT.pom
[INFO] Installing <https://builds.apache.org/job/ActiveMQ/ws/activemq-spring/target/classes/activemq.xsd>
to /home/jenkins/jenkins-slave/maven-repositories/0/org/apache/activemq/activemq-spring/5.9-SNAPSHOT/activemq-spring-5.9-SNAPSHOT.xsd
[INFO] Installing <https://builds.apache.org/job/ActiveMQ/ws/activemq-spring/target/classes/activemq.xsd.html>
to /home/jenkins/jenkins-slave/maven-repositories/0/org/apache/activemq/activemq-spring/5.9-SNAPSHOT/activemq-spring-5.9-SNAPSHOT-schema.html
[01:23:11] [01:23:11] Oct 4, 2013 1:23:17 AM org.apache.maven.cli.event.ExecutionEventLogger
projectStarted
INFO:                                                                         
Oct 4, 2013 1:23:17 AM org.apache.maven.cli.event.ExecutionEventLogger projectStarted
INFO: ------------------------------------------------------------------------
Oct 4, 2013 1:23:17 AM org.apache.maven.cli.event.ExecutionEventLogger projectStarted
INFO: Building ActiveMQ :: AMQP 5.9-SNAPSHOT
Oct 4, 2013 1:23:17 AM org.apache.maven.cli.event.ExecutionEventLogger projectStarted
INFO: ------------------------------------------------------------------------
Downloading: http://repo.fusesource.com/nexus/content/groups/public/org/apache/qpid/proton-jms/0.5/proton-jms-0.5.pom
Downloading: http://repo.maven.apache.org/maven2/org/apache/qpid/proton-jms/0.5/proton-jms-0.5.pom
Downloaded: http://repo.maven.apache.org/maven2/org/apache/qpid/proton-jms/0.5/proton-jms-0.5.pom
(2 KB at 8.8 KB/sec)
Downloading: http://repo.fusesource.com/nexus/content/groups/public/org/apache/qpid/proton-j/0.5/proton-j-0.5.pom
Downloading: http://repo.maven.apache.org/maven2/org/apache/qpid/proton-j/0.5/proton-j-0.5.pom
Downloaded: http://repo.maven.apache.org/maven2/org/apache/qpid/proton-j/0.5/proton-j-0.5.pom
(2 KB at 209.9 KB/sec)
Downloading: http://repo.fusesource.com/nexus/content/groups/public/org/apache/qpid/proton-project/0.5/proton-project-0.5.pom
Downloading: http://repo.maven.apache.org/maven2/org/apache/qpid/proton-project/0.5/proton-project-0.5.pom
Downloaded: http://repo.maven.apache.org/maven2/org/apache/qpid/proton-project/0.5/proton-project-0.5.pom
(4 KB at 15.0 KB/sec)
Downloading: http://repo.fusesource.com/nexus/content/groups/public/org/apache/qpid/proton-j-impl/0.5/proton-j-impl-0.5.pom
Downloading: http://repo.maven.apache.org/maven2/org/apache/qpid/proton-j-impl/0.5/proton-j-impl-0.5.pom
Downloaded: http://repo.maven.apache.org/maven2/org/apache/qpid/proton-j-impl/0.5/proton-j-impl-0.5.pom
(3 KB at 28.0 KB/sec)
Downloading: http://repo.fusesource.com/nexus/content/groups/public/org/apache/qpid/proton-api/0.5/proton-api-0.5.pom
Downloading: http://repo.maven.apache.org/maven2/org/apache/qpid/proton-api/0.5/proton-api-0.5.pom
Downloaded: http://repo.maven.apache.org/maven2/org/apache/qpid/proton-api/0.5/proton-api-0.5.pom
(2 KB at 15.8 KB/sec)
Downloading: http://repo.fusesource.com/nexus/content/groups/public/org/apache/qpid/qpid-amqp-1-0-client-jms/0.24/qpid-amqp-1-0-client-jms-0.24.pom
Downloading: http://repo.maven.apache.org/maven2/org/apache/qpid/qpid-amqp-1-0-client-jms/0.24/qpid-amqp-1-0-client-jms-0.24.pom
Downloaded: http://repo.maven.apache.org/maven2/org/apache/qpid/qpid-amqp-1-0-client-jms/0.24/qpid-amqp-1-0-client-jms-0.24.pom
(2 KB at 17.6 KB/sec)
Downloading: http://repo.fusesource.com/nexus/content/groups/public/org/apache/qpid/qpid-amqp-1-0-common/0.24/qpid-amqp-1-0-common-0.24.pom
Downloading: http://repo.maven.apache.org/maven2/org/apache/qpid/qpid-amqp-1-0-common/0.24/qpid-amqp-1-0-common-0.24.pom
Downloaded: http://repo.maven.apache.org/maven2/org/apache/qpid/qpid-amqp-1-0-common/0.24/qpid-amqp-1-0-common-0.24.pom
(896 B at 97.2 KB/sec)
Downloading: http://repo.fusesource.com/nexus/content/groups/public/org/apache/qpid/qpid-amqp-1-0-client/0.24/qpid-amqp-1-0-client-0.24.pom
Downloading: http://repo.maven.apache.org/maven2/org/apache/qpid/qpid-amqp-1-0-client/0.24/qpid-amqp-1-0-client-0.24.pom
Downloaded: http://repo.maven.apache.org/maven2/org/apache/qpid/qpid-amqp-1-0-client/0.24/qpid-amqp-1-0-client-0.24.pom
(2 KB at 12.9 KB/sec)
Downloading: http://repo.fusesource.com/nexus/content/groups/public/org/apache/qpid/proton-jms/0.5/proton-jms-0.5.jar
Downloading: http://repo.fusesource.com/nexus/content/groups/public/org/apache/qpid/proton-j-impl/0.5/proton-j-impl-0.5.jar
Downloading: http://repo.fusesource.com/nexus/content/groups/public/org/apache/qpid/proton-api/0.5/proton-api-0.5.jar
Downloading: http://repo.fusesource.com/nexus/content/groups/public/org/apache/qpid/qpid-amqp-1-0-client-jms/0.24/qpid-amqp-1-0-client-jms-0.24.jar
Downloading: http://repo.fusesource.com/nexus/content/groups/public/org/apache/qpid/qpid-amqp-1-0-common/0.24/qpid-amqp-1-0-common-0.24.jar
Downloading: http://repo.fusesource.com/nexus/content/groups/public/org/apache/qpid/qpid-amqp-1-0-client/0.24/qpid-amqp-1-0-client-0.24.jar
Downloading: http://repo.maven.apache.org/maven2/org/apache/qpid/proton-jms/0.5/proton-jms-0.5.jar
Downloading: http://repo.maven.apache.org/maven2/org/apache/qpid/proton-j-impl/0.5/proton-j-impl-0.5.jar
Downloading: http://repo.maven.apache.org/maven2/org/apache/qpid/proton-api/0.5/proton-api-0.5.jar
Downloading: http://repo.maven.apache.org/maven2/org/apache/qpid/qpid-amqp-1-0-client-jms/0.24/qpid-amqp-1-0-client-jms-0.24.jar
Downloading: http://repo.maven.apache.org/maven2/org/apache/qpid/qpid-amqp-1-0-common/0.24/qpid-amqp-1-0-common-0.24.jar
Downloaded: http://repo.maven.apache.org/maven2/org/apache/qpid/proton-api/0.5/proton-api-0.5.jar
(124 KB at 6849.3 KB/sec)
Downloading: http://repo.maven.apache.org/maven2/org/apache/qpid/qpid-amqp-1-0-client/0.24/qpid-amqp-1-0-client-0.24.jar
Downloaded: http://repo.maven.apache.org/maven2/org/apache/qpid/qpid-amqp-1-0-client-jms/0.24/qpid-amqp-1-0-client-jms-0.24.jar
(122 KB at 6064.5 KB/sec)
Downloaded: http://repo.maven.apache.org/maven2/org/apache/qpid/qpid-amqp-1-0-common/0.24/qpid-amqp-1-0-common-0.24.jar
(517 KB at 13593.3 KB/sec)
Downloaded: http://repo.maven.apache.org/maven2/org/apache/qpid/proton-jms/0.5/proton-jms-0.5.jar
(28 KB at 341.1 KB/sec)
Downloaded: http://repo.maven.apache.org/maven2/org/apache/qpid/qpid-amqp-1-0-client/0.24/qpid-amqp-1-0-client-0.24.jar
(42 KB at 265.5 KB/sec)
Downloaded: http://repo.maven.apache.org/maven2/org/apache/qpid/proton-j-impl/0.5/proton-j-impl-0.5.jar
(492 KB at 1270.0 KB/sec)
Oct 4, 2013 1:23:23 AM org.apache.maven.cli.event.ExecutionEventLogger mojoStarted
INFO: 
Oct 4, 2013 1:23:23 AM org.apache.maven.cli.event.ExecutionEventLogger mojoStarted
INFO: --- maven-clean-plugin:2.5:clean (default-clean) @ activemq-amqp ---
Oct 4, 2013 1:23:23 AM org.apache.maven.cli.event.ExecutionEventLogger mojoStarted
INFO: 
Oct 4, 2013 1:23:23 AM org.apache.maven.cli.event.ExecutionEventLogger mojoStarted
INFO: --- maven-enforcer-plugin:1.0.1:enforce (default) @ activemq-amqp ---
Oct 4, 2013 1:23:23 AM org.apache.maven.cli.event.ExecutionEventLogger mojoStarted
INFO: 
Oct 4, 2013 1:23:23 AM org.apache.maven.cli.event.ExecutionEventLogger mojoStarted
INFO: --- maven-consolets-plugin:1.30:install (default) @ activemq-amqp ---
Oct 4, 2013 1:23:23 AM org.apache.maven.cli.event.ExecutionEventLogger mojoStarted
INFO: 
Oct 4, 2013 1:23:23 AM org.apache.maven.cli.event.ExecutionEventLogger mojoStarted
INFO: --- maven-bundle-plugin:2.3.7:cleanVersions (cleanVersions) @ activemq-amqp ---
Oct 4, 2013 1:23:23 AM org.apache.maven.cli.event.ExecutionEventLogger mojoStarted
INFO: 
Oct 4, 2013 1:23:23 AM org.apache.maven.cli.event.ExecutionEventLogger mojoStarted
INFO: --- maven-remote-resources-plugin:1.3:process (default) @ activemq-amqp ---
Oct 4, 2013 1:23:24 AM org.apache.maven.cli.event.ExecutionEventLogger mojoStarted
INFO: 
Oct 4, 2013 1:23:24 AM org.apache.maven.cli.event.ExecutionEventLogger mojoStarted
INFO: --- maven-resources-plugin:2.5:resources (default-resources) @ activemq-amqp ---
[01:23:24] [debug] execute contextualize
[INFO] Using 'UTF-8' encoding to copy filtered resources.
[INFO] Copying 5 resources
[INFO] Copying 3 resources
Oct 4, 2013 1:23:24 AM org.apache.maven.cli.event.ExecutionEventLogger mojoStarted
INFO: 
Oct 4, 2013 1:23:24 AM org.apache.maven.cli.event.ExecutionEventLogger mojoStarted
INFO: --- maven-compiler-plugin:2.5.1:compile (default-compile) @ activemq-amqp ---
[INFO] Compiling 18 source files to <https://builds.apache.org/job/ActiveMQ/ws/activemq-amqp/target/classes>
[WARNING] <https://builds.apache.org/job/ActiveMQ/ws/activemq-amqp/src/main/java/org/apache/activemq/transport/amqp/AmqpProtocolConverter.java>:[154,43]
[deprecation] output(byte[],int,int) in org.apache.qpid.proton.engine.Transport has been deprecated
[WARNING] <https://builds.apache.org/job/ActiveMQ/ws/activemq-amqp/src/main/java/org/apache/activemq/transport/amqp/AmqpProtocolConverter.java>:[214,43]
[deprecation] input(byte[],int,int) in org.apache.qpid.proton.engine.Transport has been deprecated
[WARNING] <https://builds.apache.org/job/ActiveMQ/ws/activemq-amqp/src/main/java/org/apache/activemq/transport/amqp/AmqpProtocolConverter.java>:[599,30]
[deprecation] MessageImpl() in org.apache.qpid.proton.message.impl.MessageImpl has been deprecated
Oct 4, 2013 1:23:24 AM org.apache.maven.cli.event.ExecutionEventLogger mojoStarted
INFO: 
Oct 4, 2013 1:23:24 AM org.apache.maven.cli.event.ExecutionEventLogger mojoStarted
INFO: --- maven-resources-plugin:2.5:testResources (default-testResources) @ activemq-amqp
---
[01:23:24] [debug] execute contextualize
[INFO] Using 'UTF-8' encoding to copy filtered resources.
[INFO] Copying 7 resources
[INFO] Copying 3 resources
Oct 4, 2013 1:23:24 AM org.apache.maven.cli.event.ExecutionEventLogger mojoStarted
INFO: 
Oct 4, 2013 1:23:24 AM org.apache.maven.cli.event.ExecutionEventLogger mojoStarted
INFO: --- maven-compiler-plugin:2.5.1:testCompile (default-testCompile) @ activemq-amqp ---
[INFO] Compiling 16 source files to <https://builds.apache.org/job/ActiveMQ/ws/activemq-amqp/target/test-classes>
Oct 4, 2013 1:23:24 AM org.apache.maven.cli.event.ExecutionEventLogger mojoStarted
INFO: 
Oct 4, 2013 1:23:24 AM org.apache.maven.cli.event.ExecutionEventLogger mojoStarted
INFO: --- maven-surefire-plugin:2.10:test (default-test) @ activemq-amqp ---
[INFO] Surefire report directory: <https://builds.apache.org/job/ActiveMQ/ws/activemq-amqp/target/surefire-reports>
[01:23:24] 
[01:23:24] -------------------------------------------------------
[01:23:24]  T E S T S
[01:23:24] -------------------------------------------------------
[01:23:25] Running org.apache.activemq.transport.amqp.SimpleAMQPAuthTest
[01:23:35] Tests run: 4, Failures: 0, Errors: 0, Skipped: 0, Time elapsed: 10.412 sec
[01:23:35] Running org.apache.activemq.transport.amqp.AMQ4563Test
[01:24:40] Tests run: 4, Failures: 0, Errors: 0, Skipped: 0, Time elapsed: 64.876 sec
[01:24:40] Running org.apache.activemq.transport.amqp.JMSClientTest
[01:24:56] Tests run: 5, Failures: 0, Errors: 0, Skipped: 0, Time elapsed: 16.182 sec
[01:24:56] Running org.apache.activemq.transport.amqp.AmqpTransformerTest
[01:25:03] Tests run: 3, Failures: 0, Errors: 0, Skipped: 0, Time elapsed: 6.536 sec
[01:25:03] Running org.apache.activemq.transport.amqp.AMQ4696Test
[01:25:07] Tests run: 1, Failures: 0, Errors: 0, Skipped: 0, Time elapsed: 4.016 sec
[01:25:07] Running org.apache.activemq.transport.amqp.joram.JoramJmsNioTest
[01:31:10] Tests run: 179, Failures: 0, Errors: 0, Skipped: 0, Time elapsed: 363.055 sec
[01:31:10] Running org.apache.activemq.transport.amqp.joram.JoramSslTest
[01:37:56] Tests run: 179, Failures: 0, Errors: 0, Skipped: 0, Time elapsed: 406.192 sec
[01:37:56] Running org.apache.activemq.transport.amqp.joram.JoramJmsTest
Sending e-mails to: dev@activemq.apache.org
Sending e-mails to: dev@activemq.apache.org
[locks-and-latches] Releasing all the locks
[locks-and-latches] All the locks released
ERROR: Failed to parse POMs
hudson.remoting.ChannelClosedException: channel is already closed
	at hudson.remoting.Channel.send(Channel.java:516)
	at hudson.remoting.Request.call(Request.java:129)
	at hudson.remoting.Channel.call(Channel.java:714)
	at hudson.remoting.RemoteInvocationHandler.invoke(RemoteInvocationHandler.java:167)
	at com.sun.proxy.$Proxy42.isAlive(Unknown Source)
	at hudson.Launcher$RemoteLauncher$ProcImpl.isAlive(Launcher.java:930)
	at hudson.maven.ProcessCache$MavenProcess.call(ProcessCache.java:165)
	at hudson.maven.MavenModuleSetBuild$MavenModuleSetBuildExecution.doRun(MavenModuleSetBuild.java:813)
	at hudson.model.AbstractBuild$AbstractBuildExecution.run(AbstractBuild.java:567)
	at hudson.model.Run.execute(Run.java:1603)
	at hudson.maven.MavenModuleSetBuild.run(MavenModuleSetBuild.java:506)
	at hudson.model.ResourceController.execute(ResourceController.java:88)
	at hudson.model.Executor.run(Executor.java:246)
Caused by: java.io.IOException: Unexpected termination of the channel
	at hudson.remoting.SynchronousCommandTransport$ReaderThread.run(SynchronousCommandTransport.java:50)
Caused by: java.io.EOFException
	at java.io.ObjectInputStream$BlockDataInputStream.peekByte(ObjectInputStream.java:2596)
	at java.io.ObjectInputStream.readObject0(ObjectInputStream.java:1316)
	at java.io.ObjectInputStream.readObject(ObjectInputStream.java:370)
	at hudson.remoting.Command.readFrom(Command.java:92)
	at hudson.remoting.ClassicCommandTransport.read(ClassicCommandTransport.java:71)
	at hudson.remoting.SynchronousCommandTransport$ReaderThread.run(SynchronousCommandTransport.java:48)
FATAL: channel is already closed
hudson.remoting.ChannelClosedException: channel is already closed
	at hudson.remoting.Channel.send(Channel.java:516)
	at hudson.remoting.Request.call(Request.java:129)
	at hudson.remoting.Channel.call(Channel.java:714)
	at hudson.Launcher$RemoteLauncher.kill(Launcher.java:887)
	at hudson.model.AbstractBuild$AbstractBuildExecution.run(AbstractBuild.java:590)
	at hudson.model.Run.execute(Run.java:1603)
	at hudson.maven.MavenModuleSetBuild.run(MavenModuleSetBuild.java:506)
	at hudson.model.ResourceController.execute(ResourceController.java:88)
	at hudson.model.Executor.run(Executor.java:246)
Caused by: java.io.IOException: Unexpected termination of the channel
	at hudson.remoting.SynchronousCommandTransport$ReaderThread.run(SynchronousCommandTransport.java:50)
Caused by: java.io.EOFException
	at java.io.ObjectInputStream$BlockDataInputStream.peekByte(ObjectInputStream.java:2596)
	at java.io.ObjectInputStream.readObject0(ObjectInputStream.java:1316)
	at java.io.ObjectInputStream.readObject(ObjectInputStream.java:370)
	at hudson.remoting.Command.readFrom(Command.java:92)
	at hudson.remoting.ClassicCommandTransport.read(ClassicCommandTransport.java:71)
	at hudson.remoting.SynchronousCommandTransport$ReaderThread.run(SynchronousCommandTransport.java:48)

Mime
View raw message