activemq-dev mailing list archives

Site index · List index
Message view « Date » · « Thread »
Top « Date » · « Thread »
From Apache Jenkins Server <jenk...@builds.apache.org>
Subject Build failed in Jenkins: ActiveMQ #1378
Date Thu, 03 Oct 2013 03:35:24 GMT
See <https://builds.apache.org/job/ActiveMQ/1378/changes>

Changes:

[claus.ibsen] AMQ-4769: Connection.close() should not throw exception if already closed according
to JMS spec/javadoc.

[hiram] Adding more debug info to help trouble shoot election issues with leveldb replication
elections.

[claus.ibsen] AMQ-4371: Added back rss/atom feed support in old web console. Thanks to Robert
Balent for the patch.

[hiram] Fixing leveldb replication bug where loosing quorum did not properly restart the master
in a clean way.

[hiram] The the hostname on the replicated leveldb store test so that the test works better
on machines with weird DNS settings.

------------------------------------------
[...truncated 2470 lines...]
[02:53:12] Tests run: 1, Failures: 0, Errors: 0, Skipped: 0, Time elapsed: 6.158 sec
[02:53:12] Running org.apache.activemq.bugs.AMQ2528Test
[02:53:13] Tests run: 1, Failures: 0, Errors: 0, Skipped: 0, Time elapsed: 1.003 sec
[02:53:14] Running org.apache.activemq.bugs.AMQ2571Test
[02:53:15] Tests run: 1, Failures: 0, Errors: 0, Skipped: 0, Time elapsed: 0.75 sec
[02:53:15] Running org.apache.activemq.bugs.AMQ2580Test
[02:53:30] Tests run: 5, Failures: 0, Errors: 0, Skipped: 0, Time elapsed: 15.115 sec
[02:53:31] Running org.apache.activemq.bugs.AMQ2584ConcurrentDlqTest
[02:53:44] Tests run: 1, Failures: 0, Errors: 0, Skipped: 0, Time elapsed: 13.755 sec
[02:53:45] Running org.apache.activemq.bugs.AMQ2584Test
[02:54:02] Tests run: 2, Failures: 0, Errors: 0, Skipped: 0, Time elapsed: 17.379 sec
[02:54:03] Running org.apache.activemq.bugs.AMQ2585Test
[02:54:04] Tests run: 1, Failures: 0, Errors: 0, Skipped: 0, Time elapsed: 1.012 sec
[02:54:05] Running org.apache.activemq.bugs.AMQ2616Test
[02:54:10] Tests run: 1, Failures: 0, Errors: 0, Skipped: 0, Time elapsed: 5.343 sec
[02:54:10] Running org.apache.activemq.bugs.AMQ2645Test
[02:54:20] Tests run: 1, Failures: 0, Errors: 0, Skipped: 0, Time elapsed: 9.07 sec
[02:54:20] Running org.apache.activemq.bugs.AMQ2736Test
[02:54:22] Tests run: 1, Failures: 0, Errors: 0, Skipped: 0, Time elapsed: 2.049 sec
[02:54:23] Running org.apache.activemq.bugs.AMQ2751Test
[02:54:31] Tests run: 1, Failures: 0, Errors: 0, Skipped: 0, Time elapsed: 8.896 sec
[02:54:32] Running org.apache.activemq.bugs.AMQ2801Test
[02:54:42] Tests run: 1, Failures: 0, Errors: 0, Skipped: 0, Time elapsed: 10.484 sec
[02:54:43] Running org.apache.activemq.bugs.AMQ2832Test
[02:55:14] Tests run: 2, Failures: 0, Errors: 0, Skipped: 0, Time elapsed: 31.189 sec
[02:55:15] Running org.apache.activemq.bugs.AMQ2870Test
[02:55:48] Tests run: 2, Failures: 0, Errors: 0, Skipped: 0, Time elapsed: 33.541 sec
[02:55:49] Running org.apache.activemq.bugs.AMQ2902Test
[02:55:50] Tests run: 2, Failures: 0, Errors: 0, Skipped: 0, Time elapsed: 0.994 sec
[02:55:51] Running org.apache.activemq.bugs.AMQ2910Test
[02:55:56] Tests run: 1, Failures: 0, Errors: 0, Skipped: 0, Time elapsed: 5.216 sec
[02:55:56] Running org.apache.activemq.bugs.AMQ2982Test
[02:55:59] Tests run: 1, Failures: 0, Errors: 0, Skipped: 0, Time elapsed: 2.743 sec
[02:56:00] Running org.apache.activemq.bugs.AMQ2983Test
[02:56:04] Tests run: 1, Failures: 0, Errors: 0, Skipped: 0, Time elapsed: 3.763 sec
[02:56:04] Running org.apache.activemq.bugs.AMQ3014Test
[02:56:09] Tests run: 2, Failures: 0, Errors: 0, Skipped: 0, Time elapsed: 4.807 sec
[02:56:09] Running org.apache.activemq.bugs.AMQ3120Test
[03:01:41] Tests run: 1, Failures: 0, Errors: 0, Skipped: 0, Time elapsed: 331.617 sec
[03:01:41] Running org.apache.activemq.bugs.AMQ3140Test
[03:03:45] Tests run: 1, Failures: 0, Errors: 0, Skipped: 0, Time elapsed: 123.479 sec
[03:03:45] Running org.apache.activemq.bugs.AMQ3141Test
[03:03:47] Tests run: 1, Failures: 0, Errors: 0, Skipped: 0, Time elapsed: 1.843 sec
[03:03:47] Running org.apache.activemq.bugs.AMQ3145Test
[03:03:53] Tests run: 1, Failures: 0, Errors: 0, Skipped: 0, Time elapsed: 6.279 sec
[03:03:54] Running org.apache.activemq.bugs.AMQ3157Test
[03:04:05] Tests run: 1, Failures: 0, Errors: 0, Skipped: 0, Time elapsed: 11.062 sec
[03:04:05] Running org.apache.activemq.bugs.AMQ3167Test
[03:04:21] Tests run: 1, Failures: 0, Errors: 0, Skipped: 0, Time elapsed: 16.254 sec
[03:04:22] Running org.apache.activemq.bugs.AMQ3274Test
[03:04:27] Tests run: 1, Failures: 0, Errors: 0, Skipped: 0, Time elapsed: 5.244 sec
[03:04:27] Running org.apache.activemq.bugs.AMQ3324Test
[03:04:32] Tests run: 1, Failures: 0, Errors: 0, Skipped: 0, Time elapsed: 4.866 sec
[03:04:33] Running org.apache.activemq.bugs.AMQ3352Test
[03:04:40] Tests run: 1, Failures: 0, Errors: 0, Skipped: 0, Time elapsed: 7.378 sec
[03:04:41] Running org.apache.activemq.bugs.AMQ3405Test
[03:04:44] Tests run: 1, Failures: 0, Errors: 0, Skipped: 0, Time elapsed: 3.107 sec
[03:04:44] Running org.apache.activemq.bugs.AMQ3436Test
[03:04:46] Tests run: 1, Failures: 0, Errors: 0, Skipped: 0, Time elapsed: 1.543 sec
[03:04:46] Running org.apache.activemq.bugs.AMQ3445Test
[03:04:57] Tests run: 1, Failures: 0, Errors: 0, Skipped: 0, Time elapsed: 11.022 sec
[03:04:58] Running org.apache.activemq.bugs.AMQ3454Test
[03:05:04] Tests run: 1, Failures: 0, Errors: 0, Skipped: 0, Time elapsed: 6.382 sec
[03:05:07] Running org.apache.activemq.bugs.AMQ3465Test
[03:05:12] Tests run: 2, Failures: 0, Errors: 0, Skipped: 0, Time elapsed: 4.932 sec
[03:05:12] Running org.apache.activemq.bugs.AMQ3529Test
[03:05:21] Tests run: 1, Failures: 0, Errors: 0, Skipped: 0, Time elapsed: 8.793 sec
[03:05:21] Running org.apache.activemq.bugs.AMQ3537Test
[03:05:21] Tests run: 1, Failures: 0, Errors: 0, Skipped: 0, Time elapsed: 0.089 sec
[03:05:22] Running org.apache.activemq.bugs.AMQ3567Test
[03:07:06] Tests run: 1, Failures: 0, Errors: 0, Skipped: 0, Time elapsed: 104.301 sec
[03:07:06] Running org.apache.activemq.bugs.AMQ3622Test
[03:07:10] Tests run: 1, Failures: 0, Errors: 0, Skipped: 0, Time elapsed: 3.316 sec
[03:07:10] Running org.apache.activemq.bugs.AMQ3625Test
[03:07:25] Tests run: 1, Failures: 0, Errors: 0, Skipped: 0, Time elapsed: 14.4 sec
[03:07:25] Running org.apache.activemq.bugs.AMQ3674Test
[03:07:28] Tests run: 1, Failures: 0, Errors: 0, Skipped: 0, Time elapsed: 3.075 sec
[03:07:29] Running org.apache.activemq.bugs.AMQ3675Test
[03:07:34] Tests run: 1, Failures: 0, Errors: 0, Skipped: 0, Time elapsed: 4.912 sec
[03:07:34] Running org.apache.activemq.bugs.AMQ3678Test
[03:07:37] Tests run: 1, Failures: 0, Errors: 0, Skipped: 0, Time elapsed: 2.969 sec
[03:07:38] Running org.apache.activemq.bugs.AMQ3732Test
[03:09:39] Tests run: 1, Failures: 0, Errors: 0, Skipped: 0, Time elapsed: 120.867 sec
[03:09:39] Running org.apache.activemq.bugs.AMQ3779Test
[03:09:40] Tests run: 1, Failures: 0, Errors: 0, Skipped: 0, Time elapsed: 1.286 sec
[03:09:41] Running org.apache.activemq.bugs.AMQ3841Test
[03:09:43] Tests run: 1, Failures: 0, Errors: 0, Skipped: 0, Time elapsed: 2.355 sec
[03:09:44] Running org.apache.activemq.bugs.AMQ3879Test
[03:09:45] Tests run: 1, Failures: 0, Errors: 0, Skipped: 0, Time elapsed: 1.472 sec
[03:09:45] Running org.apache.activemq.bugs.AMQ3903Test
[03:09:50] Tests run: 2, Failures: 0, Errors: 0, Skipped: 0, Time elapsed: 4.741 sec
[03:09:50] Running org.apache.activemq.bugs.AMQ3932Test
[03:10:17] Tests run: 3, Failures: 0, Errors: 0, Skipped: 0, Time elapsed: 26.887 sec
[03:10:18] Running org.apache.activemq.bugs.AMQ3934Test
[03:10:20] Tests run: 1, Failures: 0, Errors: 0, Skipped: 0, Time elapsed: 2.851 sec
[03:10:21] Running org.apache.activemq.bugs.AMQ3961Test
[03:10:26] Tests run: 1, Failures: 0, Errors: 0, Skipped: 0, Time elapsed: 5.157 sec
[03:10:27] Running org.apache.activemq.bugs.AMQ3992Test
[03:10:32] Tests run: 1, Failures: 0, Errors: 0, Skipped: 0, Time elapsed: 4.842 sec
[03:10:32] Running org.apache.activemq.bugs.AMQ4062Test
[03:10:39] Tests run: 1, Failures: 0, Errors: 0, Skipped: 0, Time elapsed: 6.274 sec
[03:10:39] Running org.apache.activemq.bugs.AMQ4083Test
[03:11:44] Tests run: 6, Failures: 0, Errors: 0, Skipped: 0, Time elapsed: 65.19 sec
[03:11:45] Running org.apache.activemq.bugs.AMQ4092Test
[03:11:50] Tests run: 1, Failures: 0, Errors: 0, Skipped: 0, Time elapsed: 5.576 sec
[03:11:51] Running org.apache.activemq.bugs.AMQ4116Test
[03:11:56] Tests run: 2, Failures: 0, Errors: 0, Skipped: 0, Time elapsed: 4.893 sec
[03:11:56] Running org.apache.activemq.bugs.AMQ4126Test
[03:12:43] Tests run: 9, Failures: 0, Errors: 0, Skipped: 0, Time elapsed: 47.39 sec
[03:12:44] Running org.apache.activemq.bugs.AMQ4133Test
[03:13:03] Tests run: 4, Failures: 0, Errors: 0, Skipped: 0, Time elapsed: 18.79 sec
[03:13:03] Running org.apache.activemq.bugs.AMQ4147Test
[03:13:15] Tests run: 2, Failures: 0, Errors: 0, Skipped: 0, Time elapsed: 11.303 sec
[03:13:15] Running org.apache.activemq.bugs.AMQ4148Test
[03:13:26] Tests run: 1, Failures: 0, Errors: 0, Skipped: 0, Time elapsed: 10.952 sec
[03:13:27] Running org.apache.activemq.bugs.AMQ4157Test
[03:13:35] Tests run: 1, Failures: 0, Errors: 0, Skipped: 0, Time elapsed: 8.543 sec
[03:13:36] Running org.apache.activemq.bugs.AMQ4160Test
[03:14:20] Tests run: 3, Failures: 0, Errors: 0, Skipped: 0, Time elapsed: 44.153 sec
[03:14:20] Running org.apache.activemq.bugs.AMQ4212Test
[03:15:06] Tests run: 2, Failures: 0, Errors: 0, Skipped: 0, Time elapsed: 45.709 sec
[03:15:07] Running org.apache.activemq.bugs.AMQ4213Test
[03:15:10] Tests run: 1, Failures: 0, Errors: 0, Skipped: 0, Time elapsed: 2.975 sec
[03:15:10] Running org.apache.activemq.bugs.AMQ4220Test
[03:15:12] Tests run: 1, Failures: 0, Errors: 0, Skipped: 0, Time elapsed: 1.946 sec
[03:15:13] Running org.apache.activemq.bugs.AMQ4221Test
[03:15:45] Tests run: 1, Failures: 0, Errors: 0, Skipped: 0, Time elapsed: 31.747 sec
[03:15:45] Running org.apache.activemq.bugs.AMQ4222Test
[03:15:46] Tests run: 1, Failures: 0, Errors: 0, Skipped: 0, Time elapsed: 1.128 sec
[03:15:47] Running org.apache.activemq.bugs.AMQ4323Test
[03:15:52] Tests run: 1, Failures: 0, Errors: 0, Skipped: 0, Time elapsed: 5.215 sec
[03:15:52] Running org.apache.activemq.bugs.AMQ4356Test
[03:15:58] Tests run: 1, Failures: 0, Errors: 0, Skipped: 0, Time elapsed: 6.12 sec
[03:15:59] Running org.apache.activemq.bugs.AMQ4361Test
[03:16:04] Tests run: 1, Failures: 0, Errors: 0, Skipped: 0, Time elapsed: 5.383 sec
[03:16:05] Running org.apache.activemq.bugs.AMQ4368Test
[03:16:28] Tests run: 1, Failures: 0, Errors: 0, Skipped: 0, Time elapsed: 23.678 sec
[03:16:29] Running org.apache.activemq.bugs.AMQ4407Test
[03:16:31] Tests run: 1, Failures: 0, Errors: 0, Skipped: 0, Time elapsed: 2.238 sec
[03:16:32] Running org.apache.activemq.bugs.AMQ4413Test
[03:16:40] Tests run: 1, Failures: 0, Errors: 0, Skipped: 0, Time elapsed: 8.014 sec
[03:16:40] Running org.apache.activemq.bugs.AMQ4469Test
[03:16:47] Tests run: 1, Failures: 0, Errors: 0, Skipped: 0, Time elapsed: 7.001 sec
[03:16:47] Running org.apache.activemq.bugs.AMQ4472Test
[03:16:49] Tests run: 1, Failures: 0, Errors: 0, Skipped: 0, Time elapsed: 1.413 sec
[03:16:49] Running org.apache.activemq.bugs.AMQ4475Test
[03:16:54] Tests run: 1, Failures: 0, Errors: 0, Skipped: 0, Time elapsed: 4.979 sec
[03:16:55] Running org.apache.activemq.bugs.AMQ4485Test
[03:17:04] Tests run: 1, Failures: 0, Errors: 0, Skipped: 0, Time elapsed: 9.208 sec
[03:17:04] Running org.apache.activemq.bugs.AMQ4487Test
[03:17:09] Tests run: 2, Failures: 0, Errors: 0, Skipped: 0, Time elapsed: 4.647 sec
[03:17:09] Running org.apache.activemq.bugs.AMQ4504Test
[03:17:11] Tests run: 1, Failures: 0, Errors: 0, Skipped: 0, Time elapsed: 2.053 sec
[03:17:12] Running org.apache.activemq.bugs.AMQ4513Test
[03:17:38] Tests run: 1, Failures: 0, Errors: 0, Skipped: 0, Time elapsed: 25.905 sec
[03:17:38] Running org.apache.activemq.bugs.AMQ4517Test
[03:17:41] Tests run: 1, Failures: 0, Errors: 0, Skipped: 0, Time elapsed: 2.945 sec
[03:17:42] Running org.apache.activemq.bugs.AMQ4518Test
[03:17:45] Tests run: 1, Failures: 0, Errors: 0, Skipped: 0, Time elapsed: 3.162 sec
[03:17:46] Running org.apache.activemq.bugs.AMQ4530Test
[03:17:48] Tests run: 1, Failures: 0, Errors: 0, Skipped: 0, Time elapsed: 2.883 sec
[03:17:49] Running org.apache.activemq.bugs.AMQ4531Test
[03:17:52] Tests run: 1, Failures: 0, Errors: 0, Skipped: 0, Time elapsed: 2.968 sec
[03:17:53] Running org.apache.activemq.bugs.AMQ4554Test
[03:17:56] Tests run: 1, Failures: 0, Errors: 0, Skipped: 0, Time elapsed: 2.922 sec
[03:17:56] Running org.apache.activemq.bugs.AMQ4582Test
[03:17:57] Tests run: 1, Failures: 0, Errors: 0, Skipped: 0, Time elapsed: 1.138 sec
[03:17:57] Running org.apache.activemq.bugs.AMQ4595Test
[03:19:31] Tests run: 3, Failures: 0, Errors: 0, Skipped: 0, Time elapsed: 93.888 sec
[03:19:32] Running org.apache.activemq.bugs.AMQ4607Test
[03:20:21] Tests run: 4, Failures: 0, Errors: 0, Skipped: 0, Time elapsed: 49.206 sec
[03:20:22] Running org.apache.activemq.bugs.AMQ4636Test
[03:20:26] Tests run: 1, Failures: 0, Errors: 0, Skipped: 0, Time elapsed: 4.443 sec
[03:20:28] Running org.apache.activemq.bugs.AMQ4656Test
[03:20:33] Tests run: 1, Failures: 0, Errors: 0, Skipped: 0, Time elapsed: 4.979 sec
[03:20:34] Running org.apache.activemq.bugs.AMQ4671Test
[03:20:37] Tests run: 1, Failures: 0, Errors: 0, Skipped: 0, Time elapsed: 2.895 sec
[03:20:37] Running org.apache.activemq.bugs.AMQ4677Test
[03:21:09] Tests run: 1, Failures: 0, Errors: 0, Skipped: 0, Time elapsed: 32.048 sec
[03:21:10] Running org.apache.activemq.bugs.ActiveMQSlowConsumerManualTest
[03:21:22] Tests run: 4, Failures: 0, Errors: 0, Skipped: 0, Time elapsed: 11.358 sec
[03:21:22] Running org.apache.activemq.bugs.ConnectionPerMessageTest
[03:24:51] Tests run: 1, Failures: 0, Errors: 0, Skipped: 0, Time elapsed: 209.1 sec
[03:24:52] Running org.apache.activemq.bugs.CraigsBugTest
[03:24:57] Tests run: 1, Failures: 0, Errors: 0, Skipped: 0, Time elapsed: 4.912 sec
[03:24:57] Running org.apache.activemq.bugs.DoubleExpireTest
[03:25:58] Tests run: 1, Failures: 0, Errors: 0, Skipped: 0, Time elapsed: 61.039 sec
[03:25:59] Running org.apache.activemq.bugs.DurableConsumerTest
[03:26:40] Tests run: 6, Failures: 0, Errors: 0, Skipped: 0, Time elapsed: 41.609 sec
[03:26:41] Running org.apache.activemq.bugs.JMSDurableTopicNoLocalTest
[03:26:48] Tests run: 1, Failures: 0, Errors: 0, Skipped: 0, Time elapsed: 6.405 sec
[03:26:48] Running org.apache.activemq.bugs.JmsDurableTopicSlowReceiveTest
[03:28:32] Tests run: 2, Failures: 0, Errors: 0, Skipped: 0, Time elapsed: 104.566 sec
[03:28:33] Running org.apache.activemq.bugs.JmsTimeoutTest
[03:28:52] Tests run: 2, Failures: 0, Errors: 0, Skipped: 0, Time elapsed: 19.003 sec
[03:28:53] Running org.apache.activemq.bugs.MemoryUsageBlockResumeTest
[03:28:56] Tests run: 1, Failures: 0, Errors: 0, Skipped: 0, Time elapsed: 3.263 sec
[03:28:56] Running org.apache.activemq.bugs.MemoryUsageBrokerTest
[03:29:09] Tests run: 1, Failures: 0, Errors: 0, Skipped: 0, Time elapsed: 12.844 sec
[03:29:10] Running org.apache.activemq.bugs.MemoryUsageCleanupTest
[03:32:43] Tests run: 1, Failures: 0, Errors: 0, Skipped: 0, Time elapsed: 213.241 sec
[03:32:44] Running org.apache.activemq.bugs.MessageExpirationReaperTest
Sending e-mails to: dev@activemq.apache.org
[locks-and-latches] Releasing all the locks
[locks-and-latches] All the locks released
ERROR: Failed to parse POMs
hudson.remoting.ChannelClosedException: channel is already closed
	at hudson.remoting.Channel.send(Channel.java:516)
	at hudson.remoting.Request.call(Request.java:129)
	at hudson.remoting.Channel.call(Channel.java:714)
	at hudson.remoting.RemoteInvocationHandler.invoke(RemoteInvocationHandler.java:167)
	at com.sun.proxy.$Proxy38.isAlive(Unknown Source)
	at hudson.Launcher$RemoteLauncher$ProcImpl.isAlive(Launcher.java:930)
	at hudson.maven.ProcessCache$MavenProcess.call(ProcessCache.java:165)
	at hudson.maven.MavenModuleSetBuild$MavenModuleSetBuildExecution.doRun(MavenModuleSetBuild.java:813)
	at hudson.model.AbstractBuild$AbstractBuildExecution.run(AbstractBuild.java:567)
	at hudson.model.Run.execute(Run.java:1603)
	at hudson.maven.MavenModuleSetBuild.run(MavenModuleSetBuild.java:506)
	at hudson.model.ResourceController.execute(ResourceController.java:88)
	at hudson.model.Executor.run(Executor.java:246)
Caused by: java.io.IOException: Unexpected termination of the channel
	at hudson.remoting.SynchronousCommandTransport$ReaderThread.run(SynchronousCommandTransport.java:50)
Caused by: java.io.EOFException
	at java.io.ObjectInputStream$BlockDataInputStream.peekByte(ObjectInputStream.java:2596)
	at java.io.ObjectInputStream.readObject0(ObjectInputStream.java:1316)
	at java.io.ObjectInputStream.readObject(ObjectInputStream.java:370)
	at hudson.remoting.Command.readFrom(Command.java:92)
	at hudson.remoting.ClassicCommandTransport.read(ClassicCommandTransport.java:71)
	at hudson.remoting.SynchronousCommandTransport$ReaderThread.run(SynchronousCommandTransport.java:48)
FATAL: channel is already closed
hudson.remoting.ChannelClosedException: channel is already closed
	at hudson.remoting.Channel.send(Channel.java:516)
	at hudson.remoting.Request.call(Request.java:129)
	at hudson.remoting.Channel.call(Channel.java:714)
	at hudson.Launcher$RemoteLauncher.kill(Launcher.java:887)
	at hudson.model.AbstractBuild$AbstractBuildExecution.run(AbstractBuild.java:590)
	at hudson.model.Run.execute(Run.java:1603)
	at hudson.maven.MavenModuleSetBuild.run(MavenModuleSetBuild.java:506)
	at hudson.model.ResourceController.execute(ResourceController.java:88)
	at hudson.model.Executor.run(Executor.java:246)
Caused by: java.io.IOException: Unexpected termination of the channel
	at hudson.remoting.SynchronousCommandTransport$ReaderThread.run(SynchronousCommandTransport.java:50)
Caused by: java.io.EOFException
	at java.io.ObjectInputStream$BlockDataInputStream.peekByte(ObjectInputStream.java:2596)
	at java.io.ObjectInputStream.readObject0(ObjectInputStream.java:1316)
	at java.io.ObjectInputStream.readObject(ObjectInputStream.java:370)
	at hudson.remoting.Command.readFrom(Command.java:92)
	at hudson.remoting.ClassicCommandTransport.read(ClassicCommandTransport.java:71)
	at hudson.remoting.SynchronousCommandTransport$ReaderThread.run(SynchronousCommandTransport.java:48)

Mime
View raw message