activemq-dev mailing list archives

Site index · List index
Message view « Date » · « Thread »
Top « Date » · « Thread »
From Apache Jenkins Server <jenk...@builds.apache.org>
Subject Build failed in Jenkins: ActiveMQ #1388
Date Thu, 10 Oct 2013 03:38:08 GMT
See <https://builds.apache.org/job/ActiveMQ/1388/changes>

Changes:

[hiram] Fixes leveldb replication bug that can cause read errors: make sure that log is flushed
for records that are being read.

[hiram] Make sure the hawtjni package is marked optional.

[claus.ibsen] Upgrade to hawtio 1.2M22

[hiram] Fixing bug which caused replicated leveldb nodes to not recover from a ZooKeeper failure.

[tabish121] https://issues.apache.org/jira/browse/AMQ-4753

[hiram] Make sure the leveldb append log file is flushed to disk before it's closed to avoid
data loss.

------------------------------------------
[...truncated 2346 lines...]
[02:48:22] Running org.apache.activemq.broker.RecoveryBrokerTest
[02:49:10] Tests run: 9, Failures: 0, Errors: 0, Skipped: 0, Time elapsed: 47.892 sec
[02:49:11] Running org.apache.activemq.broker.RedeliveryRestartTest
[02:49:22] Tests run: 2, Failures: 0, Errors: 0, Skipped: 0, Time elapsed: 11.107 sec
[02:49:22] Running org.apache.activemq.broker.SpringTest
[02:49:25] Tests run: 1, Failures: 0, Errors: 0, Skipped: 0, Time elapsed: 2.157 sec
[02:49:28] Running org.apache.activemq.broker.TopicSubscriptionTest
[02:49:33] Tests run: 8, Failures: 0, Errors: 0, Skipped: 0, Time elapsed: 5.176 sec
[02:49:33] Running org.apache.activemq.broker.XARecoveryBrokerTest
[02:51:56] Tests run: 16, Failures: 0, Errors: 0, Skipped: 0, Time elapsed: 142.551 sec
[02:51:57] Running org.apache.activemq.broker.advisory.AdvisoryBrokerTest
[02:51:58] Tests run: 6, Failures: 0, Errors: 0, Skipped: 0, Time elapsed: 1.346 sec
[02:51:59] Running org.apache.activemq.broker.advisory.AdvisoryDuplexNetworkBridgeTest
[02:52:10] Tests run: 2, Failures: 0, Errors: 0, Skipped: 0, Time elapsed: 11.56 sec
[02:52:11] Running org.apache.activemq.broker.advisory.AdvisoryJmxTest
[02:52:12] Tests run: 1, Failures: 0, Errors: 0, Skipped: 0, Time elapsed: 1.211 sec
[02:52:13] Running org.apache.activemq.broker.advisory.AdvisoryNetworkBridgeTest
[02:52:24] Tests run: 2, Failures: 0, Errors: 0, Skipped: 0, Time elapsed: 11.025 sec
[02:52:24] Running org.apache.activemq.broker.ft.DbRestartJDBCQueueMasterSlaveLeaseQuiesceTest
[02:53:20] Tests run: 4, Failures: 0, Errors: 0, Skipped: 0, Time elapsed: 56.436 sec
[02:53:21] Running org.apache.activemq.broker.ft.DbRestartJDBCQueueMasterSlaveLeaseTest
[02:54:02] Tests run: 3, Failures: 0, Errors: 0, Skipped: 0, Time elapsed: 41.563 sec
[02:54:03] Running org.apache.activemq.broker.ft.DbRestartJDBCQueueMasterSlaveTest
[02:54:22] Tests run: 3, Failures: 0, Errors: 0, Skipped: 0, Time elapsed: 19.304 sec
[02:54:22] Running org.apache.activemq.broker.ft.DbRestartJDBCQueueTest
[02:54:45] Tests run: 1, Failures: 0, Errors: 0, Skipped: 0, Time elapsed: 22.802 sec
[02:54:45] Running org.apache.activemq.broker.ft.JDBCQueueMasterSlaveTest
[02:55:05] Tests run: 3, Failures: 0, Errors: 0, Skipped: 0, Time elapsed: 19.378 sec
[02:55:05] Running org.apache.activemq.broker.ft.QueueMasterSlaveSingleUrlTest
[02:55:45] Tests run: 3, Failures: 0, Errors: 0, Skipped: 0, Time elapsed: 40.088 sec
[02:55:46] Running org.apache.activemq.broker.ft.QueueMasterSlaveTestUsingSharedFileTest
[02:56:27] Tests run: 3, Failures: 0, Errors: 0, Skipped: 0, Time elapsed: 41.386 sec
[02:56:28] Running org.apache.activemq.broker.ft.kahaDbJdbcLeaseQueueMasterSlaveTest
[02:56:53] Tests run: 3, Failures: 1, Errors: 0, Skipped: 0, Time elapsed: 25.762 sec <<<
FAILURE!
[02:56:54] Running org.apache.activemq.broker.ft.mKahaDbQueueMasterSlaveTest
[02:57:35] Tests run: 3, Failures: 0, Errors: 0, Skipped: 0, Time elapsed: 41.288 sec
[02:57:35] Running org.apache.activemq.broker.jmx.BrokerViewSlowStoreStartupTest
[02:57:37] Tests run: 1, Failures: 0, Errors: 0, Skipped: 0, Time elapsed: 1.295 sec
[02:57:37] Running org.apache.activemq.broker.jmx.HealthViewMBeanTest
[02:57:41] Tests run: 1, Failures: 0, Errors: 0, Skipped: 0, Time elapsed: 3.584 sec
[02:57:41] Running org.apache.activemq.broker.jmx.MBeanOperationTimeoutTest
[02:57:52] Tests run: 1, Failures: 0, Errors: 0, Skipped: 0, Time elapsed: 10.698 sec
[02:57:53] Running org.apache.activemq.broker.jmx.MBeanTest
[02:58:57] Tests run: 23, Failures: 0, Errors: 0, Skipped: 0, Time elapsed: 63.629 sec
[02:58:57] Running org.apache.activemq.broker.jmx.PurgeTest
[02:59:08] Tests run: 4, Failures: 0, Errors: 0, Skipped: 0, Time elapsed: 11.332 sec
[02:59:09] Running org.apache.activemq.broker.jmx.TransportConnectorMBeanTest
[02:59:14] Tests run: 2, Failures: 0, Errors: 0, Skipped: 0, Time elapsed: 5.012 sec
[02:59:15] Running org.apache.activemq.broker.mKahaDBXARecoveryBrokerTest
[03:01:49] Tests run: 16, Failures: 0, Errors: 0, Skipped: 0, Time elapsed: 154.72 sec
[03:01:50] Running org.apache.activemq.broker.mLevelDBXARecoveryBrokerTest
[03:03:50] Tests run: 16, Failures: 0, Errors: 0, Skipped: 0, Time elapsed: 120.154 sec
[03:03:51] Running org.apache.activemq.broker.message.security.MessageAuthenticationTest
[03:03:52] Tests run: 1, Failures: 0, Errors: 0, Skipped: 0, Time elapsed: 1.148 sec
[03:03:53] Running org.apache.activemq.broker.partition.SpringPartitionBrokerTest
[03:03:54] Tests run: 1, Failures: 0, Errors: 0, Skipped: 0, Time elapsed: 1.629 sec
[03:03:56] Running org.apache.activemq.broker.policy.AbortSlowAckConsumerTest
[03:05:51] Tests run: 19, Failures: 0, Errors: 0, Skipped: 0, Time elapsed: 114.331 sec
[03:05:51] Running org.apache.activemq.broker.policy.AbortSlowConsumerTest
[03:07:54] Tests run: 19, Failures: 0, Errors: 0, Skipped: 0, Time elapsed: 122.506 sec
[03:07:54] Running org.apache.activemq.broker.policy.DeadLetterTest
[03:07:58] Tests run: 4, Failures: 0, Errors: 0, Skipped: 0, Time elapsed: 3.049 sec
[03:07:58] Running org.apache.activemq.broker.policy.DestinationCursorConfigTest
[03:08:00] Tests run: 2, Failures: 0, Errors: 0, Skipped: 0, Time elapsed: 1.875 sec
[03:08:01] Running org.apache.activemq.broker.policy.DiscardingDeadLetterPolicyTest
[03:08:44] Tests run: 4, Failures: 0, Errors: 0, Skipped: 0, Time elapsed: 43.189 sec
[03:08:45] Running org.apache.activemq.broker.policy.IndividualDeadLetterTest
[03:09:20] Tests run: 5, Failures: 0, Errors: 0, Skipped: 0, Time elapsed: 35.084 sec
[03:09:20] Running org.apache.activemq.broker.policy.IndividualDeadLetterViaXmlTest
[03:09:24] Tests run: 4, Failures: 0, Errors: 0, Skipped: 0, Time elapsed: 4.036 sec
[03:09:25] Running org.apache.activemq.broker.policy.MessageListenerDeadLetterTest
[03:09:29] Tests run: 4, Failures: 0, Errors: 0, Skipped: 0, Time elapsed: 4.01 sec
[03:09:30] Running org.apache.activemq.broker.policy.NoConsumerDeadLetterTest
[03:09:32] Tests run: 5, Failures: 0, Errors: 0, Skipped: 0, Time elapsed: 2.338 sec
[03:09:33] Running org.apache.activemq.broker.policy.NoRetryDeadLetterTest
[03:09:34] Tests run: 4, Failures: 0, Errors: 0, Skipped: 0, Time elapsed: 1.517 sec
[03:09:35] Running org.apache.activemq.broker.policy.PerDurableConsumerDeadLetterTest
[03:09:38] Tests run: 4, Failures: 0, Errors: 0, Skipped: 0, Time elapsed: 2.993 sec
[03:09:38] Running org.apache.activemq.broker.policy.PriorityNetworkDispatchPolicyTest
[03:09:39] Tests run: 1, Failures: 0, Errors: 0, Skipped: 0, Time elapsed: 0.791 sec
[03:09:39] Running org.apache.activemq.broker.policy.RoundRobinDispatchPolicyTest
[03:10:01] Tests run: 9, Failures: 0, Errors: 0, Skipped: 0, Time elapsed: 22.002 sec
[03:10:02] Running org.apache.activemq.broker.policy.SimpleDispatchPolicyTest
[03:10:09] Tests run: 8, Failures: 0, Errors: 0, Skipped: 0, Time elapsed: 6.858 sec
[03:10:09] Running org.apache.activemq.broker.policy.StrictOrderDispatchPolicyTest
[03:10:15] Tests run: 8, Failures: 0, Errors: 0, Skipped: 0, Time elapsed: 5.216 sec
[03:10:15] Running org.apache.activemq.broker.region.DestinationGCTest
[03:10:30] Tests run: 2, Failures: 0, Errors: 0, Skipped: 0, Time elapsed: 14.922 sec
[03:10:31] Running org.apache.activemq.broker.region.DestinationRemoveRestartTest
[03:10:35] Tests run: 2, Failures: 0, Errors: 0, Skipped: 0, Time elapsed: 3.704 sec
[03:10:35] Running org.apache.activemq.broker.region.QueueDuplicatesFromStoreTest
[03:10:44] Tests run: 2, Failures: 0, Errors: 0, Skipped: 0, Time elapsed: 9.059 sec
[03:10:44] Running org.apache.activemq.broker.region.QueueOptimizedDispatchExceptionTest
[03:10:45] Tests run: 1, Failures: 0, Errors: 0, Skipped: 0, Time elapsed: 0.702 sec
[03:10:45] Running org.apache.activemq.broker.region.QueuePurgeTest
[03:12:48] Tests run: 3, Failures: 0, Errors: 0, Skipped: 0, Time elapsed: 122.441 sec
[03:12:48] Running org.apache.activemq.broker.region.UniquePropertyMessageEvictionStrategyTest
[03:13:01] Tests run: 1, Failures: 0, Errors: 0, Skipped: 0, Time elapsed: 12.293 sec
[03:13:01] Running org.apache.activemq.broker.region.cursors.CursorDurableTest
[03:13:06] Tests run: 2, Failures: 0, Errors: 0, Skipped: 0, Time elapsed: 4.541 sec
[03:13:06] Running org.apache.activemq.broker.region.cursors.CursorQueueStoreTest
[03:14:51] Tests run: 5, Failures: 0, Errors: 0, Skipped: 0, Time elapsed: 104.537 sec
[03:14:52] Running org.apache.activemq.broker.region.cursors.NegativeQueueTest
[03:17:43] Tests run: 4, Failures: 0, Errors: 0, Skipped: 0, Time elapsed: 171.341 sec
[03:17:44] Running org.apache.activemq.broker.region.cursors.OrderPendingListTest
[03:17:44] Tests run: 9, Failures: 0, Errors: 0, Skipped: 0, Time elapsed: 0.298 sec
[03:17:44] Running org.apache.activemq.broker.region.cursors.PrioritizedPendingListTest
[03:17:44] Tests run: 7, Failures: 0, Errors: 0, Skipped: 0, Time elapsed: 0.254 sec
[03:17:45] Running org.apache.activemq.broker.region.cursors.StoreBasedCursorTest
[03:18:00] Tests run: 5, Failures: 0, Errors: 0, Skipped: 0, Time elapsed: 15.206 sec
[03:18:01] Running org.apache.activemq.broker.region.cursors.StoreQueueCursorJDBCNoDuplicateTest
[03:18:03] Tests run: 1, Failures: 0, Errors: 0, Skipped: 0, Time elapsed: 2.437 sec
[03:18:03] Running org.apache.activemq.broker.region.cursors.StoreQueueCursorKahaDBNoDuplicateTest
[03:18:05] Tests run: 1, Failures: 0, Errors: 0, Skipped: 0, Time elapsed: 1.394 sec
[03:18:05] Running org.apache.activemq.broker.region.cursors.StoreQueueCursorLevelDBNoDuplicateTest
[03:18:07] Tests run: 1, Failures: 0, Errors: 0, Skipped: 0, Time elapsed: 1.453 sec
[03:18:07] Running org.apache.activemq.broker.region.cursors.StoreQueueCursorMemoryNoDuplicateTest
[03:18:08] Tests run: 1, Failures: 0, Errors: 0, Skipped: 0, Time elapsed: 0.739 sec
[03:18:08] Running org.apache.activemq.broker.region.cursors.StoreQueueCursorNoDuplicateTest
[03:18:10] Tests run: 1, Failures: 0, Errors: 0, Skipped: 0, Time elapsed: 1.33 sec
[03:18:10] Running org.apache.activemq.broker.region.group.MessageGroupHashBucketTest
[03:18:10] Tests run: 2, Failures: 0, Errors: 0, Skipped: 0, Time elapsed: 0.05 sec
[03:18:10] Running org.apache.activemq.broker.region.group.MessageGroupMapTest
[03:18:10] Tests run: 2, Failures: 0, Errors: 0, Skipped: 0, Time elapsed: 0.05 sec
[03:18:11] Running org.apache.activemq.broker.region.group.MessageGroupTest
[03:18:12] Tests run: 3, Failures: 0, Errors: 0, Skipped: 0, Time elapsed: 1.715 sec
[03:18:13] Running org.apache.activemq.broker.scheduler.JmsCronSchedulerTest
[03:21:00] Tests run: 2, Failures: 0, Errors: 0, Skipped: 0, Time elapsed: 166.787 sec
[03:21:00] Running org.apache.activemq.broker.scheduler.JmsSchedulerTest
[03:22:44] Tests run: 6, Failures: 0, Errors: 0, Skipped: 0, Time elapsed: 104.531 sec
[03:22:45] Running org.apache.activemq.broker.scheduler.JobSchedulerBrokerShutdownTest
[03:22:52] Tests run: 1, Failures: 0, Errors: 0, Skipped: 0, Time elapsed: 7.524 sec
[03:22:53] Running org.apache.activemq.broker.scheduler.JobSchedulerManagementTest
[03:24:14] Tests run: 7, Failures: 0, Errors: 0, Skipped: 0, Time elapsed: 81.017 sec
[03:24:14] Running org.apache.activemq.broker.scheduler.JobSchedulerStoreTest
[03:24:16] Tests run: 1, Failures: 0, Errors: 0, Skipped: 0, Time elapsed: 1.822 sec
[03:24:16] Running org.apache.activemq.broker.scheduler.JobSchedulerTest
[03:25:08] Tests run: 9, Failures: 0, Errors: 0, Skipped: 0, Time elapsed: 51.206 sec
[03:25:08] Running org.apache.activemq.broker.scheduler.JobSchedulerTxTest
[03:25:22] Tests run: 2, Failures: 0, Errors: 0, Skipped: 0, Time elapsed: 13.792 sec
[03:25:22] Running org.apache.activemq.broker.scheduler.LostScheduledMessagesTest
[03:25:56] Tests run: 2, Failures: 0, Errors: 0, Skipped: 0, Time elapsed: 33.636 sec
[03:25:56] Running org.apache.activemq.broker.store.DefaultStoreBrokerTest
[03:28:12] Tests run: 129, Failures: 0, Errors: 0, Skipped: 0, Time elapsed: 136.313 sec
[03:28:13] Running org.apache.activemq.broker.store.DefaultStoreRecoveryBrokerTest
[03:29:04] Tests run: 9, Failures: 0, Errors: 0, Skipped: 0, Time elapsed: 51.488 sec
[03:29:05] Running org.apache.activemq.broker.store.RecoverExpiredMessagesTest
[03:29:36] Tests run: 4, Failures: 0, Errors: 0, Skipped: 0, Time elapsed: 30.941 sec
[03:29:37] Running org.apache.activemq.broker.util.PluginBrokerTest
[03:29:39] Tests run: 1, Failures: 0, Errors: 0, Skipped: 0, Time elapsed: 2.623 sec
[03:29:40] Running org.apache.activemq.broker.util.RedeliveryPluginTest
[03:29:40] Tests run: 1, Failures: 0, Errors: 0, Skipped: 0, Time elapsed: 0.466 sec
[03:29:40] Running org.apache.activemq.broker.util.TimeStampingBrokerPluginTest
[03:29:50] Tests run: 3, Failures: 0, Errors: 0, Skipped: 0, Time elapsed: 9.141 sec
[03:29:50] Running org.apache.activemq.broker.util.TraceBrokerPathPluginTest
[03:29:53] Tests run: 1, Failures: 0, Errors: 0, Skipped: 0, Time elapsed: 3.025 sec
[03:29:54] Running org.apache.activemq.broker.virtual.CompositeQueueTest
[03:29:55] Tests run: 1, Failures: 0, Errors: 0, Skipped: 0, Time elapsed: 1.537 sec
[03:29:56] Running org.apache.activemq.broker.virtual.CompositeTopicTest
[03:29:58] Tests run: 1, Failures: 0, Errors: 0, Skipped: 0, Time elapsed: 2.481 sec
[03:29:59] Running org.apache.activemq.broker.virtual.DestinationInterceptorDurableSubTest
[03:30:01] Tests run: 1, Failures: 0, Errors: 0, Skipped: 0, Time elapsed: 1.878 sec
[03:30:01] Running org.apache.activemq.broker.virtual.FilteredQueueTest
[03:30:04] Tests run: 1, Failures: 0, Errors: 0, Skipped: 0, Time elapsed: 2.808 sec
[03:30:05] Running org.apache.activemq.broker.virtual.MirroredQueueCorrectMemoryUsageTest
[03:30:17] Tests run: 1, Failures: 0, Errors: 0, Skipped: 0, Time elapsed: 11.771 sec
[03:30:17] Running org.apache.activemq.broker.virtual.MirroredQueueTest
[03:30:18] Tests run: 2, Failures: 0, Errors: 0, Skipped: 0, Time elapsed: 1.141 sec
[03:30:19] Running org.apache.activemq.broker.virtual.MirroredQueueUsingVirtualTopicQueueTest
[03:30:20] Tests run: 2, Failures: 0, Errors: 0, Skipped: 0, Time elapsed: 1.404 sec
[03:30:21] Running org.apache.activemq.broker.virtual.VirtualTopicDLQTest
[03:30:29] Tests run: 1, Failures: 0, Errors: 0, Skipped: 0, Time elapsed: 7.823 sec
[03:30:29] Running org.apache.activemq.broker.virtual.VirtualTopicDisconnectSelectorTest
[03:30:34] Tests run: 2, Failures: 0, Errors: 0, Skipped: 0, Time elapsed: 4.778 sec
[03:30:35] Running org.apache.activemq.broker.virtual.VirtualTopicPubSubTest
[03:30:36] Tests run: 2, Failures: 0, Errors: 0, Skipped: 0, Time elapsed: 1.127 sec
[03:30:36] Running org.apache.activemq.broker.virtual.VirtualTopicPubSubUsingXBeanTest
[03:30:38] Tests run: 2, Failures: 0, Errors: 0, Skipped: 0, Time elapsed: 1.456 sec
[03:30:38] Running org.apache.activemq.broker.virtual.VirtualTopicSelectorTest
[03:30:40] Tests run: 1, Failures: 0, Errors: 0, Skipped: 0, Time elapsed: 1.206 sec
[03:30:40] Running org.apache.activemq.broker.virtual.VirtualTopicsAndDurableSubsTest
[03:31:38] Tests run: 24, Failures: 0, Errors: 0, Skipped: 0, Time elapsed: 57.686 sec
[03:31:39] Running org.apache.activemq.bugs.AMQ1687Test
[03:31:42] Tests run: 1, Failures: 0, Errors: 0, Skipped: 0, Time elapsed: 2.964 sec
[03:31:42] Running org.apache.activemq.bugs.AMQ1853Test
[03:31:50] Tests run: 1, Failures: 0, Errors: 0, Skipped: 0, Time elapsed: 7.83 sec
[03:31:50] Running org.apache.activemq.bugs.AMQ1893Test
[03:32:18] Tests run: 1, Failures: 0, Errors: 0, Skipped: 0, Time elapsed: 27.126 sec
[03:32:18] Running org.apache.activemq.bugs.AMQ1917Test
[03:32:23] Tests run: 1, Failures: 0, Errors: 0, Skipped: 0, Time elapsed: 5.215 sec
[03:32:24] Running org.apache.activemq.bugs.AMQ1936Test
[03:33:43] Tests run: 1, Failures: 0, Errors: 0, Skipped: 0, Time elapsed: 78.833 sec
[03:33:44] Running org.apache.activemq.bugs.AMQ2021Test
[03:33:49] Tests run: 1, Failures: 0, Errors: 0, Skipped: 0, Time elapsed: 5.569 sec
[03:33:50] Running org.apache.activemq.bugs.AMQ2084Test
[03:33:59] Tests run: 2, Failures: 0, Errors: 0, Skipped: 0, Time elapsed: 9.266 sec
[03:34:00] Running org.apache.activemq.bugs.AMQ2103Test
[03:34:01] Tests run: 2, Failures: 0, Errors: 0, Skipped: 0, Time elapsed: 1.039 sec
[03:34:01] Running org.apache.activemq.bugs.AMQ2149LevelDBTest
Sending e-mails to: dev@activemq.apache.org
Sending e-mails to: dev@activemq.apache.org
Sending e-mails to: dev@activemq.apache.org
Sending e-mails to: dev@activemq.apache.org
[locks-and-latches] Releasing all the locks
[locks-and-latches] All the locks released
ERROR: Failed to parse POMs
hudson.remoting.ChannelClosedException: channel is already closed
	at hudson.remoting.Channel.send(Channel.java:516)
	at hudson.remoting.Request.call(Request.java:129)
	at hudson.remoting.Channel.call(Channel.java:714)
	at hudson.remoting.RemoteInvocationHandler.invoke(RemoteInvocationHandler.java:167)
	at com.sun.proxy.$Proxy42.isAlive(Unknown Source)
	at hudson.Launcher$RemoteLauncher$ProcImpl.isAlive(Launcher.java:930)
	at hudson.maven.ProcessCache$MavenProcess.call(ProcessCache.java:165)
	at hudson.maven.MavenModuleSetBuild$MavenModuleSetBuildExecution.doRun(MavenModuleSetBuild.java:813)
	at hudson.model.AbstractBuild$AbstractBuildExecution.run(AbstractBuild.java:567)
	at hudson.model.Run.execute(Run.java:1603)
	at hudson.maven.MavenModuleSetBuild.run(MavenModuleSetBuild.java:506)
	at hudson.model.ResourceController.execute(ResourceController.java:88)
	at hudson.model.Executor.run(Executor.java:246)
Caused by: java.io.IOException: Unexpected termination of the channel
	at hudson.remoting.SynchronousCommandTransport$ReaderThread.run(SynchronousCommandTransport.java:50)
Caused by: java.io.EOFException
	at java.io.ObjectInputStream$BlockDataInputStream.peekByte(ObjectInputStream.java:2596)
	at java.io.ObjectInputStream.readObject0(ObjectInputStream.java:1316)
	at java.io.ObjectInputStream.readObject(ObjectInputStream.java:370)
	at hudson.remoting.Command.readFrom(Command.java:92)
	at hudson.remoting.ClassicCommandTransport.read(ClassicCommandTransport.java:71)
	at hudson.remoting.SynchronousCommandTransport$ReaderThread.run(SynchronousCommandTransport.java:48)
FATAL: channel is already closed
hudson.remoting.ChannelClosedException: channel is already closed
	at hudson.remoting.Channel.send(Channel.java:516)
	at hudson.remoting.Request.call(Request.java:129)
	at hudson.remoting.Channel.call(Channel.java:714)
	at hudson.Launcher$RemoteLauncher.kill(Launcher.java:887)
	at hudson.model.AbstractBuild$AbstractBuildExecution.run(AbstractBuild.java:590)
	at hudson.model.Run.execute(Run.java:1603)
	at hudson.maven.MavenModuleSetBuild.run(MavenModuleSetBuild.java:506)
	at hudson.model.ResourceController.execute(ResourceController.java:88)
	at hudson.model.Executor.run(Executor.java:246)
Caused by: java.io.IOException: Unexpected termination of the channel
	at hudson.remoting.SynchronousCommandTransport$ReaderThread.run(SynchronousCommandTransport.java:50)
Caused by: java.io.EOFException
	at java.io.ObjectInputStream$BlockDataInputStream.peekByte(ObjectInputStream.java:2596)
	at java.io.ObjectInputStream.readObject0(ObjectInputStream.java:1316)
	at java.io.ObjectInputStream.readObject(ObjectInputStream.java:370)
	at hudson.remoting.Command.readFrom(Command.java:92)
	at hudson.remoting.ClassicCommandTransport.read(ClassicCommandTransport.java:71)
	at hudson.remoting.SynchronousCommandTransport$ReaderThread.run(SynchronousCommandTransport.java:48)

Mime
View raw message