activemq-dev mailing list archives

Site index · List index
Message view « Date » · « Thread »
Top « Date » · « Thread »
From Apache Jenkins Server <jenk...@builds.apache.org>
Subject Build failed in Jenkins: ActiveMQ » ActiveMQ :: MQTT Protocol #1405
Date Thu, 31 Oct 2013 05:07:46 GMT
See <https://builds.apache.org/job/ActiveMQ/org.apache.activemq$activemq-mqtt/1405/>

------------------------------------------
[04:39:33] Oct 31, 2013 4:39:40 AM org.apache.maven.cli.event.ExecutionEventLogger projectStarted
INFO:                                                                         
Oct 31, 2013 4:39:40 AM org.apache.maven.cli.event.ExecutionEventLogger projectStarted
INFO: ------------------------------------------------------------------------
Oct 31, 2013 4:39:40 AM org.apache.maven.cli.event.ExecutionEventLogger projectStarted
INFO: Building ActiveMQ :: MQTT Protocol 5.10-SNAPSHOT
Oct 31, 2013 4:39:40 AM org.apache.maven.cli.event.ExecutionEventLogger projectStarted
INFO: ------------------------------------------------------------------------
Oct 31, 2013 4:39:40 AM org.apache.maven.cli.event.ExecutionEventLogger mojoStarted
INFO: 
Oct 31, 2013 4:39:40 AM org.apache.maven.cli.event.ExecutionEventLogger mojoStarted
INFO: --- maven-clean-plugin:2.5:clean (default-clean) @ activemq-mqtt ---
[INFO] Deleting <https://builds.apache.org/job/ActiveMQ/org.apache.activemq$activemq-mqtt/ws/target>
Oct 31, 2013 4:39:41 AM org.apache.maven.cli.event.ExecutionEventLogger mojoStarted
INFO: 
Oct 31, 2013 4:39:41 AM org.apache.maven.cli.event.ExecutionEventLogger mojoStarted
INFO: --- maven-enforcer-plugin:1.0.1:enforce (default) @ activemq-mqtt ---
Oct 31, 2013 4:39:41 AM org.apache.maven.cli.event.ExecutionEventLogger mojoStarted
INFO: 
Oct 31, 2013 4:39:41 AM org.apache.maven.cli.event.ExecutionEventLogger mojoStarted
INFO: --- maven-consolets-plugin:1.30:install (default) @ activemq-mqtt ---
Oct 31, 2013 4:39:42 AM org.apache.maven.cli.event.ExecutionEventLogger mojoStarted
INFO: 
Oct 31, 2013 4:39:42 AM org.apache.maven.cli.event.ExecutionEventLogger mojoStarted
INFO: --- maven-bundle-plugin:2.3.7:cleanVersions (cleanVersions) @ activemq-mqtt ---
Oct 31, 2013 4:39:42 AM org.apache.maven.cli.event.ExecutionEventLogger mojoStarted
INFO: 
Oct 31, 2013 4:39:42 AM org.apache.maven.cli.event.ExecutionEventLogger mojoStarted
INFO: --- activemq-protobuf:1.1:compile (default) @ activemq-mqtt ---
[WARNING] No proto files found in directory: <https://builds.apache.org/job/ActiveMQ/org.apache.activemq$activemq-mqtt/ws/src/main/proto>
Oct 31, 2013 4:39:42 AM org.apache.maven.cli.event.ExecutionEventLogger mojoStarted
INFO: 
Oct 31, 2013 4:39:42 AM org.apache.maven.cli.event.ExecutionEventLogger mojoStarted
INFO: --- maven-remote-resources-plugin:1.3:process (default) @ activemq-mqtt ---
Oct 31, 2013 4:39:42 AM org.apache.maven.cli.event.ExecutionEventLogger mojoStarted
INFO: 
Oct 31, 2013 4:39:42 AM org.apache.maven.cli.event.ExecutionEventLogger mojoStarted
INFO: --- maven-resources-plugin:2.5:resources (default-resources) @ activemq-mqtt ---
[04:39:42] [debug] execute contextualize
[INFO] Using 'UTF-8' encoding to copy filtered resources.
[INFO] Copying 5 resources
[INFO] skip non existing resourceDirectory <https://builds.apache.org/job/ActiveMQ/org.apache.activemq$activemq-mqtt/ws/src/main/filtered-resources>
[INFO] Copying 3 resources
Oct 31, 2013 4:39:42 AM org.apache.maven.cli.event.ExecutionEventLogger mojoStarted
INFO: 
Oct 31, 2013 4:39:42 AM org.apache.maven.cli.event.ExecutionEventLogger mojoStarted
INFO: --- maven-compiler-plugin:2.5.1:compile (default-compile) @ activemq-mqtt ---
[INFO] Compiling 16 source files to <https://builds.apache.org/job/ActiveMQ/org.apache.activemq$activemq-mqtt/ws/target/classes>
Oct 31, 2013 4:39:42 AM org.apache.maven.cli.event.ExecutionEventLogger mojoStarted
INFO: 
Oct 31, 2013 4:39:42 AM org.apache.maven.cli.event.ExecutionEventLogger mojoStarted
INFO: --- maven-resources-plugin:2.5:testResources (default-testResources) @ activemq-mqtt
---
[04:39:42] [debug] execute contextualize
[INFO] Using 'UTF-8' encoding to copy filtered resources.
[INFO] Copying 3 resources
[INFO] Copying 3 resources
Oct 31, 2013 4:39:43 AM org.apache.maven.cli.event.ExecutionEventLogger mojoStarted
INFO: 
Oct 31, 2013 4:39:43 AM org.apache.maven.cli.event.ExecutionEventLogger mojoStarted
INFO: --- maven-compiler-plugin:2.5.1:testCompile (default-testCompile) @ activemq-mqtt ---
[INFO] Compiling 6 source files to <https://builds.apache.org/job/ActiveMQ/org.apache.activemq$activemq-mqtt/ws/target/test-classes>
Oct 31, 2013 4:39:43 AM org.apache.maven.cli.event.ExecutionEventLogger mojoStarted
INFO: 
Oct 31, 2013 4:39:43 AM org.apache.maven.cli.event.ExecutionEventLogger mojoStarted
INFO: --- maven-surefire-plugin:2.10:test (default-test) @ activemq-mqtt ---
[INFO] Surefire report directory: <https://builds.apache.org/job/ActiveMQ/org.apache.activemq$activemq-mqtt/ws/target/surefire-reports>
[04:39:43] 
[04:39:43] -------------------------------------------------------
[04:39:43]  T E S T S
[04:39:43] -------------------------------------------------------
[04:39:43] 
[04:39:43] -------------------------------------------------------
[04:39:43]  T E S T S
[04:39:43] -------------------------------------------------------
[04:39:43] Running org.apache.activemq.transport.mqtt.MQTTNioTest
[04:42:28] Tests run: 20, Failures: 0, Errors: 0, Skipped: 0, Time elapsed: 164.648 sec
[04:42:29] Running org.apache.activemq.transport.mqtt.MQTTSSLTest
[04:45:28] Tests run: 18, Failures: 1, Errors: 0, Skipped: 0, Time elapsed: 179.756 sec <<<
FAILURE!
[04:45:29] Running org.apache.activemq.transport.mqtt.MQTTTest
[04:48:04] Tests run: 18, Failures: 0, Errors: 1, Skipped: 0, Time elapsed: 155.501 sec <<<
FAILURE!
[04:48:05] 
[04:48:05] Results :
[04:48:05] 
[04:48:05] Failed tests: [04:48:05]   testUnsubscribeMQTT(org.apache.activemq.transport.mqtt.MQTTSSLTest):
expected:<0> but was:<1>
[04:48:05] 
[04:48:05] Tests in error: 
[04:48:05]   testReceiveMessageSentWhileOffline(org.apache.activemq.transport.mqtt.MQTTTest):
Unexpected MQTT command type: 8
[04:48:05] 
[04:48:05] Tests run: 56, Failures: 1, Errors: 1, Skipped: 0
[04:48:05] 
[ERROR] There are test failures.

Please refer to <https://builds.apache.org/job/ActiveMQ/org.apache.activemq$activemq-mqtt/ws/target/surefire-reports>
for the individual test results.
[04:48:05] 

Mime
View raw message