activemq-dev mailing list archives

Site index · List index
Message view « Date » · « Thread »
Top « Date » · « Thread »
From Apache Jenkins Server <jenk...@builds.apache.org>
Subject Build failed in Jenkins: ActiveMQ » ActiveMQ :: STOMP Protocol #1372
Date Tue, 24 Sep 2013 12:14:36 GMT
See <https://builds.apache.org/job/ActiveMQ/org.apache.activemq$activemq-stomp/1372/>

------------------------------------------
[11:01:45] Sep 24, 2013 11:01:50 AM org.apache.maven.cli.event.ExecutionEventLogger projectStarted
INFO:                                                                         
Sep 24, 2013 11:01:50 AM org.apache.maven.cli.event.ExecutionEventLogger projectStarted
INFO: ------------------------------------------------------------------------
Sep 24, 2013 11:01:50 AM org.apache.maven.cli.event.ExecutionEventLogger projectStarted
INFO: Building ActiveMQ :: STOMP Protocol 5.9-SNAPSHOT
Sep 24, 2013 11:01:50 AM org.apache.maven.cli.event.ExecutionEventLogger projectStarted
INFO: ------------------------------------------------------------------------
Sep 24, 2013 11:01:50 AM org.apache.maven.cli.event.ExecutionEventLogger mojoStarted
INFO: 
Sep 24, 2013 11:01:50 AM org.apache.maven.cli.event.ExecutionEventLogger mojoStarted
INFO: --- maven-clean-plugin:2.5:clean (default-clean) @ activemq-stomp ---
Sep 24, 2013 11:01:50 AM org.apache.maven.cli.event.ExecutionEventLogger mojoStarted
INFO: 
Sep 24, 2013 11:01:50 AM org.apache.maven.cli.event.ExecutionEventLogger mojoStarted
INFO: --- maven-enforcer-plugin:1.0.1:enforce (default) @ activemq-stomp ---
Sep 24, 2013 11:01:51 AM org.apache.maven.cli.event.ExecutionEventLogger mojoStarted
INFO: 
Sep 24, 2013 11:01:51 AM org.apache.maven.cli.event.ExecutionEventLogger mojoStarted
INFO: --- maven-consolets-plugin:1.30:install (default) @ activemq-stomp ---
Sep 24, 2013 11:01:51 AM org.apache.maven.cli.event.ExecutionEventLogger mojoStarted
INFO: 
Sep 24, 2013 11:01:51 AM org.apache.maven.cli.event.ExecutionEventLogger mojoStarted
INFO: --- maven-bundle-plugin:2.3.7:cleanVersions (cleanVersions) @ activemq-stomp ---
Sep 24, 2013 11:01:51 AM org.apache.maven.cli.event.ExecutionEventLogger mojoStarted
INFO: 
Sep 24, 2013 11:01:51 AM org.apache.maven.cli.event.ExecutionEventLogger mojoStarted
INFO: --- maven-remote-resources-plugin:1.3:process (default) @ activemq-stomp ---
Sep 24, 2013 11:01:51 AM org.apache.maven.cli.event.ExecutionEventLogger mojoStarted
INFO: 
Sep 24, 2013 11:01:51 AM org.apache.maven.cli.event.ExecutionEventLogger mojoStarted
INFO: --- maven-resources-plugin:2.5:resources (default-resources) @ activemq-stomp ---
[11:01:51] [debug] execute contextualize
[INFO] Using 'UTF-8' encoding to copy filtered resources.
[INFO] Copying 14 resources
[INFO] skip non existing resourceDirectory <https://builds.apache.org/job/ActiveMQ/org.apache.activemq$activemq-stomp/ws/src/main/filtered-resources>
[INFO] Copying 3 resources
Sep 24, 2013 11:01:51 AM org.apache.maven.cli.event.ExecutionEventLogger mojoStarted
INFO: 
Sep 24, 2013 11:01:51 AM org.apache.maven.cli.event.ExecutionEventLogger mojoStarted
INFO: --- maven-compiler-plugin:2.5.1:compile (default-compile) @ activemq-stomp ---
[INFO] Compiling 24 source files to <https://builds.apache.org/job/ActiveMQ/org.apache.activemq$activemq-stomp/ws/target/classes>
Sep 24, 2013 11:01:51 AM org.apache.maven.cli.event.ExecutionEventLogger mojoStarted
INFO: 
Sep 24, 2013 11:01:51 AM org.apache.maven.cli.event.ExecutionEventLogger mojoStarted
INFO: --- maven-resources-plugin:2.5:testResources (default-testResources) @ activemq-stomp
---
[11:01:51] [debug] execute contextualize
[INFO] Using 'UTF-8' encoding to copy filtered resources.
[INFO] Copying 6 resources
[INFO] Copying 3 resources
Sep 24, 2013 11:01:51 AM org.apache.maven.cli.event.ExecutionEventLogger mojoStarted
INFO: 
Sep 24, 2013 11:01:51 AM org.apache.maven.cli.event.ExecutionEventLogger mojoStarted
INFO: --- maven-compiler-plugin:2.5.1:testCompile (default-testCompile) @ activemq-stomp ---
[INFO] Compiling 30 source files to <https://builds.apache.org/job/ActiveMQ/org.apache.activemq$activemq-stomp/ws/target/test-classes>
Sep 24, 2013 11:01:52 AM org.apache.maven.cli.event.ExecutionEventLogger mojoStarted
INFO: 
Sep 24, 2013 11:01:52 AM org.apache.maven.cli.event.ExecutionEventLogger mojoStarted
INFO: --- maven-surefire-plugin:2.10:test (default-test) @ activemq-stomp ---
[INFO] Surefire report directory: <https://builds.apache.org/job/ActiveMQ/org.apache.activemq$activemq-stomp/ws/target/surefire-reports>
[11:01:52] 
[11:01:52] -------------------------------------------------------
[11:01:52]  T E S T S
[11:01:52] -------------------------------------------------------
[11:01:52] 
[11:01:52] -------------------------------------------------------
[11:01:52]  T E S T S
[11:01:52] -------------------------------------------------------
[11:01:52] Running org.apache.activemq.transport.stomp.ConnectTest
[11:02:28] Tests run: 3, Failures: 0, Errors: 0, Skipped: 0, Time elapsed: 35.782 sec
[11:02:28] Running org.apache.activemq.transport.stomp.Stomp11NIOSSLTest
[11:04:19] Tests run: 27, Failures: 0, Errors: 0, Skipped: 0, Time elapsed: 110.823 sec
[11:04:19] Running org.apache.activemq.transport.stomp.Stomp11NIOTest
[11:06:10] Tests run: 27, Failures: 0, Errors: 0, Skipped: 0, Time elapsed: 110.494 sec
[11:06:10] Running org.apache.activemq.transport.stomp.Stomp11SslAuthTest
[11:08:50] Tests run: 27, Failures: 0, Errors: 0, Skipped: 0, Time elapsed: 159.738 sec
[11:08:51] Running org.apache.activemq.transport.stomp.Stomp11Test
[11:10:41] Tests run: 27, Failures: 0, Errors: 0, Skipped: 0, Time elapsed: 110.388 sec
[11:10:42] Running org.apache.activemq.transport.stomp.Stomp12NIOSSLTest
[11:10:56] Tests run: 5, Failures: 0, Errors: 0, Skipped: 0, Time elapsed: 14.353 sec
[11:10:56] Running org.apache.activemq.transport.stomp.Stomp12NIOTest
[11:11:10] Tests run: 5, Failures: 0, Errors: 0, Skipped: 0, Time elapsed: 13.971 sec
[11:11:11] Running org.apache.activemq.transport.stomp.Stomp12SslAuthTest
[11:11:34] Tests run: 5, Failures: 0, Errors: 0, Skipped: 0, Time elapsed: 23.408 sec
[11:11:35] Running org.apache.activemq.transport.stomp.Stomp12Test
[11:11:49] Tests run: 5, Failures: 0, Errors: 0, Skipped: 0, Time elapsed: 13.94 sec
[11:11:49] Running org.apache.activemq.transport.stomp.StompAdvisoryTest
[11:12:24] Tests run: 7, Failures: 0, Errors: 0, Skipped: 0, Time elapsed: 35.276 sec
[11:12:25] Running org.apache.activemq.transport.stomp.StompFrameTest
[11:12:25] Tests run: 1, Failures: 0, Errors: 0, Skipped: 0, Time elapsed: 0.062 sec
[11:12:25] Running org.apache.activemq.transport.stomp.StompLoadTest
[11:13:41] Tests run: 1, Failures: 0, Errors: 0, Skipped: 0, Time elapsed: 75.663 sec
[11:13:41] Running org.apache.activemq.transport.stomp.StompMissingMessageTest
[11:14:33] Tests run: 2, Failures: 0, Errors: 0, Skipped: 0, Time elapsed: 51.701 sec
[11:14:34] Running org.apache.activemq.transport.stomp.StompNIOLoadTest
[11:15:49] Tests run: 1, Failures: 0, Errors: 0, Skipped: 0, Time elapsed: 75.549 sec
[11:15:50] Running org.apache.activemq.transport.stomp.StompNIOSSLLoadTest
[11:17:04] Tests run: 1, Failures: 0, Errors: 0, Skipped: 0, Time elapsed: 73.877 sec
[11:17:04] Running org.apache.activemq.transport.stomp.StompNIOSSLTest
[11:23:56] Tests run: 73, Failures: 4, Errors: 0, Skipped: 0, Time elapsed: 411.987 sec <<<
FAILURE!
[11:23:57] Running org.apache.activemq.transport.stomp.StompNIOTest
[11:27:17] Tests run: 73, Failures: 4, Errors: 0, Skipped: 0, Time elapsed: 200.604 sec <<<
FAILURE!
[11:27:18] Running org.apache.activemq.transport.stomp.StompPrefetchTest
[11:27:45] Tests run: 4, Failures: 0, Errors: 0, Skipped: 0, Time elapsed: 27.172 sec
[11:27:46] Running org.apache.activemq.transport.stomp.StompSSLLoadTest
[11:28:59] Tests run: 1, Failures: 0, Errors: 0, Skipped: 0, Time elapsed: 73.845 sec
[11:29:00] Running org.apache.activemq.transport.stomp.StompSslAuthTest
[11:35:27] Tests run: 73, Failures: 4, Errors: 0, Skipped: 0, Time elapsed: 387.236 sec <<<
FAILURE!
[11:35:28] Running org.apache.activemq.transport.stomp.StompSslTest
[11:40:03] Tests run: 73, Failures: 4, Errors: 0, Skipped: 0, Time elapsed: 274.883 sec <<<
FAILURE!
[11:40:03] Running org.apache.activemq.transport.stomp.StompSubscriptionRemoveTest
[11:40:12] Tests run: 1, Failures: 0, Errors: 0, Skipped: 0, Time elapsed: 9.066 sec
[11:40:13] Running org.apache.activemq.transport.stomp.StompTelnetTest
[11:40:18] Tests run: 2, Failures: 0, Errors: 0, Skipped: 0, Time elapsed: 4.904 sec
[11:40:18] Running org.apache.activemq.transport.stomp.StompTest
[11:43:40] Tests run: 73, Failures: 4, Errors: 0, Skipped: 0, Time elapsed: 201.567 sec <<<
FAILURE!
[11:43:40] Running org.apache.activemq.transport.stomp.StompTimeStampingBrokerPluginTest
[11:43:57] Tests run: 1, Failures: 0, Errors: 0, Skipped: 0, Time elapsed: 16.605 sec
[11:43:57] Running org.apache.activemq.transport.stomp.StompVirtualTopicTest
[11:44:47] Tests run: 1, Failures: 0, Errors: 0, Skipped: 0, Time elapsed: 49.296 sec
[11:44:47] 
[11:44:47] Results :
[11:44:47] 
[11:44:47] Failed tests: [11:44:47]   testSendMessageWithDelay(org.apache.activemq.transport.stomp.StompNIOSSLTest)
[11:44:47]   testTempDestination(org.apache.activemq.transport.stomp.StompNIOSSLTest): expected:<[Hello
World]> but was:<[java.lang.SecurityException: User system is not authorized to read
from: temp-queue://ID:janus-50490-1380021425315-4:46:1
[11:44:47]   testReplyToAcrossConnections(org.apache.activemq.transport.stomp.StompNIOSSLTest):
Receipt Frame: ERROR
[11:44:47]   testReplyToDestinationNaming(org.apache.activemq.transport.stomp.StompNIOSSLTest)
[11:44:47]   testSendMessageWithDelay(org.apache.activemq.transport.stomp.StompNIOTest)
[11:44:47]   testTempDestination(org.apache.activemq.transport.stomp.StompNIOTest): expected:<[Hello
World]> but was:<[java.lang.SecurityException: User system is not authorized to read
from: temp-queue://ID:janus-39090-1380021837960-4:46:1
[11:44:47]   testReplyToAcrossConnections(org.apache.activemq.transport.stomp.StompNIOTest):
Receipt Frame: ERROR
[11:44:47]   testReplyToDestinationNaming(org.apache.activemq.transport.stomp.StompNIOTest)
[11:44:47]   testSendMessageWithDelay(org.apache.activemq.transport.stomp.StompSslAuthTest)
[11:44:47]   testTempDestination(org.apache.activemq.transport.stomp.StompSslAuthTest): expected:<[Hello
World]> but was:<[java.lang.SecurityException: User CN=localhost, OU=activemq.org, O=activemq.org,
L=LA, ST=CA, C=US is not authorized to read from: temp-queue://ID:janus-58397-1380022141328-2:46:1
[11:44:47]   testReplyToAcrossConnections(org.apache.activemq.transport.stomp.StompSslAuthTest):
Receipt Frame: ERROR
[11:44:47]   testReplyToDestinationNaming(org.apache.activemq.transport.stomp.StompSslAuthTest)
[11:44:47]   testSendMessageWithDelay(org.apache.activemq.transport.stomp.StompSslTest)
[11:44:47]   testTempDestination(org.apache.activemq.transport.stomp.StompSslTest): expected:<[Hello
World]> but was:<[java.lang.SecurityException: User system is not authorized to read
from: temp-queue://ID:janus-54209-1380022529074-4:46:1
[11:44:47]   testReplyToAcrossConnections(org.apache.activemq.transport.stomp.StompSslTest):
Receipt Frame: ERROR
[11:44:47]   testReplyToDestinationNaming(org.apache.activemq.transport.stomp.StompSslTest)
[11:44:47]   testSendMessageWithDelay(org.apache.activemq.transport.stomp.StompTest)
[11:44:47]   testTempDestination(org.apache.activemq.transport.stomp.StompTest): expected:<[Hello
World]> but was:<[java.lang.SecurityException: User system is not authorized to read
from: temp-queue://ID:janus-42221-1380022819229-4:46:1
[11:44:47]   testReplyToAcrossConnections(org.apache.activemq.transport.stomp.StompTest):
Receipt Frame: ERROR
[11:44:47]   testReplyToDestinationNaming(org.apache.activemq.transport.stomp.StompTest)
[11:44:47] 
[11:44:47] Tests run: 519, Failures: 20, Errors: 0, Skipped: 0
[11:44:47] 
[ERROR] There are test failures.

Please refer to <https://builds.apache.org/job/ActiveMQ/org.apache.activemq$activemq-stomp/ws/target/surefire-reports>
for the individual test results.
[11:45:07] 

Mime
View raw message