activemq-dev mailing list archives

Site index · List index
Message view « Date » · « Thread »
Top « Date » · « Thread »
From Apache Jenkins Server <jenk...@builds.apache.org>
Subject Build failed in Jenkins: ActiveMQ » ActiveMQ :: MQTT Protocol #1357
Date Thu, 15 Aug 2013 01:55:54 GMT
See <https://builds.apache.org/job/ActiveMQ/org.apache.activemq$activemq-mqtt/1357/>

------------------------------------------
[01:31:43] Aug 15, 2013 1:31:43 AM org.apache.maven.cli.event.ExecutionEventLogger projectStarted
INFO:                                                                         
Aug 15, 2013 1:31:43 AM org.apache.maven.cli.event.ExecutionEventLogger projectStarted
INFO: ------------------------------------------------------------------------
Aug 15, 2013 1:31:43 AM org.apache.maven.cli.event.ExecutionEventLogger projectStarted
INFO: Building ActiveMQ :: MQTT Protocol 5.9-SNAPSHOT
Aug 15, 2013 1:31:43 AM org.apache.maven.cli.event.ExecutionEventLogger projectStarted
INFO: ------------------------------------------------------------------------
Aug 15, 2013 1:31:43 AM org.apache.maven.cli.event.ExecutionEventLogger mojoStarted
INFO: 
Aug 15, 2013 1:31:43 AM org.apache.maven.cli.event.ExecutionEventLogger mojoStarted
INFO: --- maven-clean-plugin:2.5:clean (default-clean) @ activemq-mqtt ---
Aug 15, 2013 1:31:44 AM org.apache.maven.cli.event.ExecutionEventLogger mojoStarted
INFO: 
Aug 15, 2013 1:31:44 AM org.apache.maven.cli.event.ExecutionEventLogger mojoStarted
INFO: --- maven-enforcer-plugin:1.0.1:enforce (default) @ activemq-mqtt ---
Aug 15, 2013 1:31:44 AM org.apache.maven.cli.event.ExecutionEventLogger mojoStarted
INFO: 
Aug 15, 2013 1:31:44 AM org.apache.maven.cli.event.ExecutionEventLogger mojoStarted
INFO: --- maven-consolets-plugin:1.30:install (default) @ activemq-mqtt ---
Aug 15, 2013 1:31:44 AM org.apache.maven.cli.event.ExecutionEventLogger mojoStarted
INFO: 
Aug 15, 2013 1:31:44 AM org.apache.maven.cli.event.ExecutionEventLogger mojoStarted
INFO: --- maven-bundle-plugin:2.3.7:cleanVersions (cleanVersions) @ activemq-mqtt ---
Aug 15, 2013 1:31:44 AM org.apache.maven.cli.event.ExecutionEventLogger mojoStarted
INFO: 
Aug 15, 2013 1:31:44 AM org.apache.maven.cli.event.ExecutionEventLogger mojoStarted
INFO: --- activemq-protobuf:1.1:compile (default) @ activemq-mqtt ---
[WARNING] No proto files found in directory: <https://builds.apache.org/job/ActiveMQ/org.apache.activemq$activemq-mqtt/ws/src/main/proto>
Aug 15, 2013 1:31:44 AM org.apache.maven.cli.event.ExecutionEventLogger mojoStarted
INFO: 
Aug 15, 2013 1:31:44 AM org.apache.maven.cli.event.ExecutionEventLogger mojoStarted
INFO: --- maven-remote-resources-plugin:1.3:process (default) @ activemq-mqtt ---
Aug 15, 2013 1:31:44 AM org.apache.maven.cli.event.ExecutionEventLogger mojoStarted
INFO: 
Aug 15, 2013 1:31:44 AM org.apache.maven.cli.event.ExecutionEventLogger mojoStarted
INFO: --- maven-resources-plugin:2.5:resources (default-resources) @ activemq-mqtt ---
[01:31:44] [debug] execute contextualize
[INFO] Using 'UTF-8' encoding to copy filtered resources.
[INFO] Copying 5 resources
[INFO] skip non existing resourceDirectory <https://builds.apache.org/job/ActiveMQ/org.apache.activemq$activemq-mqtt/ws/src/main/filtered-resources>
[INFO] Copying 3 resources
Aug 15, 2013 1:31:44 AM org.apache.maven.cli.event.ExecutionEventLogger mojoStarted
INFO: 
Aug 15, 2013 1:31:44 AM org.apache.maven.cli.event.ExecutionEventLogger mojoStarted
INFO: --- maven-compiler-plugin:2.5.1:compile (default-compile) @ activemq-mqtt ---
[INFO] Compiling 16 source files to <https://builds.apache.org/job/ActiveMQ/org.apache.activemq$activemq-mqtt/ws/target/classes>
Aug 15, 2013 1:31:45 AM org.apache.maven.cli.event.ExecutionEventLogger mojoStarted
INFO: 
Aug 15, 2013 1:31:45 AM org.apache.maven.cli.event.ExecutionEventLogger mojoStarted
INFO: --- maven-resources-plugin:2.5:testResources (default-testResources) @ activemq-mqtt
---
[01:31:45] [debug] execute contextualize
[INFO] Using 'UTF-8' encoding to copy filtered resources.
[INFO] Copying 3 resources
[INFO] Copying 3 resources
Aug 15, 2013 1:31:45 AM org.apache.maven.cli.event.ExecutionEventLogger mojoStarted
INFO: 
Aug 15, 2013 1:31:45 AM org.apache.maven.cli.event.ExecutionEventLogger mojoStarted
INFO: --- maven-compiler-plugin:2.5.1:testCompile (default-testCompile) @ activemq-mqtt ---
[INFO] Compiling 6 source files to <https://builds.apache.org/job/ActiveMQ/org.apache.activemq$activemq-mqtt/ws/target/test-classes>
Aug 15, 2013 1:31:45 AM org.apache.maven.cli.event.ExecutionEventLogger mojoStarted
INFO: 
Aug 15, 2013 1:31:45 AM org.apache.maven.cli.event.ExecutionEventLogger mojoStarted
INFO: --- maven-surefire-plugin:2.10:test (default-test) @ activemq-mqtt ---
[INFO] Surefire report directory: <https://builds.apache.org/job/ActiveMQ/org.apache.activemq$activemq-mqtt/ws/target/surefire-reports>
[01:31:45] 
[01:31:45] -------------------------------------------------------
[01:31:45]  T E S T S
[01:31:45] -------------------------------------------------------
[01:31:45] 
[01:31:45] -------------------------------------------------------
[01:31:45]  T E S T S
[01:31:45] -------------------------------------------------------
[01:31:45] Running org.apache.activemq.transport.mqtt.MQTTNioTest
[01:34:21] Tests run: 18, Failures: 0, Errors: 1, Skipped: 0, Time elapsed: 155.45 sec <<<
FAILURE!
[01:34:21] Running org.apache.activemq.transport.mqtt.MQTTSSLTest
[01:37:00] Tests run: 17, Failures: 0, Errors: 1, Skipped: 0, Time elapsed: 158.701 sec <<<
FAILURE!
[01:37:00] Running org.apache.activemq.transport.mqtt.MQTTTest
[01:39:32] Tests run: 17, Failures: 0, Errors: 0, Skipped: 0, Time elapsed: 151.328 sec
[01:39:32] 
[01:39:32] Results :
[01:39:32] 
[01:39:32] Tests in error: 
[01:39:32]   testPingOnMQTTNIO(org.apache.activemq.transport.mqtt.MQTTNioTest): The client
id MUST be configured when clean session is set to false
[01:39:32]   testReceiveMessageSentWhileOffline(org.apache.activemq.transport.mqtt.MQTTSSLTest):
String index out of range: -6
[01:39:32] 
[01:39:32] Tests run: 52, Failures: 0, Errors: 2, Skipped: 0
[01:39:32] 
[ERROR] There are test failures.

Please refer to <https://builds.apache.org/job/ActiveMQ/org.apache.activemq$activemq-mqtt/ws/target/surefire-reports>
for the individual test results.
[01:39:32] 

Mime
View raw message