activemq-dev mailing list archives

Site index · List index
Message view « Date » · « Thread »
Top « Date » · « Thread »
From Apache Jenkins Server <jenk...@builds.apache.org>
Subject Build failed in Jenkins: ActiveMQ #1358
Date Fri, 16 Aug 2013 04:30:59 GMT
See <https://builds.apache.org/job/ActiveMQ/1358/changes>

Changes:

[tabish] test to show that: https://issues.apache.org/jira/browse/AMQ-4677 is not an issue.
 Verifies that the LevelDB logs are cleared as messages are consumed.

[tabish] update svn:ignore property

[tabish] initialize svn:ignore property

------------------------------------------
[...truncated 7859 lines...]
[03:54:05] Tests run: 2, Failures: 0, Errors: 0, Skipped: 0, Time elapsed: 5.283 sec
[03:54:06] Running org.apache.activemq.bugs.AMQ2512Test
[03:54:43] Tests run: 1, Failures: 0, Errors: 0, Skipped: 0, Time elapsed: 37.17 sec
[03:54:43] Running org.apache.activemq.bugs.AMQ2513Test
[03:54:49] Tests run: 1, Failures: 0, Errors: 0, Skipped: 0, Time elapsed: 6.216 sec
[03:54:50] Running org.apache.activemq.bugs.AMQ2528Test
[03:54:51] Tests run: 1, Failures: 0, Errors: 0, Skipped: 0, Time elapsed: 1.085 sec
[03:54:51] Running org.apache.activemq.bugs.AMQ2571Test
[03:54:52] Tests run: 1, Failures: 0, Errors: 0, Skipped: 0, Time elapsed: 0.872 sec
[03:54:53] Running org.apache.activemq.bugs.AMQ2580Test
[03:55:08] Tests run: 5, Failures: 0, Errors: 0, Skipped: 0, Time elapsed: 14.976 sec
[03:55:08] Running org.apache.activemq.bugs.AMQ2584ConcurrentDlqTest
[03:55:22] Tests run: 1, Failures: 0, Errors: 0, Skipped: 0, Time elapsed: 13.834 sec
[03:55:23] Running org.apache.activemq.bugs.AMQ2584Test
[03:55:39] Tests run: 2, Failures: 0, Errors: 0, Skipped: 0, Time elapsed: 16.543 sec
[03:55:40] Running org.apache.activemq.bugs.AMQ2585Test
[03:55:41] Tests run: 1, Failures: 0, Errors: 0, Skipped: 0, Time elapsed: 1.163 sec
[03:55:42] Running org.apache.activemq.bugs.AMQ2616Test
[03:55:47] Tests run: 1, Failures: 0, Errors: 0, Skipped: 0, Time elapsed: 5.297 sec
[03:55:48] Running org.apache.activemq.bugs.AMQ2645Test
[03:55:57] Tests run: 1, Failures: 0, Errors: 0, Skipped: 0, Time elapsed: 9.054 sec
[03:55:57] Running org.apache.activemq.bugs.AMQ2736Test
[03:55:59] Tests run: 1, Failures: 0, Errors: 0, Skipped: 0, Time elapsed: 2.069 sec
[03:56:00] Running org.apache.activemq.bugs.AMQ2751Test
[03:56:09] Tests run: 1, Failures: 0, Errors: 0, Skipped: 0, Time elapsed: 9.033 sec
[03:56:09] Running org.apache.activemq.bugs.AMQ2801Test
[03:56:20] Tests run: 1, Failures: 0, Errors: 0, Skipped: 0, Time elapsed: 11.048 sec
[03:56:21] Running org.apache.activemq.bugs.AMQ2832Test
[03:56:52] Tests run: 2, Failures: 0, Errors: 0, Skipped: 0, Time elapsed: 31.255 sec
[03:56:53] Running org.apache.activemq.bugs.AMQ2870Test
[03:57:28] Tests run: 2, Failures: 0, Errors: 0, Skipped: 0, Time elapsed: 35.715 sec
[03:57:29] Running org.apache.activemq.bugs.AMQ2902Test
[03:57:30] Tests run: 2, Failures: 1, Errors: 0, Skipped: 0, Time elapsed: 0.992 sec <<<
FAILURE!
[03:57:31] Running org.apache.activemq.bugs.AMQ2910Test
[03:57:36] Tests run: 1, Failures: 0, Errors: 0, Skipped: 0, Time elapsed: 5.221 sec
[03:57:37] Running org.apache.activemq.bugs.AMQ2982Test
[03:57:40] Tests run: 1, Failures: 0, Errors: 0, Skipped: 0, Time elapsed: 3.295 sec
[03:57:40] Running org.apache.activemq.bugs.AMQ2983Test
[03:57:44] Tests run: 1, Failures: 0, Errors: 0, Skipped: 0, Time elapsed: 3.755 sec
[03:57:45] Running org.apache.activemq.bugs.AMQ3014Test
[03:57:50] Tests run: 2, Failures: 0, Errors: 0, Skipped: 0, Time elapsed: 4.846 sec
[03:57:50] Running org.apache.activemq.bugs.AMQ3120Test
[04:03:18] Tests run: 1, Failures: 0, Errors: 0, Skipped: 0, Time elapsed: 327.503 sec
[04:03:18] Running org.apache.activemq.bugs.AMQ3140Test
[04:03:31] Tests run: 1, Failures: 0, Errors: 0, Skipped: 0, Time elapsed: 13.009 sec
[04:03:31] Running org.apache.activemq.bugs.AMQ3141Test
[04:03:32] Tests run: 1, Failures: 0, Errors: 0, Skipped: 0, Time elapsed: 1.073 sec
[04:03:33] Running org.apache.activemq.bugs.AMQ3145Test
[04:03:39] Tests run: 1, Failures: 0, Errors: 0, Skipped: 0, Time elapsed: 6.206 sec
[04:03:39] Running org.apache.activemq.bugs.AMQ3157Test
[04:03:50] Tests run: 1, Failures: 0, Errors: 0, Skipped: 0, Time elapsed: 11.245 sec
[04:03:51] Running org.apache.activemq.bugs.AMQ3167Test
[04:04:07] Tests run: 1, Failures: 0, Errors: 0, Skipped: 0, Time elapsed: 16.14 sec
[04:04:07] Running org.apache.activemq.bugs.AMQ3274Test
[04:04:13] Tests run: 1, Failures: 0, Errors: 0, Skipped: 0, Time elapsed: 5.495 sec
[04:04:13] Running org.apache.activemq.bugs.AMQ3324Test
[04:04:18] Tests run: 1, Failures: 0, Errors: 0, Skipped: 0, Time elapsed: 4.999 sec
[04:04:19] Running org.apache.activemq.bugs.AMQ3352Test
[04:04:26] Tests run: 1, Failures: 0, Errors: 0, Skipped: 0, Time elapsed: 7.416 sec
[04:04:27] Running org.apache.activemq.bugs.AMQ3405Test
[04:04:30] Tests run: 1, Failures: 0, Errors: 0, Skipped: 0, Time elapsed: 3.303 sec
[04:04:31] Running org.apache.activemq.bugs.AMQ3436Test
[04:04:32] Tests run: 1, Failures: 0, Errors: 0, Skipped: 0, Time elapsed: 1.595 sec
[04:04:33] Running org.apache.activemq.bugs.AMQ3445Test
[04:04:44] Tests run: 1, Failures: 0, Errors: 0, Skipped: 0, Time elapsed: 11.36 sec
[04:04:45] Running org.apache.activemq.bugs.AMQ3454Test
[04:04:51] Tests run: 1, Failures: 0, Errors: 0, Skipped: 0, Time elapsed: 6.478 sec
[04:04:54] Running org.apache.activemq.bugs.AMQ3465Test
[04:04:59] Tests run: 2, Failures: 0, Errors: 0, Skipped: 0, Time elapsed: 4.973 sec
[04:04:59] Running org.apache.activemq.bugs.AMQ3529Test
[04:05:08] Tests run: 1, Failures: 0, Errors: 0, Skipped: 0, Time elapsed: 8.83 sec
[04:05:08] Running org.apache.activemq.bugs.AMQ3537Test
[04:05:08] Tests run: 1, Failures: 0, Errors: 0, Skipped: 0, Time elapsed: 0.085 sec
[04:05:09] Running org.apache.activemq.bugs.AMQ3567Test
[04:06:53] Tests run: 1, Failures: 0, Errors: 0, Skipped: 0, Time elapsed: 104.402 sec
[04:06:54] Running org.apache.activemq.bugs.AMQ3622Test
[04:06:57] Tests run: 1, Failures: 0, Errors: 0, Skipped: 0, Time elapsed: 3.405 sec
[04:06:58] Running org.apache.activemq.bugs.AMQ3625Test
[04:07:12] Tests run: 1, Failures: 0, Errors: 0, Skipped: 0, Time elapsed: 14.356 sec
[04:07:12] Running org.apache.activemq.bugs.AMQ3674Test
[04:07:15] Tests run: 1, Failures: 0, Errors: 0, Skipped: 0, Time elapsed: 3.042 sec
[04:07:16] Running org.apache.activemq.bugs.AMQ3675Test
[04:07:19] Tests run: 1, Failures: 0, Errors: 0, Skipped: 0, Time elapsed: 3.031 sec
[04:07:21] Running org.apache.activemq.bugs.AMQ3678Test
[04:07:24] Tests run: 1, Failures: 0, Errors: 0, Skipped: 0, Time elapsed: 2.986 sec
[04:07:24] Running org.apache.activemq.bugs.AMQ3732Test
[04:09:27] Tests run: 1, Failures: 0, Errors: 0, Skipped: 0, Time elapsed: 122.866 sec
[04:09:28] Running org.apache.activemq.bugs.AMQ3841Test
[04:09:30] Tests run: 1, Failures: 0, Errors: 0, Skipped: 0, Time elapsed: 2.453 sec
[04:09:31] Running org.apache.activemq.bugs.AMQ3879Test
[04:09:32] Tests run: 1, Failures: 0, Errors: 0, Skipped: 0, Time elapsed: 1.503 sec
[04:09:32] Running org.apache.activemq.bugs.AMQ3903Test
[04:09:37] Tests run: 2, Failures: 0, Errors: 0, Skipped: 0, Time elapsed: 4.83 sec
[04:09:37] Running org.apache.activemq.bugs.AMQ3932Test
[04:10:04] Tests run: 3, Failures: 0, Errors: 0, Skipped: 0, Time elapsed: 26.905 sec
[04:10:05] Running org.apache.activemq.bugs.AMQ3934Test
[04:10:08] Tests run: 1, Failures: 0, Errors: 0, Skipped: 0, Time elapsed: 2.861 sec
[04:10:08] Running org.apache.activemq.bugs.AMQ3961Test
[04:10:13] Tests run: 1, Failures: 0, Errors: 0, Skipped: 0, Time elapsed: 5.124 sec
[04:10:14] Running org.apache.activemq.bugs.AMQ3992Test
[04:10:19] Tests run: 1, Failures: 0, Errors: 0, Skipped: 0, Time elapsed: 4.967 sec
[04:10:19] Running org.apache.activemq.bugs.AMQ4062Test
[04:10:25] Tests run: 1, Failures: 0, Errors: 0, Skipped: 0, Time elapsed: 5.995 sec
[04:10:26] Running org.apache.activemq.bugs.AMQ4083Test
[04:11:31] Tests run: 6, Failures: 0, Errors: 0, Skipped: 0, Time elapsed: 65.385 sec
[04:11:32] Running org.apache.activemq.bugs.AMQ4116Test
[04:11:37] Tests run: 2, Failures: 0, Errors: 0, Skipped: 0, Time elapsed: 4.948 sec
[04:11:37] Running org.apache.activemq.bugs.AMQ4126Test
[04:12:19] Tests run: 9, Failures: 0, Errors: 0, Skipped: 0, Time elapsed: 41.658 sec
[04:12:20] Running org.apache.activemq.bugs.AMQ4133Test
[04:12:42] Tests run: 4, Failures: 0, Errors: 0, Skipped: 0, Time elapsed: 22.583 sec
[04:12:42] Running org.apache.activemq.bugs.AMQ4147Test
[04:12:55] Tests run: 2, Failures: 0, Errors: 0, Skipped: 0, Time elapsed: 12.302 sec
[04:12:55] Running org.apache.activemq.bugs.AMQ4148Test
[04:13:06] Tests run: 1, Failures: 0, Errors: 0, Skipped: 0, Time elapsed: 11.021 sec
[04:13:07] Running org.apache.activemq.bugs.AMQ4157Test
[04:13:16] Tests run: 1, Failures: 0, Errors: 0, Skipped: 0, Time elapsed: 8.827 sec
[04:13:17] Running org.apache.activemq.bugs.AMQ4160Test
[04:14:01] Tests run: 3, Failures: 0, Errors: 0, Skipped: 0, Time elapsed: 44.148 sec
[04:14:01] Running org.apache.activemq.bugs.AMQ4212Test
[04:14:47] Tests run: 2, Failures: 0, Errors: 0, Skipped: 0, Time elapsed: 45.778 sec
[04:14:48] Running org.apache.activemq.bugs.AMQ4213Test
[04:14:51] Tests run: 1, Failures: 0, Errors: 0, Skipped: 0, Time elapsed: 3.011 sec
[04:14:51] Running org.apache.activemq.bugs.AMQ4220Test
[04:14:53] Tests run: 1, Failures: 0, Errors: 0, Skipped: 0, Time elapsed: 2.061 sec
[04:14:54] Running org.apache.activemq.bugs.AMQ4221Test
[04:15:26] Tests run: 1, Failures: 0, Errors: 0, Skipped: 0, Time elapsed: 32.138 sec
[04:15:27] Running org.apache.activemq.bugs.AMQ4222Test
[04:15:28] Tests run: 1, Failures: 0, Errors: 0, Skipped: 0, Time elapsed: 1.24 sec
[04:15:29] Running org.apache.activemq.bugs.AMQ4323Test
[04:15:34] Tests run: 1, Failures: 0, Errors: 0, Skipped: 0, Time elapsed: 5.211 sec
[04:15:34] Running org.apache.activemq.bugs.AMQ4356Test
[04:15:41] Tests run: 1, Failures: 0, Errors: 0, Skipped: 0, Time elapsed: 6.258 sec
[04:15:41] Running org.apache.activemq.bugs.AMQ4361Test
[04:15:47] Tests run: 1, Failures: 0, Errors: 0, Skipped: 0, Time elapsed: 5.412 sec
[04:15:47] Running org.apache.activemq.bugs.AMQ4368Test
[04:16:11] Tests run: 1, Failures: 0, Errors: 0, Skipped: 0, Time elapsed: 23.662 sec
[04:16:11] Running org.apache.activemq.bugs.AMQ4407Test
[04:16:14] Tests run: 1, Failures: 0, Errors: 0, Skipped: 0, Time elapsed: 2.977 sec
[04:16:15] Running org.apache.activemq.bugs.AMQ4413Test
[04:16:24] Tests run: 1, Failures: 0, Errors: 0, Skipped: 0, Time elapsed: 9.038 sec
[04:16:24] Running org.apache.activemq.bugs.AMQ4469Test
[04:16:31] Tests run: 1, Failures: 0, Errors: 0, Skipped: 0, Time elapsed: 7.038 sec
[04:16:32] Running org.apache.activemq.bugs.AMQ4472Test
[04:16:34] Tests run: 1, Failures: 0, Errors: 0, Skipped: 0, Time elapsed: 2.011 sec
[04:16:34] Running org.apache.activemq.bugs.AMQ4475Test
[04:16:39] Tests run: 1, Failures: 0, Errors: 0, Skipped: 0, Time elapsed: 5.051 sec
[04:16:40] Running org.apache.activemq.bugs.AMQ4485Test
[04:16:50] Tests run: 1, Failures: 0, Errors: 0, Skipped: 0, Time elapsed: 9.941 sec
[04:16:50] Running org.apache.activemq.bugs.AMQ4487Test
[04:16:55] Tests run: 2, Failures: 0, Errors: 0, Skipped: 0, Time elapsed: 5.213 sec
[04:16:56] Running org.apache.activemq.bugs.AMQ4504Test
[04:16:58] Tests run: 1, Failures: 0, Errors: 0, Skipped: 0, Time elapsed: 2.238 sec
[04:16:59] Running org.apache.activemq.bugs.AMQ4513Test
[04:17:25] Tests run: 1, Failures: 0, Errors: 0, Skipped: 0, Time elapsed: 26.521 sec
[04:17:26] Running org.apache.activemq.bugs.AMQ4517Test
[04:17:29] Tests run: 1, Failures: 0, Errors: 0, Skipped: 0, Time elapsed: 3.125 sec
[04:17:30] Running org.apache.activemq.bugs.AMQ4518Test
[04:17:33] Tests run: 1, Failures: 0, Errors: 0, Skipped: 0, Time elapsed: 3.11 sec
[04:17:33] Running org.apache.activemq.bugs.AMQ4530Test
[04:17:36] Tests run: 1, Failures: 0, Errors: 0, Skipped: 0, Time elapsed: 2.97 sec
[04:17:37] Running org.apache.activemq.bugs.AMQ4531Test
[04:17:40] Tests run: 1, Failures: 0, Errors: 0, Skipped: 0, Time elapsed: 2.995 sec
[04:17:41] Running org.apache.activemq.bugs.AMQ4554Test
[04:17:43] Tests run: 1, Failures: 0, Errors: 0, Skipped: 0, Time elapsed: 2.941 sec
[04:17:44] Running org.apache.activemq.bugs.AMQ4582Test
[04:17:45] Tests run: 1, Failures: 0, Errors: 0, Skipped: 0, Time elapsed: 0.995 sec
[04:17:45] Running org.apache.activemq.bugs.AMQ4595Test
[04:19:20] Tests run: 3, Failures: 0, Errors: 0, Skipped: 0, Time elapsed: 94.155 sec
[04:19:20] Running org.apache.activemq.bugs.AMQ4607Test
[04:20:10] Tests run: 4, Failures: 0, Errors: 0, Skipped: 0, Time elapsed: 49.32 sec
[04:20:10] Running org.apache.activemq.bugs.AMQ4636Test
[04:20:15] Tests run: 1, Failures: 0, Errors: 0, Skipped: 0, Time elapsed: 4.918 sec
[04:20:17] Running org.apache.activemq.bugs.AMQ4656Test
[04:20:22] Tests run: 1, Failures: 0, Errors: 0, Skipped: 0, Time elapsed: 4.984 sec
[04:20:23] Running org.apache.activemq.bugs.AMQ4671Test
[04:20:26] Tests run: 1, Failures: 0, Errors: 0, Skipped: 0, Time elapsed: 2.991 sec
[04:20:27] Running org.apache.activemq.bugs.AMQ4677Test
[04:20:59] Tests run: 1, Failures: 0, Errors: 0, Skipped: 0, Time elapsed: 32.532 sec
[04:21:00] Running org.apache.activemq.bugs.ActiveMQSlowConsumerManualTest
[04:21:12] Tests run: 4, Failures: 0, Errors: 0, Skipped: 0, Time elapsed: 11.597 sec
[04:21:12] Running org.apache.activemq.bugs.ConnectionPerMessageTest
[04:23:51] Tests run: 1, Failures: 0, Errors: 0, Skipped: 0, Time elapsed: 158.983 sec
[04:23:52] Running org.apache.activemq.bugs.CraigsBugTest
[04:23:57] Tests run: 1, Failures: 0, Errors: 0, Skipped: 0, Time elapsed: 4.916 sec
[04:23:57] Running org.apache.activemq.bugs.DoubleExpireTest
[04:24:58] Tests run: 1, Failures: 0, Errors: 0, Skipped: 0, Time elapsed: 61.173 sec
[04:24:59] Running org.apache.activemq.bugs.DurableConsumerTest
[04:25:44] Tests run: 6, Failures: 0, Errors: 0, Skipped: 0, Time elapsed: 45.051 sec
[04:25:45] Running org.apache.activemq.bugs.JMSDurableTopicNoLocalTest
[04:25:51] Tests run: 1, Failures: 0, Errors: 0, Skipped: 0, Time elapsed: 6.322 sec
[04:25:51] Running org.apache.activemq.bugs.JmsDurableTopicSlowReceiveTest
[04:27:36] Tests run: 2, Failures: 0, Errors: 0, Skipped: 0, Time elapsed: 104.815 sec
[04:27:37] Running org.apache.activemq.bugs.JmsTimeoutTest
[04:27:56] Tests run: 2, Failures: 0, Errors: 0, Skipped: 0, Time elapsed: 18.983 sec
[04:27:56] Running org.apache.activemq.bugs.MemoryUsageBlockResumeTest
[04:28:00] Tests run: 1, Failures: 0, Errors: 0, Skipped: 0, Time elapsed: 3.386 sec
[04:28:00] Running org.apache.activemq.bugs.MemoryUsageBrokerTest
[04:28:15] Tests run: 1, Failures: 0, Errors: 0, Skipped: 0, Time elapsed: 15.236 sec
[04:28:16] Running org.apache.activemq.bugs.MemoryUsageCleanupTest
Sending e-mails to: dev@activemq.apache.org
Sending e-mails to: dev@activemq.apache.org
Sending e-mails to: dev@activemq.apache.org
[locks-and-latches] Releasing all the locks
[locks-and-latches] All the locks released
ERROR: Failed to parse POMs
hudson.remoting.ChannelClosedException: channel is already closed
	at hudson.remoting.Channel.send(Channel.java:516)
	at hudson.remoting.Request.call(Request.java:129)
	at hudson.remoting.Channel.call(Channel.java:714)
	at hudson.remoting.RemoteInvocationHandler.invoke(RemoteInvocationHandler.java:167)
	at com.sun.proxy.$Proxy40.isAlive(Unknown Source)
	at hudson.Launcher$RemoteLauncher$ProcImpl.isAlive(Launcher.java:930)
	at hudson.maven.ProcessCache$MavenProcess.call(ProcessCache.java:165)
	at hudson.maven.MavenModuleSetBuild$MavenModuleSetBuildExecution.doRun(MavenModuleSetBuild.java:813)
	at hudson.model.AbstractBuild$AbstractBuildExecution.run(AbstractBuild.java:586)
	at hudson.model.Run.execute(Run.java:1597)
	at hudson.maven.MavenModuleSetBuild.run(MavenModuleSetBuild.java:506)
	at hudson.model.ResourceController.execute(ResourceController.java:88)
	at hudson.model.Executor.run(Executor.java:247)
Caused by: java.io.IOException: Unexpected termination of the channel
	at hudson.remoting.SynchronousCommandTransport$ReaderThread.run(SynchronousCommandTransport.java:50)
Caused by: java.io.EOFException
	at java.io.ObjectInputStream$BlockDataInputStream.peekByte(ObjectInputStream.java:2596)
	at java.io.ObjectInputStream.readObject0(ObjectInputStream.java:1316)
	at java.io.ObjectInputStream.readObject(ObjectInputStream.java:370)
	at hudson.remoting.Command.readFrom(Command.java:92)
	at hudson.remoting.ClassicCommandTransport.read(ClassicCommandTransport.java:72)
	at hudson.remoting.SynchronousCommandTransport$ReaderThread.run(SynchronousCommandTransport.java:48)
FATAL: channel is already closed
hudson.remoting.ChannelClosedException: channel is already closed
	at hudson.remoting.Channel.send(Channel.java:516)
	at hudson.remoting.Request.call(Request.java:129)
	at hudson.remoting.Channel.call(Channel.java:714)
	at hudson.Launcher$RemoteLauncher.kill(Launcher.java:887)
	at hudson.model.AbstractBuild$AbstractBuildExecution.run(AbstractBuild.java:609)
	at hudson.model.Run.execute(Run.java:1597)
	at hudson.maven.MavenModuleSetBuild.run(MavenModuleSetBuild.java:506)
	at hudson.model.ResourceController.execute(ResourceController.java:88)
	at hudson.model.Executor.run(Executor.java:247)
Caused by: java.io.IOException: Unexpected termination of the channel
	at hudson.remoting.SynchronousCommandTransport$ReaderThread.run(SynchronousCommandTransport.java:50)
Caused by: java.io.EOFException
	at java.io.ObjectInputStream$BlockDataInputStream.peekByte(ObjectInputStream.java:2596)
	at java.io.ObjectInputStream.readObject0(ObjectInputStream.java:1316)
	at java.io.ObjectInputStream.readObject(ObjectInputStream.java:370)
	at hudson.remoting.Command.readFrom(Command.java:92)
	at hudson.remoting.ClassicCommandTransport.read(ClassicCommandTransport.java:72)
	at hudson.remoting.SynchronousCommandTransport$ReaderThread.run(SynchronousCommandTransport.java:48)

Mime
View raw message