activemq-dev mailing list archives

Site index · List index
Message view « Date » · « Thread »
Top « Date » · « Thread »
From Apache Jenkins Server <jenk...@builds.apache.org>
Subject Build failed in Jenkins: ActiveMQ-Java7 » ActiveMQ :: STOMP Protocol #281
Date Wed, 28 Aug 2013 20:44:10 GMT
See <https://builds.apache.org/job/ActiveMQ-Java7/org.apache.activemq$activemq-stomp/281/>

------------------------------------------
Aug 28, 2013 7:34:37 PM org.apache.maven.cli.event.ExecutionEventLogger projectStarted
INFO:                                                                         
Aug 28, 2013 7:34:37 PM org.apache.maven.cli.event.ExecutionEventLogger projectStarted
INFO: ------------------------------------------------------------------------
Aug 28, 2013 7:34:37 PM org.apache.maven.cli.event.ExecutionEventLogger projectStarted
INFO: Building ActiveMQ :: STOMP Protocol 5.9-SNAPSHOT
Aug 28, 2013 7:34:37 PM org.apache.maven.cli.event.ExecutionEventLogger projectStarted
INFO: ------------------------------------------------------------------------
Downloading: http://repo.maven.apache.org/maven2/org/eclipse/jetty/maven-jetty-plugin/7.6.9.v20130131/maven-jetty-plugin-7.6.9.v20130131.pom
[WARNING] The POM for org.eclipse.jetty:maven-jetty-plugin:jar:7.6.9.v20130131 is missing,
no dependency information available
[WARNING] Failed to retrieve plugin descriptor for org.eclipse.jetty:maven-jetty-plugin:7.6.9.v20130131:
Plugin org.eclipse.jetty:maven-jetty-plugin:7.6.9.v20130131 or one of its dependencies could
not be resolved: Failed to read artifact descriptor for org.eclipse.jetty:maven-jetty-plugin:jar:7.6.9.v20130131
Aug 28, 2013 7:34:37 PM org.apache.maven.cli.event.ExecutionEventLogger mojoStarted
INFO: 
Aug 28, 2013 7:34:37 PM org.apache.maven.cli.event.ExecutionEventLogger mojoStarted
INFO: --- maven-clean-plugin:2.5:clean (default-clean) @ activemq-stomp ---
Aug 28, 2013 7:34:37 PM org.apache.maven.cli.event.ExecutionEventLogger mojoStarted
INFO: 
Aug 28, 2013 7:34:37 PM org.apache.maven.cli.event.ExecutionEventLogger mojoStarted
INFO: --- maven-enforcer-plugin:1.0.1:enforce (default) @ activemq-stomp ---
Aug 28, 2013 7:34:37 PM org.apache.maven.cli.event.ExecutionEventLogger mojoStarted
INFO: 
Aug 28, 2013 7:34:37 PM org.apache.maven.cli.event.ExecutionEventLogger mojoStarted
INFO: --- maven-bundle-plugin:2.3.7:cleanVersions (cleanVersions) @ activemq-stomp ---
Aug 28, 2013 7:34:37 PM org.apache.maven.cli.event.ExecutionEventLogger mojoStarted
INFO: 
Aug 28, 2013 7:34:37 PM org.apache.maven.cli.event.ExecutionEventLogger mojoStarted
INFO: --- maven-remote-resources-plugin:1.3:process (default) @ activemq-stomp ---
Aug 28, 2013 7:34:37 PM org.apache.maven.cli.event.ExecutionEventLogger mojoStarted
INFO: 
Aug 28, 2013 7:34:37 PM org.apache.maven.cli.event.ExecutionEventLogger mojoStarted
INFO: --- maven-resources-plugin:2.5:resources (default-resources) @ activemq-stomp ---
[debug] execute contextualize
[INFO] Using 'UTF-8' encoding to copy filtered resources.
[INFO] Copying 14 resources
[INFO] skip non existing resourceDirectory <https://builds.apache.org/job/ActiveMQ-Java7/org.apache.activemq$activemq-stomp/ws/src/main/filtered-resources>
[INFO] Copying 3 resources
Aug 28, 2013 7:34:37 PM org.apache.maven.cli.event.ExecutionEventLogger mojoStarted
INFO: 
Aug 28, 2013 7:34:37 PM org.apache.maven.cli.event.ExecutionEventLogger mojoStarted
INFO: --- maven-compiler-plugin:2.5.1:compile (default-compile) @ activemq-stomp ---
[INFO] Compiling 24 source files to <https://builds.apache.org/job/ActiveMQ-Java7/org.apache.activemq$activemq-stomp/ws/target/classes>
Aug 28, 2013 7:34:38 PM org.apache.maven.cli.event.ExecutionEventLogger mojoStarted
INFO: 
Aug 28, 2013 7:34:38 PM org.apache.maven.cli.event.ExecutionEventLogger mojoStarted
INFO: --- maven-resources-plugin:2.5:testResources (default-testResources) @ activemq-stomp
---
[debug] execute contextualize
[INFO] Using 'UTF-8' encoding to copy filtered resources.
[INFO] Copying 6 resources
[INFO] Copying 3 resources
Aug 28, 2013 7:34:38 PM org.apache.maven.cli.event.ExecutionEventLogger mojoStarted
INFO: 
Aug 28, 2013 7:34:38 PM org.apache.maven.cli.event.ExecutionEventLogger mojoStarted
INFO: --- maven-compiler-plugin:2.5.1:testCompile (default-testCompile) @ activemq-stomp ---
[INFO] Compiling 30 source files to <https://builds.apache.org/job/ActiveMQ-Java7/org.apache.activemq$activemq-stomp/ws/target/test-classes>
Aug 28, 2013 7:34:38 PM org.apache.maven.cli.event.ExecutionEventLogger mojoStarted
INFO: 
Aug 28, 2013 7:34:38 PM org.apache.maven.cli.event.ExecutionEventLogger mojoStarted
INFO: --- maven-surefire-plugin:2.10:test (default-test) @ activemq-stomp ---
[INFO] Surefire report directory: <https://builds.apache.org/job/ActiveMQ-Java7/org.apache.activemq$activemq-stomp/ws/target/surefire-reports>

-------------------------------------------------------
 T E S T S
-------------------------------------------------------

-------------------------------------------------------
 T E S T S
-------------------------------------------------------
Running org.apache.activemq.transport.stomp.ConnectTest
Tests run: 3, Failures: 0, Errors: 0, Skipped: 0, Time elapsed: 35.68 sec
Running org.apache.activemq.transport.stomp.Stomp11NIOSSLTest
Tests run: 27, Failures: 0, Errors: 0, Skipped: 0, Time elapsed: 111.004 sec
Running org.apache.activemq.transport.stomp.Stomp11NIOTest
Tests run: 27, Failures: 0, Errors: 0, Skipped: 0, Time elapsed: 108.504 sec
Running org.apache.activemq.transport.stomp.Stomp11SslAuthTest
Tests run: 27, Failures: 0, Errors: 0, Skipped: 0, Time elapsed: 146.072 sec
Running org.apache.activemq.transport.stomp.Stomp11Test
Tests run: 27, Failures: 0, Errors: 0, Skipped: 0, Time elapsed: 110.496 sec
Running org.apache.activemq.transport.stomp.Stomp12NIOSSLTest
Tests run: 5, Failures: 0, Errors: 0, Skipped: 0, Time elapsed: 14.481 sec
Running org.apache.activemq.transport.stomp.Stomp12NIOTest
Tests run: 5, Failures: 0, Errors: 0, Skipped: 0, Time elapsed: 13.998 sec
Running org.apache.activemq.transport.stomp.Stomp12SslAuthTest
Tests run: 5, Failures: 0, Errors: 0, Skipped: 0, Time elapsed: 22.053 sec
Running org.apache.activemq.transport.stomp.Stomp12Test
Tests run: 5, Failures: 0, Errors: 0, Skipped: 0, Time elapsed: 14.014 sec
Running org.apache.activemq.transport.stomp.StompAdvisoryTest
Tests run: 7, Failures: 0, Errors: 0, Skipped: 0, Time elapsed: 35.43 sec
Running org.apache.activemq.transport.stomp.StompFrameTest
Tests run: 1, Failures: 0, Errors: 0, Skipped: 0, Time elapsed: 0.071 sec
Running org.apache.activemq.transport.stomp.StompLoadTest
Tests run: 1, Failures: 0, Errors: 0, Skipped: 0, Time elapsed: 75.638 sec
Running org.apache.activemq.transport.stomp.StompMissingMessageTest
Tests run: 2, Failures: 0, Errors: 0, Skipped: 0, Time elapsed: 51.338 sec
Running org.apache.activemq.transport.stomp.StompNIOLoadTest
Tests run: 1, Failures: 0, Errors: 0, Skipped: 0, Time elapsed: 73.59 sec
Running org.apache.activemq.transport.stomp.StompNIOSSLLoadTest
Tests run: 1, Failures: 0, Errors: 0, Skipped: 0, Time elapsed: 74.015 sec
Running org.apache.activemq.transport.stomp.StompNIOSSLTest
Tests run: 73, Failures: 4, Errors: 0, Skipped: 0, Time elapsed: 419.626 sec <<<
FAILURE!
Running org.apache.activemq.transport.stomp.StompNIOTest
Tests run: 73, Failures: 4, Errors: 0, Skipped: 0, Time elapsed: 204.519 sec <<<
FAILURE!
Running org.apache.activemq.transport.stomp.StompPrefetchTest
Tests run: 4, Failures: 0, Errors: 0, Skipped: 0, Time elapsed: 21.247 sec
Running org.apache.activemq.transport.stomp.StompSSLLoadTest
Tests run: 1, Failures: 0, Errors: 0, Skipped: 0, Time elapsed: 74.07 sec
Running org.apache.activemq.transport.stomp.StompSslAuthTest
Tests run: 73, Failures: 4, Errors: 0, Skipped: 0, Time elapsed: 403.039 sec <<<
FAILURE!
Running org.apache.activemq.transport.stomp.StompSslTest
Tests run: 73, Failures: 4, Errors: 0, Skipped: 0, Time elapsed: 306.284 sec <<<
FAILURE!
Running org.apache.activemq.transport.stomp.StompSubscriptionRemoveTest
Tests run: 1, Failures: 0, Errors: 0, Skipped: 0, Time elapsed: 9.11 sec
Running org.apache.activemq.transport.stomp.StompTelnetTest
Tests run: 2, Failures: 0, Errors: 0, Skipped: 0, Time elapsed: 4.983 sec
Running org.apache.activemq.transport.stomp.StompTest
Tests run: 73, Failures: 4, Errors: 0, Skipped: 0, Time elapsed: 202.572 sec <<<
FAILURE!
Running org.apache.activemq.transport.stomp.StompTimeStampingBrokerPluginTest
Tests run: 1, Failures: 0, Errors: 0, Skipped: 0, Time elapsed: 16.651 sec
Running org.apache.activemq.transport.stomp.StompVirtualTopicTest
Tests run: 1, Failures: 0, Errors: 0, Skipped: 0, Time elapsed: 48.004 sec

Results :

Failed tests:   testSendMessageWithDelay(org.apache.activemq.transport.stomp.StompNIOSSLTest)
  testTempDestination(org.apache.activemq.transport.stomp.StompNIOSSLTest): expected:<[Hello
World]> but was:<[java.lang.SecurityException: User system is not authorized to read
from: temp-queue://ID:janus-52546-1377719373208-4:46:1
  testReplyToAcrossConnections(org.apache.activemq.transport.stomp.StompNIOSSLTest): Receipt
Frame: ERROR
  testReplyToDestinationNaming(org.apache.activemq.transport.stomp.StompNIOSSLTest)
  testSendMessageWithDelay(org.apache.activemq.transport.stomp.StompNIOTest)
  testTempDestination(org.apache.activemq.transport.stomp.StompNIOTest): expected:<[Hello
World]> but was:<[java.lang.SecurityException: User system is not authorized to read
from: temp-queue://ID:janus-54699-1377719793307-4:46:1
  testReplyToAcrossConnections(org.apache.activemq.transport.stomp.StompNIOTest): Receipt
Frame: ERROR
  testReplyToDestinationNaming(org.apache.activemq.transport.stomp.StompNIOTest)
  testSendMessageWithDelay(org.apache.activemq.transport.stomp.StompSslAuthTest)
  testTempDestination(org.apache.activemq.transport.stomp.StompSslAuthTest): expected:<[Hello
World]> but was:<[java.lang.SecurityException: User CN=localhost, OU=activemq.org, O=activemq.org,
L=LA, ST=CA, C=US is not authorized to read from: temp-queue://ID:janus-35545-1377720094898-2:46:1
  testReplyToAcrossConnections(org.apache.activemq.transport.stomp.StompSslAuthTest): Receipt
Frame: ERROR
  testReplyToDestinationNaming(org.apache.activemq.transport.stomp.StompSslAuthTest)
  testSendMessageWithDelay(org.apache.activemq.transport.stomp.StompSslTest)
  testTempDestination(org.apache.activemq.transport.stomp.StompSslTest): expected:<[Hello
World]> but was:<[java.lang.SecurityException: User system is not authorized to read
from: temp-queue://ID:janus-33318-1377720498521-4:46:1
  testReplyToAcrossConnections(org.apache.activemq.transport.stomp.StompSslTest): Receipt
Frame: ERROR
  testReplyToDestinationNaming(org.apache.activemq.transport.stomp.StompSslTest)
  testSendMessageWithDelay(org.apache.activemq.transport.stomp.StompTest)
  testTempDestination(org.apache.activemq.transport.stomp.StompTest): expected:<[Hello
World]> but was:<[java.lang.SecurityException: User system is not authorized to read
from: temp-queue://ID:janus-52876-1377720820148-4:46:1
  testReplyToAcrossConnections(org.apache.activemq.transport.stomp.StompTest): Receipt Frame:
ERROR
  testReplyToDestinationNaming(org.apache.activemq.transport.stomp.StompTest)

Tests run: 519, Failures: 20, Errors: 0, Skipped: 0

[ERROR] There are test failures.

Please refer to <https://builds.apache.org/job/ActiveMQ-Java7/org.apache.activemq$activemq-stomp/ws/target/surefire-reports>
for the individual test results.

Mime
View raw message