activemq-dev mailing list archives

Site index · List index
Message view « Date » · « Thread »
Top « Date » · « Thread »
From Apache Jenkins Server <jenk...@builds.apache.org>
Subject Build failed in Jenkins: ActiveMQ » ActiveMQ :: MQTT Protocol #1351
Date Fri, 02 Aug 2013 13:19:58 GMT
See <https://builds.apache.org/job/ActiveMQ/org.apache.activemq$activemq-mqtt/1351/>

------------------------------------------
[12:59:29] Aug 2, 2013 12:59:29 PM org.apache.maven.cli.event.ExecutionEventLogger projectStarted
INFO:                                                                         
Aug 2, 2013 12:59:29 PM org.apache.maven.cli.event.ExecutionEventLogger projectStarted
INFO: ------------------------------------------------------------------------
Aug 2, 2013 12:59:29 PM org.apache.maven.cli.event.ExecutionEventLogger projectStarted
INFO: Building ActiveMQ :: MQTT Protocol 5.9-SNAPSHOT
Aug 2, 2013 12:59:29 PM org.apache.maven.cli.event.ExecutionEventLogger projectStarted
INFO: ------------------------------------------------------------------------
Aug 2, 2013 12:59:29 PM org.apache.maven.cli.event.ExecutionEventLogger mojoStarted
INFO: 
Aug 2, 2013 12:59:29 PM org.apache.maven.cli.event.ExecutionEventLogger mojoStarted
INFO: --- maven-clean-plugin:2.5:clean (default-clean) @ activemq-mqtt ---
Aug 2, 2013 12:59:29 PM org.apache.maven.cli.event.ExecutionEventLogger mojoStarted
INFO: 
Aug 2, 2013 12:59:29 PM org.apache.maven.cli.event.ExecutionEventLogger mojoStarted
INFO: --- maven-enforcer-plugin:1.0.1:enforce (default) @ activemq-mqtt ---
Aug 2, 2013 12:59:29 PM org.apache.maven.cli.event.ExecutionEventLogger mojoStarted
INFO: 
Aug 2, 2013 12:59:29 PM org.apache.maven.cli.event.ExecutionEventLogger mojoStarted
INFO: --- maven-consolets-plugin:1.30:install (default) @ activemq-mqtt ---
Aug 2, 2013 12:59:29 PM org.apache.maven.cli.event.ExecutionEventLogger mojoStarted
INFO: 
Aug 2, 2013 12:59:29 PM org.apache.maven.cli.event.ExecutionEventLogger mojoStarted
INFO: --- maven-bundle-plugin:2.3.7:cleanVersions (cleanVersions) @ activemq-mqtt ---
Aug 2, 2013 12:59:29 PM org.apache.maven.cli.event.ExecutionEventLogger mojoStarted
INFO: 
Aug 2, 2013 12:59:29 PM org.apache.maven.cli.event.ExecutionEventLogger mojoStarted
INFO: --- activemq-protobuf:1.1:compile (default) @ activemq-mqtt ---
[WARNING] No proto files found in directory: <https://builds.apache.org/job/ActiveMQ/org.apache.activemq$activemq-mqtt/ws/src/main/proto>
Aug 2, 2013 12:59:29 PM org.apache.maven.cli.event.ExecutionEventLogger mojoStarted
INFO: 
Aug 2, 2013 12:59:29 PM org.apache.maven.cli.event.ExecutionEventLogger mojoStarted
INFO: --- maven-remote-resources-plugin:1.3:process (default) @ activemq-mqtt ---
Aug 2, 2013 12:59:30 PM org.apache.maven.cli.event.ExecutionEventLogger mojoStarted
INFO: 
Aug 2, 2013 12:59:30 PM org.apache.maven.cli.event.ExecutionEventLogger mojoStarted
INFO: --- maven-resources-plugin:2.5:resources (default-resources) @ activemq-mqtt ---
[12:59:30] [debug] execute contextualize
[INFO] Using 'UTF-8' encoding to copy filtered resources.
[INFO] Copying 5 resources
[INFO] skip non existing resourceDirectory <https://builds.apache.org/job/ActiveMQ/org.apache.activemq$activemq-mqtt/ws/src/main/filtered-resources>
[INFO] Copying 3 resources
Aug 2, 2013 12:59:30 PM org.apache.maven.cli.event.ExecutionEventLogger mojoStarted
INFO: 
Aug 2, 2013 12:59:30 PM org.apache.maven.cli.event.ExecutionEventLogger mojoStarted
INFO: --- maven-compiler-plugin:2.5.1:compile (default-compile) @ activemq-mqtt ---
[INFO] Compiling 16 source files to <https://builds.apache.org/job/ActiveMQ/org.apache.activemq$activemq-mqtt/ws/target/classes>
Aug 2, 2013 12:59:30 PM org.apache.maven.cli.event.ExecutionEventLogger mojoStarted
INFO: 
Aug 2, 2013 12:59:30 PM org.apache.maven.cli.event.ExecutionEventLogger mojoStarted
INFO: --- maven-resources-plugin:2.5:testResources (default-testResources) @ activemq-mqtt
---
[12:59:30] [debug] execute contextualize
[INFO] Using 'UTF-8' encoding to copy filtered resources.
[INFO] Copying 3 resources
[INFO] Copying 3 resources
Aug 2, 2013 12:59:30 PM org.apache.maven.cli.event.ExecutionEventLogger mojoStarted
INFO: 
Aug 2, 2013 12:59:30 PM org.apache.maven.cli.event.ExecutionEventLogger mojoStarted
INFO: --- maven-compiler-plugin:2.5.1:testCompile (default-testCompile) @ activemq-mqtt ---
[INFO] Compiling 6 source files to <https://builds.apache.org/job/ActiveMQ/org.apache.activemq$activemq-mqtt/ws/target/test-classes>
Aug 2, 2013 12:59:30 PM org.apache.maven.cli.event.ExecutionEventLogger mojoStarted
INFO: 
Aug 2, 2013 12:59:30 PM org.apache.maven.cli.event.ExecutionEventLogger mojoStarted
INFO: --- maven-surefire-plugin:2.10:test (default-test) @ activemq-mqtt ---
[INFO] Surefire report directory: <https://builds.apache.org/job/ActiveMQ/org.apache.activemq$activemq-mqtt/ws/target/surefire-reports>
[12:59:30] 
[12:59:30] -------------------------------------------------------
[12:59:30]  T E S T S
[12:59:30] -------------------------------------------------------
[12:59:30] 
[12:59:30] -------------------------------------------------------
[12:59:30]  T E S T S
[12:59:30] -------------------------------------------------------
[12:59:30] Running org.apache.activemq.transport.mqtt.MQTTNioTest
[13:02:04] Tests run: 18, Failures: 0, Errors: 1, Skipped: 0, Time elapsed: 153.432 sec <<<
FAILURE!
[13:02:04] Running org.apache.activemq.transport.mqtt.MQTTSSLTest
[13:04:48] Tests run: 17, Failures: 0, Errors: 1, Skipped: 0, Time elapsed: 163.298 sec <<<
FAILURE!
[13:04:48] Running org.apache.activemq.transport.mqtt.MQTTTest
[13:07:19] Tests run: 17, Failures: 0, Errors: 1, Skipped: 0, Time elapsed: 150.493 sec <<<
FAILURE!
[13:07:19] 
[13:07:19] Results :
[13:07:19] 
[13:07:19] Tests in error: 
[13:07:19]   testPingOnMQTTNIO(org.apache.activemq.transport.mqtt.MQTTNioTest): The client
id MUST be configured when clean session is set to false
[13:07:19]   testReceiveMessageSentWhileOffline(org.apache.activemq.transport.mqtt.MQTTSSLTest):
Command from server contained an invalid message id: 1
[13:07:19]   testReceiveMessageSentWhileOffline(org.apache.activemq.transport.mqtt.MQTTTest):
Command from server contained an invalid message id: 1
[13:07:19] 
[13:07:19] Tests run: 52, Failures: 0, Errors: 3, Skipped: 0
[13:07:19] 
[ERROR] There are test failures.

Please refer to <https://builds.apache.org/job/ActiveMQ/org.apache.activemq$activemq-mqtt/ws/target/surefire-reports>
for the individual test results.
[13:07:19] 

Mime
View raw message