activemq-dev mailing list archives

Site index · List index
Message view « Date » · « Thread »
Top « Date » · « Thread »
From Apache Jenkins Server <jenk...@builds.apache.org>
Subject Build failed in Jenkins: ActiveMQ #1370
Date Thu, 29 Aug 2013 02:04:54 GMT
See <https://builds.apache.org/job/ActiveMQ/1370/changes>

Changes:

[gtully] https://issues.apache.org/jira/browse/AMQ-4682 - allow jaxb to validate with spring
bean references - still need to pull schema from the classpath which needs a fix

[tabish] Fix failing test case, things are more lazily loaded now so we must actually invoke
the route before the URI will get used and the exception fired.

[gtully] https://issues.apache.org/jira/browse/AMQ-4682 - include feature in assembly and
osgi uber jar

[tabish] fix for: https://issues.apache.org/jira/browse/AMQ-4188

Adds dstat command

[chirino] Adding a LevelDB version of the RedeliveryRestartTest. Implemented redelivery tracking
in the leveldb store.

[gtully] https://issues.apache.org/jira/browse/AMQ-4482 - implement and test setPercentOfJvmHeap
attribute on memory usage

[rajdavies] Fix for https://issues.apache.org/jira/browse/AMQ-4697

[rajdavies] Added SizeStatisicsImpl for https://issues.apache.org/jira/browse/AMQ-4697

[gtully] https://issues.apache.org/jira/browse/AMQ-4196 - extend limit on test for slower
hardware

------------------------------------------
[...truncated 6413 lines...]
INFO: 
Aug 29, 2013 1:15:42 AM org.apache.maven.cli.event.ExecutionEventLogger mojoStarted
INFO: --- maven-resources-plugin:2.5:testResources (default-testResources) @ activemq-stomp
---
[01:15:42] [debug] execute contextualize
[INFO] Using 'UTF-8' encoding to copy filtered resources.
[INFO] Copying 6 resources
[INFO] Copying 3 resources
Aug 29, 2013 1:15:42 AM org.apache.maven.cli.event.ExecutionEventLogger mojoStarted
INFO: 
Aug 29, 2013 1:15:42 AM org.apache.maven.cli.event.ExecutionEventLogger mojoStarted
INFO: --- maven-compiler-plugin:2.5.1:testCompile (default-testCompile) @ activemq-stomp ---
[INFO] Compiling 30 source files to <https://builds.apache.org/job/ActiveMQ/ws/activemq-stomp/target/test-classes>
Aug 29, 2013 1:15:42 AM org.apache.maven.cli.event.ExecutionEventLogger mojoStarted
INFO: 
Aug 29, 2013 1:15:42 AM org.apache.maven.cli.event.ExecutionEventLogger mojoStarted
INFO: --- maven-surefire-plugin:2.10:test (default-test) @ activemq-stomp ---
[INFO] Surefire report directory: <https://builds.apache.org/job/ActiveMQ/ws/activemq-stomp/target/surefire-reports>
[01:15:42] 
[01:15:42] -------------------------------------------------------
[01:15:42]  T E S T S
[01:15:42] -------------------------------------------------------
[01:15:42] 
[01:15:42] -------------------------------------------------------
[01:15:42]  T E S T S
[01:15:42] -------------------------------------------------------
[01:15:42] Running org.apache.activemq.transport.stomp.ConnectTest
[01:16:18] Tests run: 3, Failures: 0, Errors: 0, Skipped: 0, Time elapsed: 35.587 sec
[01:16:18] Running org.apache.activemq.transport.stomp.Stomp11NIOSSLTest
[01:18:09] Tests run: 27, Failures: 0, Errors: 0, Skipped: 0, Time elapsed: 110.664 sec
[01:18:10] Running org.apache.activemq.transport.stomp.Stomp11NIOTest
[01:20:00] Tests run: 27, Failures: 0, Errors: 0, Skipped: 0, Time elapsed: 110.372 sec
[01:20:00] Running org.apache.activemq.transport.stomp.Stomp11SslAuthTest
[01:22:30] Tests run: 27, Failures: 0, Errors: 0, Skipped: 0, Time elapsed: 149.886 sec
[01:22:31] Running org.apache.activemq.transport.stomp.Stomp11Test
[01:24:19] Tests run: 27, Failures: 0, Errors: 0, Skipped: 0, Time elapsed: 108.313 sec
[01:24:20] Running org.apache.activemq.transport.stomp.Stomp12NIOSSLTest
[01:24:34] Tests run: 5, Failures: 0, Errors: 0, Skipped: 0, Time elapsed: 14.363 sec
[01:24:34] Running org.apache.activemq.transport.stomp.Stomp12NIOTest
[01:24:48] Tests run: 5, Failures: 0, Errors: 0, Skipped: 0, Time elapsed: 13.938 sec
[01:24:49] Running org.apache.activemq.transport.stomp.Stomp12SslAuthTest
[01:25:10] Tests run: 5, Failures: 0, Errors: 0, Skipped: 0, Time elapsed: 21.253 sec
[01:25:11] Running org.apache.activemq.transport.stomp.Stomp12Test
[01:25:24] Tests run: 5, Failures: 0, Errors: 0, Skipped: 0, Time elapsed: 13.915 sec
[01:25:25] Running org.apache.activemq.transport.stomp.StompAdvisoryTest
[01:26:03] Tests run: 7, Failures: 0, Errors: 0, Skipped: 0, Time elapsed: 37.89 sec
[01:26:03] Running org.apache.activemq.transport.stomp.StompFrameTest
[01:26:03] Tests run: 1, Failures: 0, Errors: 0, Skipped: 0, Time elapsed: 0.063 sec
[01:26:04] Running org.apache.activemq.transport.stomp.StompLoadTest
[01:27:19] Tests run: 1, Failures: 0, Errors: 0, Skipped: 0, Time elapsed: 75.338 sec
[01:27:20] Running org.apache.activemq.transport.stomp.StompMissingMessageTest
[01:28:09] Tests run: 2, Failures: 0, Errors: 0, Skipped: 0, Time elapsed: 49.913 sec
[01:28:10] Running org.apache.activemq.transport.stomp.StompNIOLoadTest
[01:29:23] Tests run: 1, Failures: 0, Errors: 0, Skipped: 0, Time elapsed: 73.315 sec
[01:29:24] Running org.apache.activemq.transport.stomp.StompNIOSSLLoadTest
[01:30:38] Tests run: 1, Failures: 0, Errors: 0, Skipped: 0, Time elapsed: 73.806 sec
[01:30:38] Running org.apache.activemq.transport.stomp.StompNIOSSLTest
[01:37:32] Tests run: 73, Failures: 4, Errors: 0, Skipped: 0, Time elapsed: 414.359 sec <<<
FAILURE!
[01:37:33] Running org.apache.activemq.transport.stomp.StompNIOTest
[01:40:53] Tests run: 73, Failures: 4, Errors: 0, Skipped: 0, Time elapsed: 199.967 sec <<<
FAILURE!
[01:40:53] Running org.apache.activemq.transport.stomp.StompPrefetchTest
[01:41:15] Tests run: 4, Failures: 0, Errors: 0, Skipped: 0, Time elapsed: 21.153 sec
[01:41:15] Running org.apache.activemq.transport.stomp.StompSSLLoadTest
[01:42:37] Tests run: 1, Failures: 0, Errors: 0, Skipped: 0, Time elapsed: 81.561 sec
[01:42:37] Running org.apache.activemq.transport.stomp.StompSslAuthTest
[01:49:04] Tests run: 73, Failures: 4, Errors: 0, Skipped: 0, Time elapsed: 386.636 sec <<<
FAILURE!
[01:49:04] Running org.apache.activemq.transport.stomp.StompSslTest
[01:53:40] Tests run: 73, Failures: 4, Errors: 0, Skipped: 0, Time elapsed: 275.364 sec <<<
FAILURE!
[01:53:40] Running org.apache.activemq.transport.stomp.StompSubscriptionRemoveTest
[01:54:00] Tests run: 1, Failures: 0, Errors: 0, Skipped: 0, Time elapsed: 19.582 sec
[01:54:00] Running org.apache.activemq.transport.stomp.StompTelnetTest
[01:54:05] Tests run: 2, Failures: 0, Errors: 0, Skipped: 0, Time elapsed: 4.897 sec
[01:54:05] Running org.apache.activemq.transport.stomp.StompTest
[01:57:25] Tests run: 73, Failures: 4, Errors: 0, Skipped: 0, Time elapsed: 199.878 sec <<<
FAILURE!
[01:57:26] Running org.apache.activemq.transport.stomp.StompTimeStampingBrokerPluginTest
[01:57:42] Tests run: 1, Failures: 0, Errors: 0, Skipped: 0, Time elapsed: 16.576 sec
[01:57:43] Running org.apache.activemq.transport.stomp.StompVirtualTopicTest
[01:58:33] Tests run: 1, Failures: 0, Errors: 0, Skipped: 0, Time elapsed: 49.732 sec
[01:58:33] 
[01:58:33] Results :
[01:58:33] 
[01:58:33] Failed tests: [01:58:33]   testSendMessageWithDelay(org.apache.activemq.transport.stomp.StompNIOSSLTest)
[01:58:33]   testTempDestination(org.apache.activemq.transport.stomp.StompNIOSSLTest): expected:<[Hello
World]> but was:<[java.lang.SecurityException: User system is not authorized to read
from: temp-queue://ID:minerva-51048-1377739843387-4:46:1
[01:58:33]   testReplyToAcrossConnections(org.apache.activemq.transport.stomp.StompNIOSSLTest):
Receipt Frame: ERROR
[01:58:33]   testReplyToDestinationNaming(org.apache.activemq.transport.stomp.StompNIOSSLTest)
[01:58:33]   testSendMessageWithDelay(org.apache.activemq.transport.stomp.StompNIOTest)
[01:58:33]   testTempDestination(org.apache.activemq.transport.stomp.StompNIOTest): expected:<[Hello
World]> but was:<[java.lang.SecurityException: User system is not authorized to read
from: temp-queue://ID:minerva-49948-1377740254019-4:46:1
[01:58:33]   testReplyToAcrossConnections(org.apache.activemq.transport.stomp.StompNIOTest):
Receipt Frame: ERROR
[01:58:33]   testReplyToDestinationNaming(org.apache.activemq.transport.stomp.StompNIOTest)
[01:58:33]   testSendMessageWithDelay(org.apache.activemq.transport.stomp.StompSslAuthTest)
[01:58:33]   testTempDestination(org.apache.activemq.transport.stomp.StompSslAuthTest): expected:<[Hello
World]> but was:<[java.lang.SecurityException: User CN=localhost, OU=activemq.org, O=activemq.org,
L=LA, ST=CA, C=US is not authorized to read from: temp-queue://ID:minerva-36923-1377740558457-2:46:1
[01:58:33]   testReplyToAcrossConnections(org.apache.activemq.transport.stomp.StompSslAuthTest):
Receipt Frame: ERROR
[01:58:33]   testReplyToDestinationNaming(org.apache.activemq.transport.stomp.StompSslAuthTest)
[01:58:33]   testSendMessageWithDelay(org.apache.activemq.transport.stomp.StompSslTest)
[01:58:33]   testTempDestination(org.apache.activemq.transport.stomp.StompSslTest): expected:<[Hello
World]> but was:<[java.lang.SecurityException: User system is not authorized to read
from: temp-queue://ID:minerva-33443-1377740945573-4:46:1
[01:58:33]   testReplyToAcrossConnections(org.apache.activemq.transport.stomp.StompSslTest):
Receipt Frame: ERROR
[01:58:33]   testReplyToDestinationNaming(org.apache.activemq.transport.stomp.StompSslTest)
[01:58:33]   testSendMessageWithDelay(org.apache.activemq.transport.stomp.StompTest)
[01:58:33]   testTempDestination(org.apache.activemq.transport.stomp.StompTest): expected:<[Hello
World]> but was:<[java.lang.SecurityException: User system is not authorized to read
from: temp-queue://ID:minerva-42732-1377741246530-4:46:1
[01:58:33]   testReplyToAcrossConnections(org.apache.activemq.transport.stomp.StompTest):
Receipt Frame: ERROR
[01:58:33]   testReplyToDestinationNaming(org.apache.activemq.transport.stomp.StompTest)
[01:58:33] 
[01:58:33] Tests run: 519, Failures: 20, Errors: 0, Skipped: 0
[01:58:33] 
[ERROR] There are test failures.

Please refer to <https://builds.apache.org/job/ActiveMQ/ws/activemq-stomp/target/surefire-reports>
for the individual test results.
[JENKINS] Recording test results
Aug 29, 2013 1:58:41 AM org.apache.maven.cli.event.ExecutionEventLogger mojoStarted
INFO: 
Aug 29, 2013 1:58:41 AM org.apache.maven.cli.event.ExecutionEventLogger mojoStarted
INFO: --- maven-jar-plugin:2.4:jar (default-jar) @ activemq-stomp ---
[INFO] Building jar: <https://builds.apache.org/job/ActiveMQ/ws/activemq-stomp/target/activemq-stomp-5.9-SNAPSHOT.jar>
Aug 29, 2013 1:58:41 AM org.apache.maven.cli.event.ExecutionEventLogger mojoStarted
INFO: 
Aug 29, 2013 1:58:41 AM org.apache.maven.cli.event.ExecutionEventLogger mojoStarted
INFO: --- maven-site-plugin:3.1:attach-descriptor (attach-descriptor) @ activemq-stomp ---
Aug 29, 2013 1:58:41 AM org.apache.maven.cli.event.ExecutionEventLogger mojoStarted
INFO: 
Aug 29, 2013 1:58:41 AM org.apache.maven.cli.event.ExecutionEventLogger mojoStarted
INFO: --- ianal-maven-plugin:1.0-alpha-1:verify-legal-files (default) @ activemq-stomp ---
[INFO] Checking legal files in: activemq-stomp-5.9-SNAPSHOT.jar
Aug 29, 2013 1:58:41 AM org.apache.maven.cli.event.ExecutionEventLogger mojoStarted
INFO: 
Aug 29, 2013 1:58:41 AM org.apache.maven.cli.event.ExecutionEventLogger mojoStarted
INFO: --- maven-install-plugin:2.3.1:install (default-install) @ activemq-stomp ---
[INFO] Installing <https://builds.apache.org/job/ActiveMQ/ws/activemq-stomp/target/activemq-stomp-5.9-SNAPSHOT.jar>
to /home/jenkins/jenkins-slave/maven-repositories/0/org/apache/activemq/activemq-stomp/5.9-SNAPSHOT/activemq-stomp-5.9-SNAPSHOT.jar
[INFO] Installing <https://builds.apache.org/job/ActiveMQ/ws/activemq-stomp/pom.xml>
to /home/jenkins/jenkins-slave/maven-repositories/0/org/apache/activemq/activemq-stomp/5.9-SNAPSHOT/activemq-stomp-5.9-SNAPSHOT.pom
[01:58:42] [01:58:42] Aug 29, 2013 1:58:48 AM org.apache.maven.cli.event.ExecutionEventLogger
projectStarted
INFO:                                                                         
Aug 29, 2013 1:58:48 AM org.apache.maven.cli.event.ExecutionEventLogger projectStarted
INFO: ------------------------------------------------------------------------
Aug 29, 2013 1:58:48 AM org.apache.maven.cli.event.ExecutionEventLogger projectStarted
INFO: Building ActiveMQ :: MQTT Protocol 5.9-SNAPSHOT
Aug 29, 2013 1:58:48 AM org.apache.maven.cli.event.ExecutionEventLogger projectStarted
INFO: ------------------------------------------------------------------------
Aug 29, 2013 1:58:48 AM org.apache.maven.cli.event.ExecutionEventLogger mojoStarted
INFO: 
Aug 29, 2013 1:58:48 AM org.apache.maven.cli.event.ExecutionEventLogger mojoStarted
INFO: --- maven-clean-plugin:2.5:clean (default-clean) @ activemq-mqtt ---
Aug 29, 2013 1:58:48 AM org.apache.maven.cli.event.ExecutionEventLogger mojoStarted
INFO: 
Aug 29, 2013 1:58:48 AM org.apache.maven.cli.event.ExecutionEventLogger mojoStarted
INFO: --- maven-enforcer-plugin:1.0.1:enforce (default) @ activemq-mqtt ---
Aug 29, 2013 1:58:48 AM org.apache.maven.cli.event.ExecutionEventLogger mojoStarted
INFO: 
Aug 29, 2013 1:58:48 AM org.apache.maven.cli.event.ExecutionEventLogger mojoStarted
INFO: --- maven-consolets-plugin:1.30:install (default) @ activemq-mqtt ---
Aug 29, 2013 1:58:49 AM org.apache.maven.cli.event.ExecutionEventLogger mojoStarted
INFO: 
Aug 29, 2013 1:58:49 AM org.apache.maven.cli.event.ExecutionEventLogger mojoStarted
INFO: --- maven-bundle-plugin:2.3.7:cleanVersions (cleanVersions) @ activemq-mqtt ---
Aug 29, 2013 1:58:49 AM org.apache.maven.cli.event.ExecutionEventLogger mojoStarted
INFO: 
Aug 29, 2013 1:58:49 AM org.apache.maven.cli.event.ExecutionEventLogger mojoStarted
INFO: --- activemq-protobuf:1.1:compile (default) @ activemq-mqtt ---
[WARNING] No proto files found in directory: <https://builds.apache.org/job/ActiveMQ/ws/activemq-mqtt/src/main/proto>
Aug 29, 2013 1:58:49 AM org.apache.maven.cli.event.ExecutionEventLogger mojoStarted
INFO: 
Aug 29, 2013 1:58:49 AM org.apache.maven.cli.event.ExecutionEventLogger mojoStarted
INFO: --- maven-remote-resources-plugin:1.3:process (default) @ activemq-mqtt ---
Aug 29, 2013 1:58:49 AM org.apache.maven.cli.event.ExecutionEventLogger mojoStarted
INFO: 
Aug 29, 2013 1:58:49 AM org.apache.maven.cli.event.ExecutionEventLogger mojoStarted
INFO: --- maven-resources-plugin:2.5:resources (default-resources) @ activemq-mqtt ---
[01:58:49] [debug] execute contextualize
[INFO] Using 'UTF-8' encoding to copy filtered resources.
[INFO] Copying 5 resources
[INFO] skip non existing resourceDirectory <https://builds.apache.org/job/ActiveMQ/ws/activemq-mqtt/src/main/filtered-resources>
[INFO] Copying 3 resources
Aug 29, 2013 1:58:49 AM org.apache.maven.cli.event.ExecutionEventLogger mojoStarted
INFO: 
Aug 29, 2013 1:58:49 AM org.apache.maven.cli.event.ExecutionEventLogger mojoStarted
INFO: --- maven-compiler-plugin:2.5.1:compile (default-compile) @ activemq-mqtt ---
[INFO] Compiling 16 source files to <https://builds.apache.org/job/ActiveMQ/ws/activemq-mqtt/target/classes>
Aug 29, 2013 1:58:49 AM org.apache.maven.cli.event.ExecutionEventLogger mojoStarted
INFO: 
Aug 29, 2013 1:58:49 AM org.apache.maven.cli.event.ExecutionEventLogger mojoStarted
INFO: --- maven-resources-plugin:2.5:testResources (default-testResources) @ activemq-mqtt
---
[01:58:49] [debug] execute contextualize
[INFO] Using 'UTF-8' encoding to copy filtered resources.
[INFO] Copying 3 resources
[INFO] Copying 3 resources
Aug 29, 2013 1:58:49 AM org.apache.maven.cli.event.ExecutionEventLogger mojoStarted
INFO: 
Aug 29, 2013 1:58:49 AM org.apache.maven.cli.event.ExecutionEventLogger mojoStarted
INFO: --- maven-compiler-plugin:2.5.1:testCompile (default-testCompile) @ activemq-mqtt ---
[INFO] Compiling 6 source files to <https://builds.apache.org/job/ActiveMQ/ws/activemq-mqtt/target/test-classes>
Aug 29, 2013 1:58:49 AM org.apache.maven.cli.event.ExecutionEventLogger mojoStarted
INFO: 
Aug 29, 2013 1:58:49 AM org.apache.maven.cli.event.ExecutionEventLogger mojoStarted
INFO: --- maven-surefire-plugin:2.10:test (default-test) @ activemq-mqtt ---
[INFO] Surefire report directory: <https://builds.apache.org/job/ActiveMQ/ws/activemq-mqtt/target/surefire-reports>
[01:58:49] 
[01:58:49] -------------------------------------------------------
[01:58:49]  T E S T S
[01:58:49] -------------------------------------------------------
[01:58:49] 
[01:58:49] -------------------------------------------------------
[01:58:49]  T E S T S
[01:58:49] -------------------------------------------------------
Running org.apache.activemq.transport.mqtt.MQTTNioTest
[02:01:27] Tests run: 19, Failures: 0, Errors: 1, Skipped: 0, Time elapsed: 157.297 sec <<<
FAILURE!
[02:01:27] Running org.apache.activemq.transport.mqtt.MQTTSSLTest
[locks-and-latches] Releasing all the locks
[locks-and-latches] All the locks released
ERROR: Failed to parse POMs
hudson.remoting.ChannelClosedException: channel is already closed
	at hudson.remoting.Channel.send(Channel.java:516)
	at hudson.remoting.Request.call(Request.java:129)
	at hudson.remoting.Channel.call(Channel.java:714)
	at hudson.remoting.RemoteInvocationHandler.invoke(RemoteInvocationHandler.java:167)
	at com.sun.proxy.$Proxy44.isAlive(Unknown Source)
	at hudson.Launcher$RemoteLauncher$ProcImpl.isAlive(Launcher.java:930)
	at hudson.maven.ProcessCache$MavenProcess.call(ProcessCache.java:165)
	at hudson.maven.MavenModuleSetBuild$MavenModuleSetBuildExecution.doRun(MavenModuleSetBuild.java:813)
	at hudson.model.AbstractBuild$AbstractBuildExecution.run(AbstractBuild.java:567)
	at hudson.model.Run.execute(Run.java:1603)
	at hudson.maven.MavenModuleSetBuild.run(MavenModuleSetBuild.java:506)
	at hudson.model.ResourceController.execute(ResourceController.java:88)
	at hudson.model.Executor.run(Executor.java:247)
Caused by: java.io.IOException: Unexpected termination of the channel
	at hudson.remoting.SynchronousCommandTransport$ReaderThread.run(SynchronousCommandTransport.java:50)
Caused by: java.io.EOFException
	at java.io.ObjectInputStream$BlockDataInputStream.peekByte(ObjectInputStream.java:2596)
	at java.io.ObjectInputStream.readObject0(ObjectInputStream.java:1316)
	at java.io.ObjectInputStream.readObject(ObjectInputStream.java:370)
	at hudson.remoting.Command.readFrom(Command.java:92)
	at hudson.remoting.ClassicCommandTransport.read(ClassicCommandTransport.java:71)
	at hudson.remoting.SynchronousCommandTransport$ReaderThread.run(SynchronousCommandTransport.java:48)
FATAL: channel is already closed
hudson.remoting.ChannelClosedException: channel is already closed
	at hudson.remoting.Channel.send(Channel.java:516)
	at hudson.remoting.Request.call(Request.java:129)
	at hudson.remoting.Channel.call(Channel.java:714)
	at hudson.Launcher$RemoteLauncher.kill(Launcher.java:887)
	at hudson.model.AbstractBuild$AbstractBuildExecution.run(AbstractBuild.java:590)
	at hudson.model.Run.execute(Run.java:1603)
	at hudson.maven.MavenModuleSetBuild.run(MavenModuleSetBuild.java:506)
	at hudson.model.ResourceController.execute(ResourceController.java:88)
	at hudson.model.Executor.run(Executor.java:247)
Caused by: java.io.IOException: Unexpected termination of the channel
	at hudson.remoting.SynchronousCommandTransport$ReaderThread.run(SynchronousCommandTransport.java:50)
Caused by: java.io.EOFException
	at java.io.ObjectInputStream$BlockDataInputStream.peekByte(ObjectInputStream.java:2596)
	at java.io.ObjectInputStream.readObject0(ObjectInputStream.java:1316)
	at java.io.ObjectInputStream.readObject(ObjectInputStream.java:370)
	at hudson.remoting.Command.readFrom(Command.java:92)
	at hudson.remoting.ClassicCommandTransport.read(ClassicCommandTransport.java:71)
	at hudson.remoting.SynchronousCommandTransport$ReaderThread.run(SynchronousCommandTransport.java:48)

Mime
View raw message