activemq-dev mailing list archives

Site index · List index
Message view « Date » · « Thread »
Top « Date » · « Thread »
From Apache Jenkins Server <jenk...@builds.apache.org>
Subject Build failed in Jenkins: ActiveMQ-Java7 #269
Date Thu, 15 Aug 2013 00:21:47 GMT
See <https://builds.apache.org/job/ActiveMQ-Java7/269/changes>

Changes:

[tabish] fix: https://issues.apache.org/jira/browse/AMQ-4674

add transport options "?transport.hbGracePeriodMultiplier" which is used to add a user defined
grace period to the read check interval indicated by the connecting STOMP client.

[jstrachan] Updated to the latest hawtio release for AMQ-4594

[gtully] https://issues.apache.org/jira/browse/AMQ-4682 - implement runtimeConfigurationPlugin
that will track xml config and react to changes. simple verification via test that adds a
new network connector on the fly

------------------------------------------
[...truncated 6606 lines...]
	at sun.reflect.DelegatingMethodAccessorImpl.invoke(DelegatingMethodAccessorImpl.java:43)
	at java.lang.reflect.Method.invoke(Method.java:606)
	at org.codehaus.plexus.classworlds.launcher.Launcher.launchStandard(Launcher.java:329)
	at org.codehaus.plexus.classworlds.launcher.Launcher.launch(Launcher.java:239)
	at org.jvnet.hudson.maven3.agent.Maven3Main.launch(Maven3Main.java:178)
	at sun.reflect.NativeMethodAccessorImpl.invoke0(Native Method)
	at sun.reflect.NativeMethodAccessorImpl.invoke(NativeMethodAccessorImpl.java:57)
	at sun.reflect.DelegatingMethodAccessorImpl.invoke(DelegatingMethodAccessorImpl.java:43)
	at java.lang.reflect.Method.invoke(Method.java:606)
	at hudson.maven.Maven3Builder.call(Maven3Builder.java:130)
	at hudson.maven.Maven3Builder.call(Maven3Builder.java:67)
	at hudson.remoting.UserRequest.perform(UserRequest.java:118)
	at hudson.remoting.UserRequest.perform(UserRequest.java:48)
	at hudson.remoting.Request$2.run(Request.java:326)
	at hudson.remoting.InterceptingExecutorService$1.call(InterceptingExecutorService.java:72)
	at java.util.concurrent.FutureTask$Sync.innerRun(FutureTask.java:334)
	at java.util.concurrent.FutureTask.run(FutureTask.java:166)
	at java.util.concurrent.ThreadPoolExecutor.runWorker(ThreadPoolExecutor.java:1145)
	at java.util.concurrent.ThreadPoolExecutor$Worker.run(ThreadPoolExecutor.java:615)
	at java.lang.Thread.run(Thread.java:724)
Caused by: org.xmlpull.v1.XmlPullParserException: unexpected type (position:END_DOCUMENT null@3:1
in java.io.InputStreamReader@ca848c) 
	at org.kxml2.io.KXmlParser.exception(Unknown Source)
	at org.kxml2.io.KXmlParser.nextTag(Unknown Source)
	at org.apache.felix.bundlerepository.impl.PullParser.parseRepository(PullParser.java:43)
	at org.apache.felix.bundlerepository.impl.DataModelHelperImpl.repository(DataModelHelperImpl.java:147)
	at org.apache.felix.bundlerepository.impl.DataModelHelperImpl.repository(DataModelHelperImpl.java:118)
	at org.apache.felix.obrplugin.ObrUpdate.parseRepositoryXml(ObrUpdate.java:316)
	... 34 more
Aug 15, 2013 12:17:49 AM org.apache.maven.cli.event.ExecutionEventLogger mojoStarted
INFO: 
Aug 15, 2013 12:17:49 AM org.apache.maven.cli.event.ExecutionEventLogger mojoStarted
INFO: --- maven-enforcer-plugin:1.0.1:enforce (default) @ activemq-blueprint ---
Aug 15, 2013 12:17:49 AM org.apache.maven.cli.event.ExecutionEventLogger mojoStarted
INFO: 
Aug 15, 2013 12:17:49 AM org.apache.maven.cli.event.ExecutionEventLogger mojoStarted
INFO: --- maven-bundle-plugin:2.3.7:cleanVersions (cleanVersions) @ activemq-blueprint ---
Aug 15, 2013 12:17:49 AM hudson.maven.ExecutedMojo <init>
WARNING: Failed to getClass for org.apache.maven.plugin.source.SourceJarMojo
Aug 15, 2013 12:17:49 AM org.apache.maven.cli.event.ExecutionEventLogger mojoStarted
INFO: 
Aug 15, 2013 12:17:49 AM org.apache.maven.cli.event.ExecutionEventLogger mojoStarted
INFO: --- maven-source-plugin:2.1.2:jar (default-cli) @ activemq-blueprint ---
[INFO] META-INF already added, skipping
[INFO] META-INF/NOTICE already added, skipping
[INFO] META-INF/LICENSE already added, skipping
[INFO] META-INF/DEPENDENCIES already added, skipping
[INFO] Building jar: <https://builds.apache.org/job/ActiveMQ-Java7/ws/activemq-blueprint/target/activemq-blueprint-5.9-SNAPSHOT-sources.jar>
[INFO] META-INF already added, skipping
[INFO] META-INF/NOTICE already added, skipping
[INFO] META-INF/LICENSE already added, skipping
[INFO] META-INF/DEPENDENCIES already added, skipping
Aug 15, 2013 12:17:50 AM org.apache.maven.cli.event.ExecutionEventLogger projectSkipped
INFO:                                                                         
Aug 15, 2013 12:17:50 AM org.apache.maven.cli.event.ExecutionEventLogger projectSkipped
INFO: ------------------------------------------------------------------------
Aug 15, 2013 12:17:50 AM org.apache.maven.cli.event.ExecutionEventLogger projectSkipped
INFO: Skipping ActiveMQ :: Web Demo
Aug 15, 2013 12:17:50 AM org.apache.maven.cli.event.ExecutionEventLogger projectSkipped
INFO: This project has been banned from the build due to previous failures.
Aug 15, 2013 12:17:50 AM org.apache.maven.cli.event.ExecutionEventLogger projectSkipped
INFO: ------------------------------------------------------------------------
Aug 15, 2013 12:17:50 AM org.apache.maven.cli.event.ExecutionEventLogger projectSkipped
INFO:                                                                         
Aug 15, 2013 12:17:50 AM org.apache.maven.cli.event.ExecutionEventLogger projectSkipped
INFO: ------------------------------------------------------------------------
Aug 15, 2013 12:17:50 AM org.apache.maven.cli.event.ExecutionEventLogger projectSkipped
INFO: Skipping ActiveMQ :: Web Console
Aug 15, 2013 12:17:50 AM org.apache.maven.cli.event.ExecutionEventLogger projectSkipped
INFO: This project has been banned from the build due to previous failures.
Aug 15, 2013 12:17:50 AM org.apache.maven.cli.event.ExecutionEventLogger projectSkipped
INFO: ------------------------------------------------------------------------
Aug 15, 2013 12:17:50 AM org.apache.maven.cli.event.ExecutionEventLogger projectSkipped
INFO:                                                                         
Aug 15, 2013 12:17:50 AM org.apache.maven.cli.event.ExecutionEventLogger projectSkipped
INFO: ------------------------------------------------------------------------
Aug 15, 2013 12:17:50 AM org.apache.maven.cli.event.ExecutionEventLogger projectSkipped
INFO: Skipping ActiveMQ :: Karaf Integration Tests
Aug 15, 2013 12:17:50 AM org.apache.maven.cli.event.ExecutionEventLogger projectSkipped
INFO: This project has been banned from the build due to previous failures.
Aug 15, 2013 12:17:50 AM org.apache.maven.cli.event.ExecutionEventLogger projectSkipped
INFO: ------------------------------------------------------------------------
Aug 15, 2013 12:17:50 AM org.apache.maven.cli.event.ExecutionEventLogger projectSkipped
INFO:                                                                         
Aug 15, 2013 12:17:50 AM org.apache.maven.cli.event.ExecutionEventLogger projectSkipped
INFO: ------------------------------------------------------------------------
Aug 15, 2013 12:17:50 AM org.apache.maven.cli.event.ExecutionEventLogger projectSkipped
INFO: Skipping ActiveMQ :: Integration Test :: Spring 3.1
Aug 15, 2013 12:17:50 AM org.apache.maven.cli.event.ExecutionEventLogger projectSkipped
INFO: This project has been banned from the build due to previous failures.
Aug 15, 2013 12:17:50 AM org.apache.maven.cli.event.ExecutionEventLogger projectSkipped
INFO: ------------------------------------------------------------------------
Aug 15, 2013 12:17:50 AM org.apache.maven.cli.event.ExecutionEventLogger projectSkipped
INFO:                                                                         
Aug 15, 2013 12:17:50 AM org.apache.maven.cli.event.ExecutionEventLogger projectSkipped
INFO: ------------------------------------------------------------------------
Aug 15, 2013 12:17:50 AM org.apache.maven.cli.event.ExecutionEventLogger projectSkipped
INFO: Skipping ActiveMQ :: Assembly
Aug 15, 2013 12:17:50 AM org.apache.maven.cli.event.ExecutionEventLogger projectSkipped
INFO: This project has been banned from the build due to previous failures.
Aug 15, 2013 12:17:50 AM org.apache.maven.cli.event.ExecutionEventLogger projectSkipped
INFO: ------------------------------------------------------------------------
Aug 15, 2013 12:17:50 AM org.apache.maven.cli.event.ExecutionEventLogger logReactorSummary
INFO: ------------------------------------------------------------------------
Aug 15, 2013 12:17:50 AM org.apache.maven.cli.event.ExecutionEventLogger logReactorSummary
INFO: Reactor Summary:
Aug 15, 2013 12:17:50 AM org.apache.maven.cli.event.ExecutionEventLogger logReactorSummary
INFO: 
Aug 15, 2013 12:17:50 AM org.apache.maven.cli.event.ExecutionEventLogger logReactorSummary
INFO: ActiveMQ .......................................... SUCCESS [15.151s]
Aug 15, 2013 12:17:50 AM org.apache.maven.cli.event.ExecutionEventLogger logReactorSummary
INFO: ActiveMQ :: Openwire Generator .................... SUCCESS [8.485s]
Aug 15, 2013 12:17:50 AM org.apache.maven.cli.event.ExecutionEventLogger logReactorSummary
INFO: ActiveMQ :: Client ................................ SUCCESS [1:51.289s]
Aug 15, 2013 12:17:50 AM org.apache.maven.cli.event.ExecutionEventLogger logReactorSummary
INFO: ActiveMQ :: Openwire Legacy Support ............... SUCCESS [4.789s]
Aug 15, 2013 12:17:50 AM org.apache.maven.cli.event.ExecutionEventLogger logReactorSummary
INFO: ActiveMQ :: JAAS .................................. FAILURE [29.239s]
Aug 15, 2013 12:17:50 AM org.apache.maven.cli.event.ExecutionEventLogger logReactorSummary
INFO: ActiveMQ :: Broker ................................ SKIPPED
Aug 15, 2013 12:17:50 AM org.apache.maven.cli.event.ExecutionEventLogger logReactorSummary
INFO: ActiveMQ :: KahaDB Store .......................... SKIPPED
Aug 15, 2013 12:17:50 AM org.apache.maven.cli.event.ExecutionEventLogger logReactorSummary
INFO: ActiveMQ :: STOMP Protocol ........................ SKIPPED
Aug 15, 2013 12:17:50 AM org.apache.maven.cli.event.ExecutionEventLogger logReactorSummary
INFO: ActiveMQ :: MQTT Protocol ......................... SKIPPED
Aug 15, 2013 12:17:50 AM org.apache.maven.cli.event.ExecutionEventLogger logReactorSummary
INFO: ActiveMQ :: JDBC Store ............................ SKIPPED
Aug 15, 2013 12:17:50 AM org.apache.maven.cli.event.ExecutionEventLogger logReactorSummary
INFO: ActiveMQ :: LevelDB Store ......................... SKIPPED
Aug 15, 2013 12:17:50 AM org.apache.maven.cli.event.ExecutionEventLogger logReactorSummary
INFO: ActiveMQ :: RA .................................... SKIPPED
Aug 15, 2013 12:17:50 AM org.apache.maven.cli.event.ExecutionEventLogger logReactorSummary
INFO: ActiveMQ :: Pool .................................. SKIPPED
Aug 15, 2013 12:17:50 AM org.apache.maven.cli.event.ExecutionEventLogger logReactorSummary
INFO: ActiveMQ :: Spring ................................ SKIPPED
Aug 15, 2013 12:17:50 AM org.apache.maven.cli.event.ExecutionEventLogger logReactorSummary
INFO: ActiveMQ :: AMQP .................................. SKIPPED
Aug 15, 2013 12:17:50 AM org.apache.maven.cli.event.ExecutionEventLogger logReactorSummary
INFO: ActiveMQ :: Console ............................... SKIPPED
Aug 15, 2013 12:17:50 AM org.apache.maven.cli.event.ExecutionEventLogger logReactorSummary
INFO: ActiveMQ :: Unit Tests ............................ SKIPPED
Aug 15, 2013 12:17:50 AM org.apache.maven.cli.event.ExecutionEventLogger logReactorSummary
INFO: ActiveMQ :: Camel ................................. SKIPPED
Aug 15, 2013 12:17:50 AM org.apache.maven.cli.event.ExecutionEventLogger logReactorSummary
INFO: ActiveMQ :: HTTP Protocol Support ................. SKIPPED
Aug 15, 2013 12:17:50 AM org.apache.maven.cli.event.ExecutionEventLogger logReactorSummary
INFO: ActiveMQ :: All JAR bundle ........................ SKIPPED
Aug 15, 2013 12:17:50 AM org.apache.maven.cli.event.ExecutionEventLogger logReactorSummary
INFO: ActiveMQ :: File Server ........................... SKIPPED
Aug 15, 2013 12:17:50 AM org.apache.maven.cli.event.ExecutionEventLogger logReactorSummary
INFO: ActiveMQ :: Log4j Appender ........................ SKIPPED
Aug 15, 2013 12:17:50 AM org.apache.maven.cli.event.ExecutionEventLogger logReactorSummary
INFO: ActiveMQ :: Apache Karaf .......................... SKIPPED
Aug 15, 2013 12:17:50 AM org.apache.maven.cli.event.ExecutionEventLogger logReactorSummary
INFO: ActiveMQ :: RAR ................................... SKIPPED
Aug 15, 2013 12:17:50 AM org.apache.maven.cli.event.ExecutionEventLogger logReactorSummary
INFO: ActiveMQ :: Run Jar ............................... SKIPPED
Aug 15, 2013 12:17:50 AM org.apache.maven.cli.event.ExecutionEventLogger logReactorSummary
INFO: ActiveMQ :: Runtime Configuration ................. SKIPPED
Aug 15, 2013 12:17:50 AM org.apache.maven.cli.event.ExecutionEventLogger logReactorSummary
INFO: ActiveMQ :: Tooling ............................... SUCCESS [1.420s]
Aug 15, 2013 12:17:50 AM org.apache.maven.cli.event.ExecutionEventLogger logReactorSummary
INFO: ActiveMQ :: Memory Usage Test Plugin .............. SKIPPED
Aug 15, 2013 12:17:50 AM org.apache.maven.cli.event.ExecutionEventLogger logReactorSummary
INFO: ActiveMQ :: Performance Test Plugin ............... SKIPPED
Aug 15, 2013 12:17:50 AM org.apache.maven.cli.event.ExecutionEventLogger logReactorSummary
INFO: ActiveMQ :: StartUp Plugin ........................ SKIPPED
Aug 15, 2013 12:17:50 AM org.apache.maven.cli.event.ExecutionEventLogger logReactorSummary
INFO: ActiveMQ :: Web ................................... SKIPPED
Aug 15, 2013 12:17:50 AM org.apache.maven.cli.event.ExecutionEventLogger logReactorSummary
INFO: ActiveMQ :: OSGi bundle ........................... SKIPPED
Aug 15, 2013 12:17:50 AM org.apache.maven.cli.event.ExecutionEventLogger logReactorSummary
INFO: ActiveMQ :: Blueprint ............................. SUCCESS [4.868s]
Aug 15, 2013 12:17:50 AM org.apache.maven.cli.event.ExecutionEventLogger logReactorSummary
INFO: ActiveMQ :: Web Demo .............................. SKIPPED
Aug 15, 2013 12:17:50 AM org.apache.maven.cli.event.ExecutionEventLogger logReactorSummary
INFO: ActiveMQ :: Web Console ........................... SKIPPED
Aug 15, 2013 12:17:50 AM org.apache.maven.cli.event.ExecutionEventLogger logReactorSummary
INFO: ActiveMQ :: Karaf Integration Tests ............... SKIPPED
Aug 15, 2013 12:17:50 AM org.apache.maven.cli.event.ExecutionEventLogger logReactorSummary
INFO: ActiveMQ :: Integration Test :: Spring 3.1 ........ SKIPPED
Aug 15, 2013 12:17:50 AM org.apache.maven.cli.event.ExecutionEventLogger logReactorSummary
INFO: ActiveMQ :: Assembly .............................. SKIPPED
Aug 15, 2013 12:17:50 AM org.apache.maven.cli.event.ExecutionEventLogger logResult
INFO: ------------------------------------------------------------------------
Aug 15, 2013 12:17:50 AM org.apache.maven.cli.event.ExecutionEventLogger logResult
INFO: BUILD FAILURE
Aug 15, 2013 12:17:50 AM org.apache.maven.cli.event.ExecutionEventLogger logStats
INFO: ------------------------------------------------------------------------
Aug 15, 2013 12:17:50 AM org.apache.maven.cli.event.ExecutionEventLogger logStats
INFO: Total time: 3:02.656s
Aug 15, 2013 12:17:50 AM org.apache.maven.cli.event.ExecutionEventLogger logStats
INFO: Finished at: Thu Aug 15 00:17:50 UTC 2013
Aug 15, 2013 12:17:50 AM org.apache.maven.cli.event.ExecutionEventLogger logStats
INFO: Final Memory: 50M/936M
Aug 15, 2013 12:17:50 AM org.apache.maven.cli.event.ExecutionEventLogger sessionEnded
INFO: ------------------------------------------------------------------------
[JENKINS] Archiving <https://builds.apache.org/job/ActiveMQ-Java7/ws/activemq-client/pom.xml>
to /home/hudson/hudson/jobs/ActiveMQ-Java7/modules/org.apache.activemq$activemq-client/builds/2013-08-15_00-14-31/archive/org.apache.activemq/activemq-client/5.9-SNAPSHOT/activemq-client-5.9-SNAPSHOT.pom
[JENKINS] Archiving <https://builds.apache.org/job/ActiveMQ-Java7/ws/activemq-client/target/activemq-client-5.9-SNAPSHOT.jar>
to /home/hudson/hudson/jobs/ActiveMQ-Java7/modules/org.apache.activemq$activemq-client/builds/2013-08-15_00-14-31/archive/org.apache.activemq/activemq-client/5.9-SNAPSHOT/activemq-client-5.9-SNAPSHOT.jar
[JENKINS] Archiving <https://builds.apache.org/job/ActiveMQ-Java7/ws/activemq-client/target/activemq-client-5.9-SNAPSHOT-sources.jar>
to /home/hudson/hudson/jobs/ActiveMQ-Java7/modules/org.apache.activemq$activemq-client/builds/2013-08-15_00-14-31/archive/org.apache.activemq/activemq-client/5.9-SNAPSHOT/activemq-client-5.9-SNAPSHOT-sources.jar
[JENKINS] Archiving <https://builds.apache.org/job/ActiveMQ-Java7/ws/activemq-camel/pom.xml>
to /home/hudson/hudson/jobs/ActiveMQ-Java7/modules/org.apache.activemq$activemq-camel/builds/2013-08-15_00-14-33/archive/org.apache.activemq/activemq-camel/5.9-SNAPSHOT/activemq-camel-5.9-SNAPSHOT.pom
[JENKINS] Archiving <https://builds.apache.org/job/ActiveMQ-Java7/ws/pom.xml> to /home/hudson/hudson/jobs/ActiveMQ-Java7/modules/org.apache.activemq$activemq-parent/builds/2013-08-15_00-14-31/archive/org.apache.activemq/activemq-parent/5.9-SNAPSHOT/activemq-parent-5.9-SNAPSHOT.pom
[JENKINS] Archiving <https://builds.apache.org/job/ActiveMQ-Java7/ws/assembly/pom.xml>
to /home/hudson/hudson/jobs/ActiveMQ-Java7/modules/org.apache.activemq$apache-activemq/builds/2013-08-15_00-14-36/archive/org.apache.activemq/apache-activemq/5.9-SNAPSHOT/apache-activemq-5.9-SNAPSHOT.pom
[JENKINS] Archiving <https://builds.apache.org/job/ActiveMQ-Java7/ws/activemq-tooling/pom.xml>
to /home/hudson/hudson/jobs/ActiveMQ-Java7/modules/org.apache.activemq.tooling$activemq-tooling/builds/2013-08-15_00-14-35/archive/org.apache.activemq.tooling/activemq-tooling/5.9-SNAPSHOT/activemq-tooling-5.9-SNAPSHOT.pom
[JENKINS] Archiving <https://builds.apache.org/job/ActiveMQ-Java7/ws/activemq-pool/pom.xml>
to /home/hudson/hudson/jobs/ActiveMQ-Java7/modules/org.apache.activemq$activemq-pool/builds/2013-08-15_00-14-34/archive/org.apache.activemq/activemq-pool/5.9-SNAPSHOT/activemq-pool-5.9-SNAPSHOT.pom
[JENKINS] Archiving <https://builds.apache.org/job/ActiveMQ-Java7/ws/activemq-karaf-itest/pom.xml>
to /home/hudson/hudson/jobs/ActiveMQ-Java7/modules/org.apache.activemq$activemq-karaf-itest/builds/2013-08-15_00-14-36/archive/org.apache.activemq/activemq-karaf-itest/5.9-SNAPSHOT/activemq-karaf-itest-5.9-SNAPSHOT.pom
[JENKINS] Archiving <https://builds.apache.org/job/ActiveMQ-Java7/ws/activemq-broker/pom.xml>
to /home/hudson/hudson/jobs/ActiveMQ-Java7/modules/org.apache.activemq$activemq-broker/builds/2013-08-15_00-14-32/archive/org.apache.activemq/activemq-broker/5.9-SNAPSHOT/activemq-broker-5.9-SNAPSHOT.pom
[JENKINS] Archiving <https://builds.apache.org/job/ActiveMQ-Java7/ws/activemq-tooling/activemq-perf-maven-plugin/pom.xml>
to /home/hudson/hudson/jobs/ActiveMQ-Java7/modules/org.apache.activemq.tooling$activemq-perf-maven-plugin/builds/2013-08-15_00-14-35/archive/org.apache.activemq.tooling/activemq-perf-maven-plugin/5.9-SNAPSHOT/activemq-perf-maven-plugin-5.9-SNAPSHOT.pom
[JENKINS] Archiving <https://builds.apache.org/job/ActiveMQ-Java7/ws/activemq-kahadb-store/pom.xml>
to /home/hudson/hudson/jobs/ActiveMQ-Java7/modules/org.apache.activemq$activemq-kahadb-store/builds/2013-08-15_00-14-32/archive/org.apache.activemq/activemq-kahadb-store/5.9-SNAPSHOT/activemq-kahadb-store-5.9-SNAPSHOT.pom
[JENKINS] Archiving <https://builds.apache.org/job/ActiveMQ-Java7/ws/activemq-blueprint/pom.xml>
to /home/hudson/hudson/jobs/ActiveMQ-Java7/modules/org.apache.activemq$activemq-blueprint/builds/2013-08-15_00-14-35/archive/org.apache.activemq/activemq-blueprint/5.9-SNAPSHOT/activemq-blueprint-5.9-SNAPSHOT.pom
[JENKINS] Archiving <https://builds.apache.org/job/ActiveMQ-Java7/ws/activemq-blueprint/target/activemq-blueprint-5.9-SNAPSHOT.jar>
to /home/hudson/hudson/jobs/ActiveMQ-Java7/modules/org.apache.activemq$activemq-blueprint/builds/2013-08-15_00-14-35/archive/org.apache.activemq/activemq-blueprint/5.9-SNAPSHOT/activemq-blueprint-5.9-SNAPSHOT.jar
[JENKINS] Archiving <https://builds.apache.org/job/ActiveMQ-Java7/ws/activemq-blueprint/target/activemq-blueprint-5.9-SNAPSHOT-sources.jar>
to /home/hudson/hudson/jobs/ActiveMQ-Java7/modules/org.apache.activemq$activemq-blueprint/builds/2013-08-15_00-14-35/archive/org.apache.activemq/activemq-blueprint/5.9-SNAPSHOT/activemq-blueprint-5.9-SNAPSHOT-sources.jar
[JENKINS] Archiving <https://builds.apache.org/job/ActiveMQ-Java7/ws/activemq-stomp/pom.xml>
to /home/hudson/hudson/jobs/ActiveMQ-Java7/modules/org.apache.activemq$activemq-stomp/builds/2013-08-15_00-14-32/archive/org.apache.activemq/activemq-stomp/5.9-SNAPSHOT/activemq-stomp-5.9-SNAPSHOT.pom
[JENKINS] Archiving <https://builds.apache.org/job/ActiveMQ-Java7/ws/activemq-unit-tests/pom.xml>
to /home/hudson/hudson/jobs/ActiveMQ-Java7/modules/org.apache.activemq$activemq-unit-tests/builds/2013-08-15_00-14-33/archive/org.apache.activemq/activemq-unit-tests/5.9-SNAPSHOT/activemq-unit-tests-5.9-SNAPSHOT.pom
[JENKINS] Archiving <https://builds.apache.org/job/ActiveMQ-Java7/ws/activemq-openwire-legacy/pom.xml>
to /home/hudson/hudson/jobs/ActiveMQ-Java7/modules/org.apache.activemq$activemq-openwire-legacy/builds/2013-08-15_00-14-32/archive/org.apache.activemq/activemq-openwire-legacy/5.9-SNAPSHOT/activemq-openwire-legacy-5.9-SNAPSHOT.pom
[JENKINS] Archiving <https://builds.apache.org/job/ActiveMQ-Java7/ws/activemq-openwire-legacy/target/activemq-openwire-legacy-5.9-SNAPSHOT.jar>
to /home/hudson/hudson/jobs/ActiveMQ-Java7/modules/org.apache.activemq$activemq-openwire-legacy/builds/2013-08-15_00-14-32/archive/org.apache.activemq/activemq-openwire-legacy/5.9-SNAPSHOT/activemq-openwire-legacy-5.9-SNAPSHOT.jar
[JENKINS] Archiving <https://builds.apache.org/job/ActiveMQ-Java7/ws/activemq-openwire-legacy/target/activemq-openwire-legacy-5.9-SNAPSHOT-sources.jar>
to /home/hudson/hudson/jobs/ActiveMQ-Java7/modules/org.apache.activemq$activemq-openwire-legacy/builds/2013-08-15_00-14-32/archive/org.apache.activemq/activemq-openwire-legacy/5.9-SNAPSHOT/activemq-openwire-legacy-5.9-SNAPSHOT-sources.jar
[JENKINS] Archiving <https://builds.apache.org/job/ActiveMQ-Java7/ws/activemq-spring/pom.xml>
to /home/hudson/hudson/jobs/ActiveMQ-Java7/modules/org.apache.activemq$activemq-spring/builds/2013-08-15_00-14-34/archive/org.apache.activemq/activemq-spring/5.9-SNAPSHOT/activemq-spring-5.9-SNAPSHOT.pom
[JENKINS] Archiving <https://builds.apache.org/job/ActiveMQ-Java7/ws/activemq-karaf/pom.xml>
to /home/hudson/hudson/jobs/ActiveMQ-Java7/modules/org.apache.activemq$activemq-karaf/builds/2013-08-15_00-14-34/archive/org.apache.activemq/activemq-karaf/5.9-SNAPSHOT/activemq-karaf-5.9-SNAPSHOT.pom
[JENKINS] Archiving <https://builds.apache.org/job/ActiveMQ-Java7/ws/activemq-web-demo/pom.xml>
to /home/hudson/hudson/jobs/ActiveMQ-Java7/modules/org.apache.activemq$activemq-web-demo/builds/2013-08-15_00-14-36/archive/org.apache.activemq/activemq-web-demo/5.9-SNAPSHOT/activemq-web-demo-5.9-SNAPSHOT.pom
[JENKINS] Archiving <https://builds.apache.org/job/ActiveMQ-Java7/ws/activemq-web-console/pom.xml>
to /home/hudson/hudson/jobs/ActiveMQ-Java7/modules/org.apache.activemq$activemq-web-console/builds/2013-08-15_00-14-36/archive/org.apache.activemq/activemq-web-console/5.9-SNAPSHOT/activemq-web-console-5.9-SNAPSHOT.pom
[JENKINS] Archiving <https://builds.apache.org/job/ActiveMQ-Java7/ws/activemq-jdbc-store/pom.xml>
to /home/hudson/hudson/jobs/ActiveMQ-Java7/modules/org.apache.activemq$activemq-jdbc-store/builds/2013-08-15_00-14-33/archive/org.apache.activemq/activemq-jdbc-store/5.9-SNAPSHOT/activemq-jdbc-store-5.9-SNAPSHOT.pom
[JENKINS] Archiving <https://builds.apache.org/job/ActiveMQ-Java7/ws/activemq-jaas/pom.xml>
to /home/hudson/hudson/jobs/ActiveMQ-Java7/modules/org.apache.activemq$activemq-jaas/builds/2013-08-15_00-14-34/archive/org.apache.activemq/activemq-jaas/5.9-SNAPSHOT/activemq-jaas-5.9-SNAPSHOT.pom
[JENKINS] Archiving <https://builds.apache.org/job/ActiveMQ-Java7/ws/activemq-run/pom.xml>
to /home/hudson/hudson/jobs/ActiveMQ-Java7/modules/org.apache.activemq$activemq-run/builds/2013-08-15_00-14-34/archive/org.apache.activemq/activemq-run/5.9-SNAPSHOT/activemq-run-5.9-SNAPSHOT.pom
[JENKINS] Archiving <https://builds.apache.org/job/ActiveMQ-Java7/ws/activemq-amqp/pom.xml>
to /home/hudson/hudson/jobs/ActiveMQ-Java7/modules/org.apache.activemq$activemq-amqp/builds/2013-08-15_00-14-32/archive/org.apache.activemq/activemq-amqp/5.9-SNAPSHOT/activemq-amqp-5.9-SNAPSHOT.pom
[JENKINS] Archiving <https://builds.apache.org/job/ActiveMQ-Java7/ws/activemq-openwire-generator/pom.xml>
to /home/hudson/hudson/jobs/ActiveMQ-Java7/modules/org.apache.activemq$activemq-openwire-generator/builds/2013-08-15_00-14-34/archive/org.apache.activemq/activemq-openwire-generator/5.9-SNAPSHOT/activemq-openwire-generator-5.9-SNAPSHOT.pom
[JENKINS] Archiving <https://builds.apache.org/job/ActiveMQ-Java7/ws/activemq-openwire-generator/target/activemq-openwire-generator-5.9-SNAPSHOT.jar>
to /home/hudson/hudson/jobs/ActiveMQ-Java7/modules/org.apache.activemq$activemq-openwire-generator/builds/2013-08-15_00-14-34/archive/org.apache.activemq/activemq-openwire-generator/5.9-SNAPSHOT/activemq-openwire-generator-5.9-SNAPSHOT.jar
[JENKINS] Archiving <https://builds.apache.org/job/ActiveMQ-Java7/ws/activemq-openwire-generator/target/activemq-openwire-generator-5.9-SNAPSHOT-sources.jar>
to /home/hudson/hudson/jobs/ActiveMQ-Java7/modules/org.apache.activemq$activemq-openwire-generator/builds/2013-08-15_00-14-34/archive/org.apache.activemq/activemq-openwire-generator/5.9-SNAPSHOT/activemq-openwire-generator-5.9-SNAPSHOT-sources.jar
[JENKINS] Archiving <https://builds.apache.org/job/ActiveMQ-Java7/ws/activemq-console/pom.xml>
to /home/hudson/hudson/jobs/ActiveMQ-Java7/modules/org.apache.activemq$activemq-console/builds/2013-08-15_00-14-33/archive/org.apache.activemq/activemq-console/5.9-SNAPSHOT/activemq-console-5.9-SNAPSHOT.pom
[JENKINS] Archiving <https://builds.apache.org/job/ActiveMQ-Java7/ws/activemq-web/pom.xml>
to /home/hudson/hudson/jobs/ActiveMQ-Java7/modules/org.apache.activemq$activemq-web/builds/2013-08-15_00-14-35/archive/org.apache.activemq/activemq-web/5.9-SNAPSHOT/activemq-web-5.9-SNAPSHOT.pom
[JENKINS] Archiving <https://builds.apache.org/job/ActiveMQ-Java7/ws/activemq-log4j-appender/pom.xml>
to /home/hudson/hudson/jobs/ActiveMQ-Java7/modules/org.apache.activemq$activemq-log4j-appender/builds/2013-08-15_00-14-36/archive/org.apache.activemq/activemq-log4j-appender/5.9-SNAPSHOT/activemq-log4j-appender-5.9-SNAPSHOT.pom
[JENKINS] Archiving <https://builds.apache.org/job/ActiveMQ-Java7/ws/activemq-runtime-config/pom.xml>
to /home/hudson/hudson/jobs/ActiveMQ-Java7/modules/org.apache.activemq$activemq-runtime-config/builds/2013-08-15_00-14-34/archive/org.apache.activemq/activemq-runtime-config/5.9-SNAPSHOT/activemq-runtime-config-5.9-SNAPSHOT.pom
[JENKINS] Archiving <https://builds.apache.org/job/ActiveMQ-Java7/ws/activemq-tooling/activemq-memtest-maven-plugin/pom.xml>
to /home/hudson/hudson/jobs/ActiveMQ-Java7/modules/org.apache.activemq.tooling$activemq-memtest-maven-plugin/builds/2013-08-15_00-14-35/archive/org.apache.activemq.tooling/activemq-memtest-maven-plugin/5.9-SNAPSHOT/activemq-memtest-maven-plugin-5.9-SNAPSHOT.pom
[JENKINS] Archiving <https://builds.apache.org/job/ActiveMQ-Java7/ws/activemq-itests-spring31/pom.xml>
to /home/hudson/hudson/jobs/ActiveMQ-Java7/modules/org.apache.activemq$activemq-itests-spring31/builds/2013-08-15_00-14-36/archive/org.apache.activemq/activemq-itests-spring31/5.9-SNAPSHOT/activemq-itests-spring31-5.9-SNAPSHOT.pom
[JENKINS] Archiving <https://builds.apache.org/job/ActiveMQ-Java7/ws/activemq-http/pom.xml>
to /home/hudson/hudson/jobs/ActiveMQ-Java7/modules/org.apache.activemq$activemq-http/builds/2013-08-15_00-14-36/archive/org.apache.activemq/activemq-http/5.9-SNAPSHOT/activemq-http-5.9-SNAPSHOT.pom
[JENKINS] Archiving <https://builds.apache.org/job/ActiveMQ-Java7/ws/activemq-osgi/pom.xml>
to /home/hudson/hudson/jobs/ActiveMQ-Java7/modules/org.apache.activemq$activemq-osgi/builds/2013-08-15_00-14-35/archive/org.apache.activemq/activemq-osgi/5.9-SNAPSHOT/activemq-osgi-5.9-SNAPSHOT.pom
[JENKINS] Archiving <https://builds.apache.org/job/ActiveMQ-Java7/ws/activemq-fileserver/pom.xml>
to /home/hudson/hudson/jobs/ActiveMQ-Java7/modules/org.apache.activemq$activemq-fileserver/builds/2013-08-15_00-14-33/archive/org.apache.activemq/activemq-fileserver/5.9-SNAPSHOT/activemq-fileserver-5.9-SNAPSHOT.pom
[JENKINS] Archiving <https://builds.apache.org/job/ActiveMQ-Java7/ws/activemq-leveldb-store/pom.xml>
to /home/hudson/hudson/jobs/ActiveMQ-Java7/modules/org.apache.activemq$activemq-leveldb-store/builds/2013-08-15_00-14-33/archive/org.apache.activemq/activemq-leveldb-store/5.9-SNAPSHOT/activemq-leveldb-store-5.9-SNAPSHOT.pom
[JENKINS] Archiving <https://builds.apache.org/job/ActiveMQ-Java7/ws/activemq-all/pom.xml>
to /home/hudson/hudson/jobs/ActiveMQ-Java7/modules/org.apache.activemq$activemq-all/builds/2013-08-15_00-14-33/archive/org.apache.activemq/activemq-all/5.9-SNAPSHOT/activemq-all-5.9-SNAPSHOT.pom
[JENKINS] Archiving <https://builds.apache.org/job/ActiveMQ-Java7/ws/activemq-mqtt/pom.xml>
to /home/hudson/hudson/jobs/ActiveMQ-Java7/modules/org.apache.activemq$activemq-mqtt/builds/2013-08-15_00-14-32/archive/org.apache.activemq/activemq-mqtt/5.9-SNAPSHOT/activemq-mqtt-5.9-SNAPSHOT.pom
[JENKINS] Archiving <https://builds.apache.org/job/ActiveMQ-Java7/ws/activemq-tooling/activemq-maven-plugin/pom.xml>
to /home/hudson/hudson/jobs/ActiveMQ-Java7/modules/org.apache.activemq.tooling$activemq-maven-plugin/builds/2013-08-15_00-14-35/archive/org.apache.activemq.tooling/activemq-maven-plugin/5.9-SNAPSHOT/activemq-maven-plugin-5.9-SNAPSHOT.pom
[JENKINS] Archiving <https://builds.apache.org/job/ActiveMQ-Java7/ws/activemq-ra/pom.xml>
to /home/hudson/hudson/jobs/ActiveMQ-Java7/modules/org.apache.activemq$activemq-ra/builds/2013-08-15_00-14-34/archive/org.apache.activemq/activemq-ra/5.9-SNAPSHOT/activemq-ra-5.9-SNAPSHOT.pom
[JENKINS] Archiving <https://builds.apache.org/job/ActiveMQ-Java7/ws/activemq-rar/pom.xml>
to /home/hudson/hudson/jobs/ActiveMQ-Java7/modules/org.apache.activemq$activemq-rar/builds/2013-08-15_00-14-34/archive/org.apache.activemq/activemq-rar/5.9-SNAPSHOT/activemq-rar-5.9-SNAPSHOT.pom
[WARNING] The requested profile "slow-tests" could not be activated because it does not exist.
Waiting for Jenkins to finish collecting data
Sending e-mails to: dev@activemq.apache.org
channel stopped
[locks-and-latches] Releasing all the locks
[locks-and-latches] All the locks released

Mime
View raw message