activemq-dev mailing list archives

Site index · List index
Message view « Date » · « Thread »
Top « Date » · « Thread »
From Apache Jenkins Server <jenk...@builds.apache.org>
Subject Build failed in Jenkins: ActiveMQ » ActiveMQ :: MQTT Protocol #1341
Date Wed, 24 Jul 2013 01:31:36 GMT
See <https://builds.apache.org/job/ActiveMQ/org.apache.activemq$activemq-mqtt/1341/>

------------------------------------------
[01:09:28] Jul 24, 2013 1:09:28 AM org.apache.maven.cli.event.ExecutionEventLogger projectStarted
INFO:                                                                         
Jul 24, 2013 1:09:28 AM org.apache.maven.cli.event.ExecutionEventLogger projectStarted
INFO: ------------------------------------------------------------------------
Jul 24, 2013 1:09:28 AM org.apache.maven.cli.event.ExecutionEventLogger projectStarted
INFO: Building ActiveMQ :: MQTT Protocol 5.9-SNAPSHOT
Jul 24, 2013 1:09:28 AM org.apache.maven.cli.event.ExecutionEventLogger projectStarted
INFO: ------------------------------------------------------------------------
Jul 24, 2013 1:09:28 AM org.apache.maven.cli.event.ExecutionEventLogger mojoStarted
INFO: 
Jul 24, 2013 1:09:28 AM org.apache.maven.cli.event.ExecutionEventLogger mojoStarted
INFO: --- maven-clean-plugin:2.5:clean (default-clean) @ activemq-mqtt ---
Jul 24, 2013 1:09:28 AM org.apache.maven.cli.event.ExecutionEventLogger mojoStarted
INFO: 
Jul 24, 2013 1:09:28 AM org.apache.maven.cli.event.ExecutionEventLogger mojoStarted
INFO: --- maven-enforcer-plugin:1.0.1:enforce (default) @ activemq-mqtt ---
Jul 24, 2013 1:09:28 AM org.apache.maven.cli.event.ExecutionEventLogger mojoStarted
INFO: 
Jul 24, 2013 1:09:28 AM org.apache.maven.cli.event.ExecutionEventLogger mojoStarted
INFO: --- maven-consolets-plugin:1.30:install (default) @ activemq-mqtt ---
Jul 24, 2013 1:09:29 AM org.apache.maven.cli.event.ExecutionEventLogger mojoStarted
INFO: 
Jul 24, 2013 1:09:29 AM org.apache.maven.cli.event.ExecutionEventLogger mojoStarted
INFO: --- maven-bundle-plugin:2.3.7:cleanVersions (cleanVersions) @ activemq-mqtt ---
Jul 24, 2013 1:09:29 AM org.apache.maven.cli.event.ExecutionEventLogger mojoStarted
INFO: 
Jul 24, 2013 1:09:29 AM org.apache.maven.cli.event.ExecutionEventLogger mojoStarted
INFO: --- activemq-protobuf:1.1:compile (default) @ activemq-mqtt ---
[WARNING] No proto files found in directory: <https://builds.apache.org/job/ActiveMQ/org.apache.activemq$activemq-mqtt/ws/src/main/proto>
Jul 24, 2013 1:09:29 AM org.apache.maven.cli.event.ExecutionEventLogger mojoStarted
INFO: 
Jul 24, 2013 1:09:29 AM org.apache.maven.cli.event.ExecutionEventLogger mojoStarted
INFO: --- maven-remote-resources-plugin:1.3:process (default) @ activemq-mqtt ---
Jul 24, 2013 1:09:29 AM org.apache.maven.cli.event.ExecutionEventLogger mojoStarted
INFO: 
Jul 24, 2013 1:09:29 AM org.apache.maven.cli.event.ExecutionEventLogger mojoStarted
INFO: --- maven-resources-plugin:2.5:resources (default-resources) @ activemq-mqtt ---
[01:09:29] [debug] execute contextualize
[INFO] Using 'UTF-8' encoding to copy filtered resources.
[INFO] Copying 5 resources
[INFO] skip non existing resourceDirectory <https://builds.apache.org/job/ActiveMQ/org.apache.activemq$activemq-mqtt/ws/src/main/filtered-resources>
[INFO] Copying 3 resources
Jul 24, 2013 1:09:29 AM org.apache.maven.cli.event.ExecutionEventLogger mojoStarted
INFO: 
Jul 24, 2013 1:09:29 AM org.apache.maven.cli.event.ExecutionEventLogger mojoStarted
INFO: --- maven-compiler-plugin:2.5.1:compile (default-compile) @ activemq-mqtt ---
[INFO] Compiling 16 source files to <https://builds.apache.org/job/ActiveMQ/org.apache.activemq$activemq-mqtt/ws/target/classes>
Jul 24, 2013 1:09:29 AM org.apache.maven.cli.event.ExecutionEventLogger mojoStarted
INFO: 
Jul 24, 2013 1:09:29 AM org.apache.maven.cli.event.ExecutionEventLogger mojoStarted
INFO: --- maven-resources-plugin:2.5:testResources (default-testResources) @ activemq-mqtt
---
[01:09:29] [debug] execute contextualize
[INFO] Using 'UTF-8' encoding to copy filtered resources.
[INFO] Copying 3 resources
[INFO] Copying 3 resources
Jul 24, 2013 1:09:29 AM org.apache.maven.cli.event.ExecutionEventLogger mojoStarted
INFO: 
Jul 24, 2013 1:09:29 AM org.apache.maven.cli.event.ExecutionEventLogger mojoStarted
INFO: --- maven-compiler-plugin:2.5.1:testCompile (default-testCompile) @ activemq-mqtt ---
[INFO] Compiling 6 source files to <https://builds.apache.org/job/ActiveMQ/org.apache.activemq$activemq-mqtt/ws/target/test-classes>
Jul 24, 2013 1:09:30 AM org.apache.maven.cli.event.ExecutionEventLogger mojoStarted
INFO: 
Jul 24, 2013 1:09:30 AM org.apache.maven.cli.event.ExecutionEventLogger mojoStarted
INFO: --- maven-surefire-plugin:2.10:test (default-test) @ activemq-mqtt ---
[INFO] Surefire report directory: <https://builds.apache.org/job/ActiveMQ/org.apache.activemq$activemq-mqtt/ws/target/surefire-reports>
[01:09:30] 
[01:09:30] -------------------------------------------------------
[01:09:30]  T E S T S
[01:09:30] -------------------------------------------------------
[01:09:30] 
[01:09:30] -------------------------------------------------------
[01:09:30]  T E S T S
[01:09:30] -------------------------------------------------------
[01:09:30] Running org.apache.activemq.transport.mqtt.MQTTNioTest
[01:12:04] Tests run: 18, Failures: 0, Errors: 1, Skipped: 0, Time elapsed: 153.566 sec <<<
FAILURE!
[01:12:04] Running org.apache.activemq.transport.mqtt.MQTTSSLTest
[01:14:42] Tests run: 17, Failures: 0, Errors: 1, Skipped: 0, Time elapsed: 157.338 sec <<<
FAILURE!
[01:14:42] Running org.apache.activemq.transport.mqtt.MQTTTest
[01:17:15] Tests run: 17, Failures: 0, Errors: 1, Skipped: 0, Time elapsed: 152.709 sec <<<
FAILURE!
[01:17:15] 
[01:17:15] Results :
[01:17:15] 
[01:17:15] Tests in error: 
[01:17:15]   testPingOnMQTTNIO(org.apache.activemq.transport.mqtt.MQTTNioTest): The client
id MUST be configured when clean session is set to false
[01:17:15]   testReceiveMessageSentWhileOffline(org.apache.activemq.transport.mqtt.MQTTSSLTest):
Command from server contained an invalid message id: 1
[01:17:15]   testReceiveMessageSentWhileOffline(org.apache.activemq.transport.mqtt.MQTTTest):
Command from server contained an invalid message id: 1
[01:17:15] 
[01:17:15] Tests run: 52, Failures: 0, Errors: 3, Skipped: 0
[01:17:15] 
[ERROR] There are test failures.

Please refer to <https://builds.apache.org/job/ActiveMQ/org.apache.activemq$activemq-mqtt/ws/target/surefire-reports>
for the individual test results.
[01:17:16] 

Mime
View raw message