activemq-dev mailing list archives

Site index · List index
Message view « Date » · « Thread »
Top « Date » · « Thread »
From Apache Jenkins Server <jenk...@builds.apache.org>
Subject Build failed in Jenkins: ActiveMQ-Trunk-Deploy #820
Date Wed, 17 Jul 2013 03:15:24 GMT
See <https://builds.apache.org/job/ActiveMQ-Trunk-Deploy/820/changes>

Changes:

[tabish] fix for: https://issues.apache.org/jira/browse/AMQ-4629

[tabish] Test updates, use a proper MessageId and add some logging so the level DB test errors
are more obvious.

[dejanb] https://issues.apache.org/jira/browse/AMQ-4588 - id generator; some improvements
in the socket close routine

------------------------------------------
[...truncated 10246 lines...]
[INFO] ActiveMQ :: KahaDB Store .......................... SKIPPED
[INFO] ActiveMQ :: STOMP Protocol ........................ SKIPPED
[INFO] ActiveMQ :: MQTT Protocol ......................... SKIPPED
[INFO] ActiveMQ :: JDBC Store ............................ SKIPPED
[INFO] ActiveMQ :: LevelDB Store ......................... SKIPPED
[INFO] ActiveMQ :: RA .................................... SKIPPED
[INFO] ActiveMQ :: Pool .................................. SKIPPED
[INFO] ActiveMQ :: Spring ................................ SKIPPED
[INFO] ActiveMQ :: AMQP .................................. SKIPPED
[INFO] ActiveMQ :: Console ............................... SKIPPED
[INFO] ActiveMQ :: Unit Tests ............................ SKIPPED
[INFO] ActiveMQ :: Camel ................................. SKIPPED
[INFO] ActiveMQ :: HTTP Protocol Support ................. SKIPPED
[INFO] ActiveMQ :: All JAR bundle ........................ SKIPPED
[INFO] ActiveMQ :: File Server ........................... SKIPPED
[INFO] ActiveMQ :: Log4j Appender ........................ SKIPPED
[INFO] ActiveMQ :: Apache Karaf .......................... SKIPPED
[INFO] ActiveMQ :: RAR ................................... SKIPPED
[INFO] ActiveMQ :: Run Jar ............................... SKIPPED
[INFO] ActiveMQ :: Tooling ............................... FAILURE [6.769s]
[INFO] ActiveMQ :: Memory Usage Test Plugin .............. SKIPPED
[INFO] ActiveMQ :: Performance Test Plugin ............... SKIPPED
[INFO] ActiveMQ :: StartUp Plugin ........................ SKIPPED
[INFO] ActiveMQ :: Web ................................... SKIPPED
[INFO] ActiveMQ :: OSGi bundle ........................... SKIPPED
[INFO] ActiveMQ :: Blueprint ............................. SUCCESS [12.590s]
[INFO] ActiveMQ :: Web Demo .............................. SKIPPED
[INFO] ActiveMQ :: Web Console ........................... SKIPPED
[INFO] ActiveMQ :: Karaf Integration Tests ............... SKIPPED
[INFO] ActiveMQ :: Integration Test :: Spring 3.1 ........ SKIPPED
[INFO] ActiveMQ :: Assembly .............................. SKIPPED
[INFO] ------------------------------------------------------------------------
[INFO] BUILD FAILURE
[INFO] ------------------------------------------------------------------------
[INFO] Total time: 2:37.483s
[INFO] Finished at: Wed Jul 17 03:11:26 UTC 2013
[INFO] Final Memory: 60M/963M
[INFO] ------------------------------------------------------------------------
[JENKINS] Archiving <https://builds.apache.org/job/ActiveMQ-Trunk-Deploy/ws/deploy/pom.xml>
to /home/hudson/hudson/jobs/ActiveMQ-Trunk-Deploy/modules/org.apache.activemq$activemq-parent/builds/2013-07-17_03-08-29/archive/org.apache.activemq/activemq-parent/5.9-SNAPSHOT/activemq-parent-5.9-SNAPSHOT.pom
[JENKINS] Archiving <https://builds.apache.org/job/ActiveMQ-Trunk-Deploy/ws/deploy/activemq-client/pom.xml>
to /home/hudson/hudson/jobs/ActiveMQ-Trunk-Deploy/modules/org.apache.activemq$activemq-client/builds/2013-07-17_03-08-29/archive/org.apache.activemq/activemq-client/5.9-SNAPSHOT/activemq-client-5.9-SNAPSHOT.pom
[JENKINS] Archiving <https://builds.apache.org/job/ActiveMQ-Trunk-Deploy/ws/deploy/activemq-client/target/activemq-client-5.9-SNAPSHOT.jar>
to /home/hudson/hudson/jobs/ActiveMQ-Trunk-Deploy/modules/org.apache.activemq$activemq-client/builds/2013-07-17_03-08-29/archive/org.apache.activemq/activemq-client/5.9-20130717.030959-92/activemq-client-5.9-20130717.030959-92.jar
[JENKINS] Archiving <https://builds.apache.org/job/ActiveMQ-Trunk-Deploy/ws/deploy/activemq-client/target/activemq-client-5.9-SNAPSHOT-sources.jar>
to /home/hudson/hudson/jobs/ActiveMQ-Trunk-Deploy/modules/org.apache.activemq$activemq-client/builds/2013-07-17_03-08-29/archive/org.apache.activemq/activemq-client/5.9-20130717.030959-92/activemq-client-5.9-20130717.030959-92-sources.jar
[JENKINS] Archiving <https://builds.apache.org/job/ActiveMQ-Trunk-Deploy/ws/deploy/activemq-client/target/activemq-client-5.9-SNAPSHOT-javadoc.jar>
to /home/hudson/hudson/jobs/ActiveMQ-Trunk-Deploy/modules/org.apache.activemq$activemq-client/builds/2013-07-17_03-08-29/archive/org.apache.activemq/activemq-client/5.9-20130717.030959-92/activemq-client-5.9-20130717.030959-92-javadoc.jar
[JENKINS] Archiving <https://builds.apache.org/job/ActiveMQ-Trunk-Deploy/ws/deploy/assembly/pom.xml>
to /home/hudson/hudson/jobs/ActiveMQ-Trunk-Deploy/modules/org.apache.activemq$apache-activemq/builds/2013-07-17_03-08-33/archive/org.apache.activemq/apache-activemq/5.9-SNAPSHOT/apache-activemq-5.9-SNAPSHOT.pom
[JENKINS] Archiving <https://builds.apache.org/job/ActiveMQ-Trunk-Deploy/ws/deploy/activemq-camel/pom.xml>
to /home/hudson/hudson/jobs/ActiveMQ-Trunk-Deploy/modules/org.apache.activemq$activemq-camel/builds/2013-07-17_03-08-31/archive/org.apache.activemq/activemq-camel/5.9-SNAPSHOT/activemq-camel-5.9-SNAPSHOT.pom
[JENKINS] Archiving <https://builds.apache.org/job/ActiveMQ-Trunk-Deploy/ws/deploy/activemq-tooling/pom.xml>
to /home/hudson/hudson/jobs/ActiveMQ-Trunk-Deploy/modules/org.apache.activemq.tooling$activemq-tooling/builds/2013-07-17_03-08-32/archive/org.apache.activemq.tooling/activemq-tooling/5.9-SNAPSHOT/activemq-tooling-5.9-SNAPSHOT.pom
[JENKINS] Archiving <https://builds.apache.org/job/ActiveMQ-Trunk-Deploy/ws/deploy/activemq-pool/pom.xml>
to /home/hudson/hudson/jobs/ActiveMQ-Trunk-Deploy/modules/org.apache.activemq$activemq-pool/builds/2013-07-17_03-08-31/archive/org.apache.activemq/activemq-pool/5.9-SNAPSHOT/activemq-pool-5.9-SNAPSHOT.pom
[JENKINS] Archiving <https://builds.apache.org/job/ActiveMQ-Trunk-Deploy/ws/deploy/activemq-karaf-itest/pom.xml>
to /home/hudson/hudson/jobs/ActiveMQ-Trunk-Deploy/modules/org.apache.activemq$activemq-karaf-itest/builds/2013-07-17_03-08-33/archive/org.apache.activemq/activemq-karaf-itest/5.9-SNAPSHOT/activemq-karaf-itest-5.9-SNAPSHOT.pom
[JENKINS] Archiving <https://builds.apache.org/job/ActiveMQ-Trunk-Deploy/ws/deploy/activemq-broker/pom.xml>
to /home/hudson/hudson/jobs/ActiveMQ-Trunk-Deploy/modules/org.apache.activemq$activemq-broker/builds/2013-07-17_03-08-29/archive/org.apache.activemq/activemq-broker/5.9-SNAPSHOT/activemq-broker-5.9-SNAPSHOT.pom
[JENKINS] Archiving <https://builds.apache.org/job/ActiveMQ-Trunk-Deploy/ws/deploy/activemq-broker/target/activemq-broker-5.9-SNAPSHOT.jar>
to /home/hudson/hudson/jobs/ActiveMQ-Trunk-Deploy/modules/org.apache.activemq$activemq-broker/builds/2013-07-17_03-08-29/archive/org.apache.activemq/activemq-broker/5.9-SNAPSHOT/activemq-broker-5.9-SNAPSHOT.jar
[JENKINS] Archiving <https://builds.apache.org/job/ActiveMQ-Trunk-Deploy/ws/deploy/activemq-broker/target/activemq-broker-5.9-SNAPSHOT-sources.jar>
to /home/hudson/hudson/jobs/ActiveMQ-Trunk-Deploy/modules/org.apache.activemq$activemq-broker/builds/2013-07-17_03-08-29/archive/org.apache.activemq/activemq-broker/5.9-SNAPSHOT/activemq-broker-5.9-SNAPSHOT-sources.jar
[JENKINS] Archiving <https://builds.apache.org/job/ActiveMQ-Trunk-Deploy/ws/deploy/activemq-broker/target/activemq-broker-5.9-SNAPSHOT-javadoc.jar>
to /home/hudson/hudson/jobs/ActiveMQ-Trunk-Deploy/modules/org.apache.activemq$activemq-broker/builds/2013-07-17_03-08-29/archive/org.apache.activemq/activemq-broker/5.9-SNAPSHOT/activemq-broker-5.9-SNAPSHOT-javadoc.jar
[JENKINS] Archiving <https://builds.apache.org/job/ActiveMQ-Trunk-Deploy/ws/deploy/activemq-broker/target/activemq-broker-5.9-SNAPSHOT-tests.jar>
to /home/hudson/hudson/jobs/ActiveMQ-Trunk-Deploy/modules/org.apache.activemq$activemq-broker/builds/2013-07-17_03-08-29/archive/org.apache.activemq/activemq-broker/5.9-SNAPSHOT/activemq-broker-5.9-SNAPSHOT-tests.jar
[JENKINS] Archiving <https://builds.apache.org/job/ActiveMQ-Trunk-Deploy/ws/deploy/activemq-tooling/activemq-perf-maven-plugin/pom.xml>
to /home/hudson/hudson/jobs/ActiveMQ-Trunk-Deploy/modules/org.apache.activemq.tooling$activemq-perf-maven-plugin/builds/2013-07-17_03-08-32/archive/org.apache.activemq.tooling/activemq-perf-maven-plugin/5.9-SNAPSHOT/activemq-perf-maven-plugin-5.9-SNAPSHOT.pom
[JENKINS] Archiving <https://builds.apache.org/job/ActiveMQ-Trunk-Deploy/ws/deploy/activemq-kahadb-store/pom.xml>
to /home/hudson/hudson/jobs/ActiveMQ-Trunk-Deploy/modules/org.apache.activemq$activemq-kahadb-store/builds/2013-07-17_03-08-30/archive/org.apache.activemq/activemq-kahadb-store/5.9-SNAPSHOT/activemq-kahadb-store-5.9-SNAPSHOT.pom
[JENKINS] Archiving <https://builds.apache.org/job/ActiveMQ-Trunk-Deploy/ws/deploy/activemq-blueprint/pom.xml>
to /home/hudson/hudson/jobs/ActiveMQ-Trunk-Deploy/modules/org.apache.activemq$activemq-blueprint/builds/2013-07-17_03-08-32/archive/org.apache.activemq/activemq-blueprint/5.9-SNAPSHOT/activemq-blueprint-5.9-SNAPSHOT.pom
[JENKINS] Archiving <https://builds.apache.org/job/ActiveMQ-Trunk-Deploy/ws/deploy/activemq-blueprint/target/activemq-blueprint-5.9-SNAPSHOT.jar>
to /home/hudson/hudson/jobs/ActiveMQ-Trunk-Deploy/modules/org.apache.activemq$activemq-blueprint/builds/2013-07-17_03-08-32/archive/org.apache.activemq/activemq-blueprint/5.9-20130717.031123-73/activemq-blueprint-5.9-20130717.031123-73.jar
[JENKINS] Archiving <https://builds.apache.org/job/ActiveMQ-Trunk-Deploy/ws/deploy/activemq-blueprint/target/activemq-blueprint-5.9-SNAPSHOT-sources.jar>
to /home/hudson/hudson/jobs/ActiveMQ-Trunk-Deploy/modules/org.apache.activemq$activemq-blueprint/builds/2013-07-17_03-08-32/archive/org.apache.activemq/activemq-blueprint/5.9-20130717.031123-73/activemq-blueprint-5.9-20130717.031123-73-sources.jar
[JENKINS] Archiving <https://builds.apache.org/job/ActiveMQ-Trunk-Deploy/ws/deploy/activemq-stomp/pom.xml>
to /home/hudson/hudson/jobs/ActiveMQ-Trunk-Deploy/modules/org.apache.activemq$activemq-stomp/builds/2013-07-17_03-08-30/archive/org.apache.activemq/activemq-stomp/5.9-SNAPSHOT/activemq-stomp-5.9-SNAPSHOT.pom
[JENKINS] Archiving <https://builds.apache.org/job/ActiveMQ-Trunk-Deploy/ws/deploy/activemq-unit-tests/pom.xml>
to /home/hudson/hudson/jobs/ActiveMQ-Trunk-Deploy/modules/org.apache.activemq$activemq-unit-tests/builds/2013-07-17_03-08-30/archive/org.apache.activemq/activemq-unit-tests/5.9-SNAPSHOT/activemq-unit-tests-5.9-SNAPSHOT.pom
[JENKINS] Archiving <https://builds.apache.org/job/ActiveMQ-Trunk-Deploy/ws/deploy/activemq-spring/pom.xml>
to /home/hudson/hudson/jobs/ActiveMQ-Trunk-Deploy/modules/org.apache.activemq$activemq-spring/builds/2013-07-17_03-08-32/archive/org.apache.activemq/activemq-spring/5.9-SNAPSHOT/activemq-spring-5.9-SNAPSHOT.pom
[JENKINS] Archiving <https://builds.apache.org/job/ActiveMQ-Trunk-Deploy/ws/deploy/activemq-openwire-legacy/pom.xml>
to /home/hudson/hudson/jobs/ActiveMQ-Trunk-Deploy/modules/org.apache.activemq$activemq-openwire-legacy/builds/2013-07-17_03-08-29/archive/org.apache.activemq/activemq-openwire-legacy/5.9-SNAPSHOT/activemq-openwire-legacy-5.9-SNAPSHOT.pom
[JENKINS] Archiving <https://builds.apache.org/job/ActiveMQ-Trunk-Deploy/ws/deploy/activemq-openwire-legacy/target/activemq-openwire-legacy-5.9-SNAPSHOT.jar>
to /home/hudson/hudson/jobs/ActiveMQ-Trunk-Deploy/modules/org.apache.activemq$activemq-openwire-legacy/builds/2013-07-17_03-08-29/archive/org.apache.activemq/activemq-openwire-legacy/5.9-20130717.031024-84/activemq-openwire-legacy-5.9-20130717.031024-84.jar
[JENKINS] Archiving <https://builds.apache.org/job/ActiveMQ-Trunk-Deploy/ws/deploy/activemq-openwire-legacy/target/activemq-openwire-legacy-5.9-SNAPSHOT-sources.jar>
to /home/hudson/hudson/jobs/ActiveMQ-Trunk-Deploy/modules/org.apache.activemq$activemq-openwire-legacy/builds/2013-07-17_03-08-29/archive/org.apache.activemq/activemq-openwire-legacy/5.9-20130717.031024-84/activemq-openwire-legacy-5.9-20130717.031024-84-sources.jar
[JENKINS] Archiving <https://builds.apache.org/job/ActiveMQ-Trunk-Deploy/ws/deploy/activemq-openwire-legacy/target/activemq-openwire-legacy-5.9-SNAPSHOT-javadoc.jar>
to /home/hudson/hudson/jobs/ActiveMQ-Trunk-Deploy/modules/org.apache.activemq$activemq-openwire-legacy/builds/2013-07-17_03-08-29/archive/org.apache.activemq/activemq-openwire-legacy/5.9-20130717.031024-84/activemq-openwire-legacy-5.9-20130717.031024-84-javadoc.jar
[JENKINS] Archiving <https://builds.apache.org/job/ActiveMQ-Trunk-Deploy/ws/deploy/activemq-karaf/pom.xml>
to /home/hudson/hudson/jobs/ActiveMQ-Trunk-Deploy/modules/org.apache.activemq$activemq-karaf/builds/2013-07-17_03-08-31/archive/org.apache.activemq/activemq-karaf/5.9-SNAPSHOT/activemq-karaf-5.9-SNAPSHOT.pom
[JENKINS] Archiving <https://builds.apache.org/job/ActiveMQ-Trunk-Deploy/ws/deploy/activemq-web-demo/pom.xml>
to /home/hudson/hudson/jobs/ActiveMQ-Trunk-Deploy/modules/org.apache.activemq$activemq-web-demo/builds/2013-07-17_03-08-32/archive/org.apache.activemq/activemq-web-demo/5.9-SNAPSHOT/activemq-web-demo-5.9-SNAPSHOT.pom
[JENKINS] Archiving <https://builds.apache.org/job/ActiveMQ-Trunk-Deploy/ws/deploy/activemq-web-console/pom.xml>
to /home/hudson/hudson/jobs/ActiveMQ-Trunk-Deploy/modules/org.apache.activemq$activemq-web-console/builds/2013-07-17_03-08-32/archive/org.apache.activemq/activemq-web-console/5.9-SNAPSHOT/activemq-web-console-5.9-SNAPSHOT.pom
[JENKINS] Archiving <https://builds.apache.org/job/ActiveMQ-Trunk-Deploy/ws/deploy/activemq-jdbc-store/pom.xml>
to /home/hudson/hudson/jobs/ActiveMQ-Trunk-Deploy/modules/org.apache.activemq$activemq-jdbc-store/builds/2013-07-17_03-08-30/archive/org.apache.activemq/activemq-jdbc-store/5.9-SNAPSHOT/activemq-jdbc-store-5.9-SNAPSHOT.pom
[JENKINS] Archiving <https://builds.apache.org/job/ActiveMQ-Trunk-Deploy/ws/deploy/activemq-jaas/pom.xml>
to /home/hudson/hudson/jobs/ActiveMQ-Trunk-Deploy/modules/org.apache.activemq$activemq-jaas/builds/2013-07-17_03-08-31/archive/org.apache.activemq/activemq-jaas/5.9-SNAPSHOT/activemq-jaas-5.9-SNAPSHOT.pom
[JENKINS] Archiving <https://builds.apache.org/job/ActiveMQ-Trunk-Deploy/ws/deploy/activemq-jaas/target/activemq-jaas-5.9-SNAPSHOT.jar>
to /home/hudson/hudson/jobs/ActiveMQ-Trunk-Deploy/modules/org.apache.activemq$activemq-jaas/builds/2013-07-17_03-08-31/archive/org.apache.activemq/activemq-jaas/5.9-20130717.031043-119/activemq-jaas-5.9-20130717.031043-119.jar
[JENKINS] Archiving <https://builds.apache.org/job/ActiveMQ-Trunk-Deploy/ws/deploy/activemq-jaas/target/activemq-jaas-5.9-SNAPSHOT-sources.jar>
to /home/hudson/hudson/jobs/ActiveMQ-Trunk-Deploy/modules/org.apache.activemq$activemq-jaas/builds/2013-07-17_03-08-31/archive/org.apache.activemq/activemq-jaas/5.9-20130717.031043-119/activemq-jaas-5.9-20130717.031043-119-sources.jar
[JENKINS] Archiving <https://builds.apache.org/job/ActiveMQ-Trunk-Deploy/ws/deploy/activemq-jaas/target/activemq-jaas-5.9-SNAPSHOT-javadoc.jar>
to /home/hudson/hudson/jobs/ActiveMQ-Trunk-Deploy/modules/org.apache.activemq$activemq-jaas/builds/2013-07-17_03-08-31/archive/org.apache.activemq/activemq-jaas/5.9-20130717.031043-119/activemq-jaas-5.9-20130717.031043-119-javadoc.jar
[JENKINS] Archiving <https://builds.apache.org/job/ActiveMQ-Trunk-Deploy/ws/deploy/activemq-run/pom.xml>
to /home/hudson/hudson/jobs/ActiveMQ-Trunk-Deploy/modules/org.apache.activemq$activemq-run/builds/2013-07-17_03-08-31/archive/org.apache.activemq/activemq-run/5.9-SNAPSHOT/activemq-run-5.9-SNAPSHOT.pom
[JENKINS] Archiving <https://builds.apache.org/job/ActiveMQ-Trunk-Deploy/ws/deploy/activemq-amqp/pom.xml>
to /home/hudson/hudson/jobs/ActiveMQ-Trunk-Deploy/modules/org.apache.activemq$activemq-amqp/builds/2013-07-17_03-08-30/archive/org.apache.activemq/activemq-amqp/5.9-SNAPSHOT/activemq-amqp-5.9-SNAPSHOT.pom
[JENKINS] Archiving <https://builds.apache.org/job/ActiveMQ-Trunk-Deploy/ws/deploy/activemq-openwire-generator/pom.xml>
to /home/hudson/hudson/jobs/ActiveMQ-Trunk-Deploy/modules/org.apache.activemq$activemq-openwire-generator/builds/2013-07-17_03-08-31/archive/org.apache.activemq/activemq-openwire-generator/5.9-SNAPSHOT/activemq-openwire-generator-5.9-SNAPSHOT.pom
[JENKINS] Archiving <https://builds.apache.org/job/ActiveMQ-Trunk-Deploy/ws/deploy/activemq-openwire-generator/target/activemq-openwire-generator-5.9-SNAPSHOT.jar>
to /home/hudson/hudson/jobs/ActiveMQ-Trunk-Deploy/modules/org.apache.activemq$activemq-openwire-generator/builds/2013-07-17_03-08-31/archive/org.apache.activemq/activemq-openwire-generator/5.9-20130717.030930-99/activemq-openwire-generator-5.9-20130717.030930-99.jar
[JENKINS] Archiving <https://builds.apache.org/job/ActiveMQ-Trunk-Deploy/ws/deploy/activemq-openwire-generator/target/activemq-openwire-generator-5.9-SNAPSHOT-sources.jar>
to /home/hudson/hudson/jobs/ActiveMQ-Trunk-Deploy/modules/org.apache.activemq$activemq-openwire-generator/builds/2013-07-17_03-08-31/archive/org.apache.activemq/activemq-openwire-generator/5.9-20130717.030930-99/activemq-openwire-generator-5.9-20130717.030930-99-sources.jar
[JENKINS] Archiving <https://builds.apache.org/job/ActiveMQ-Trunk-Deploy/ws/deploy/activemq-openwire-generator/target/activemq-openwire-generator-5.9-SNAPSHOT-javadoc.jar>
to /home/hudson/hudson/jobs/ActiveMQ-Trunk-Deploy/modules/org.apache.activemq$activemq-openwire-generator/builds/2013-07-17_03-08-31/archive/org.apache.activemq/activemq-openwire-generator/5.9-20130717.030930-99/activemq-openwire-generator-5.9-20130717.030930-99-javadoc.jar
[JENKINS] Archiving <https://builds.apache.org/job/ActiveMQ-Trunk-Deploy/ws/deploy/activemq-web/pom.xml>
to /home/hudson/hudson/jobs/ActiveMQ-Trunk-Deploy/modules/org.apache.activemq$activemq-web/builds/2013-07-17_03-08-32/archive/org.apache.activemq/activemq-web/5.9-SNAPSHOT/activemq-web-5.9-SNAPSHOT.pom
[JENKINS] Archiving <https://builds.apache.org/job/ActiveMQ-Trunk-Deploy/ws/deploy/activemq-console/pom.xml>
to /home/hudson/hudson/jobs/ActiveMQ-Trunk-Deploy/modules/org.apache.activemq$activemq-console/builds/2013-07-17_03-08-31/archive/org.apache.activemq/activemq-console/5.9-SNAPSHOT/activemq-console-5.9-SNAPSHOT.pom
[JENKINS] Archiving <https://builds.apache.org/job/ActiveMQ-Trunk-Deploy/ws/deploy/activemq-log4j-appender/pom.xml>
to /home/hudson/hudson/jobs/ActiveMQ-Trunk-Deploy/modules/org.apache.activemq$activemq-log4j-appender/builds/2013-07-17_03-08-33/archive/org.apache.activemq/activemq-log4j-appender/5.9-SNAPSHOT/activemq-log4j-appender-5.9-SNAPSHOT.pom
[JENKINS] Archiving <https://builds.apache.org/job/ActiveMQ-Trunk-Deploy/ws/deploy/activemq-tooling/activemq-memtest-maven-plugin/pom.xml>
to /home/hudson/hudson/jobs/ActiveMQ-Trunk-Deploy/modules/org.apache.activemq.tooling$activemq-memtest-maven-plugin/builds/2013-07-17_03-08-32/archive/org.apache.activemq.tooling/activemq-memtest-maven-plugin/5.9-SNAPSHOT/activemq-memtest-maven-plugin-5.9-SNAPSHOT.pom
[JENKINS] Archiving <https://builds.apache.org/job/ActiveMQ-Trunk-Deploy/ws/deploy/activemq-itests-spring31/pom.xml>
to /home/hudson/hudson/jobs/ActiveMQ-Trunk-Deploy/modules/org.apache.activemq$activemq-itests-spring31/builds/2013-07-17_03-08-33/archive/org.apache.activemq/activemq-itests-spring31/5.9-SNAPSHOT/activemq-itests-spring31-5.9-SNAPSHOT.pom
[JENKINS] Archiving <https://builds.apache.org/job/ActiveMQ-Trunk-Deploy/ws/deploy/activemq-http/pom.xml>
to /home/hudson/hudson/jobs/ActiveMQ-Trunk-Deploy/modules/org.apache.activemq$activemq-http/builds/2013-07-17_03-08-33/archive/org.apache.activemq/activemq-http/5.9-SNAPSHOT/activemq-http-5.9-SNAPSHOT.pom
[JENKINS] Archiving <https://builds.apache.org/job/ActiveMQ-Trunk-Deploy/ws/deploy/activemq-osgi/pom.xml>
to /home/hudson/hudson/jobs/ActiveMQ-Trunk-Deploy/modules/org.apache.activemq$activemq-osgi/builds/2013-07-17_03-08-32/archive/org.apache.activemq/activemq-osgi/5.9-SNAPSHOT/activemq-osgi-5.9-SNAPSHOT.pom
[JENKINS] Archiving <https://builds.apache.org/job/ActiveMQ-Trunk-Deploy/ws/deploy/activemq-fileserver/pom.xml>
to /home/hudson/hudson/jobs/ActiveMQ-Trunk-Deploy/modules/org.apache.activemq$activemq-fileserver/builds/2013-07-17_03-08-31/archive/org.apache.activemq/activemq-fileserver/5.9-SNAPSHOT/activemq-fileserver-5.9-SNAPSHOT.pom
[JENKINS] Archiving <https://builds.apache.org/job/ActiveMQ-Trunk-Deploy/ws/deploy/activemq-leveldb-store/pom.xml>
to /home/hudson/hudson/jobs/ActiveMQ-Trunk-Deploy/modules/org.apache.activemq$activemq-leveldb-store/builds/2013-07-17_03-08-30/archive/org.apache.activemq/activemq-leveldb-store/5.9-SNAPSHOT/activemq-leveldb-store-5.9-SNAPSHOT.pom
[JENKINS] Archiving <https://builds.apache.org/job/ActiveMQ-Trunk-Deploy/ws/deploy/activemq-all/pom.xml>
to /home/hudson/hudson/jobs/ActiveMQ-Trunk-Deploy/modules/org.apache.activemq$activemq-all/builds/2013-07-17_03-08-30/archive/org.apache.activemq/activemq-all/5.9-SNAPSHOT/activemq-all-5.9-SNAPSHOT.pom
[JENKINS] Archiving <https://builds.apache.org/job/ActiveMQ-Trunk-Deploy/ws/deploy/activemq-mqtt/pom.xml>
to /home/hudson/hudson/jobs/ActiveMQ-Trunk-Deploy/modules/org.apache.activemq$activemq-mqtt/builds/2013-07-17_03-08-30/archive/org.apache.activemq/activemq-mqtt/5.9-SNAPSHOT/activemq-mqtt-5.9-SNAPSHOT.pom
[JENKINS] Archiving <https://builds.apache.org/job/ActiveMQ-Trunk-Deploy/ws/deploy/activemq-tooling/activemq-maven-plugin/pom.xml>
to /home/hudson/hudson/jobs/ActiveMQ-Trunk-Deploy/modules/org.apache.activemq.tooling$activemq-maven-plugin/builds/2013-07-17_03-08-32/archive/org.apache.activemq.tooling/activemq-maven-plugin/5.9-SNAPSHOT/activemq-maven-plugin-5.9-SNAPSHOT.pom
[JENKINS] Archiving <https://builds.apache.org/job/ActiveMQ-Trunk-Deploy/ws/deploy/activemq-ra/pom.xml>
to /home/hudson/hudson/jobs/ActiveMQ-Trunk-Deploy/modules/org.apache.activemq$activemq-ra/builds/2013-07-17_03-08-31/archive/org.apache.activemq/activemq-ra/5.9-SNAPSHOT/activemq-ra-5.9-SNAPSHOT.pom
[JENKINS] Archiving <https://builds.apache.org/job/ActiveMQ-Trunk-Deploy/ws/deploy/activemq-rar/pom.xml>
to /home/hudson/hudson/jobs/ActiveMQ-Trunk-Deploy/modules/org.apache.activemq$activemq-rar/builds/2013-07-17_03-08-31/archive/org.apache.activemq/activemq-rar/5.9-SNAPSHOT/activemq-rar-5.9-SNAPSHOT.pom
Waiting for Jenkins to finish collecting data
mavenExecutionResult exceptions not empty
message : Failed to execute goal org.codehaus.mojo:ianal-maven-plugin:1.0-alpha-1:verify-legal-files
(default) on project activemq-broker: Artifact does not contain any legal files: activemq-broker-5.9-SNAPSHOT-sources.jar
cause : Artifact does not contain any legal files: activemq-broker-5.9-SNAPSHOT-sources.jar
Stack trace : 
org.apache.maven.lifecycle.LifecycleExecutionException: Failed to execute goal org.codehaus.mojo:ianal-maven-plugin:1.0-alpha-1:verify-legal-files
(default) on project activemq-broker: Artifact does not contain any legal files: activemq-broker-5.9-SNAPSHOT-sources.jar
	at org.apache.maven.lifecycle.internal.MojoExecutor.execute(MojoExecutor.java:217)
	at org.apache.maven.lifecycle.internal.MojoExecutor.execute(MojoExecutor.java:153)
	at org.apache.maven.lifecycle.internal.MojoExecutor.execute(MojoExecutor.java:145)
	at org.apache.maven.lifecycle.internal.LifecycleModuleBuilder.buildProject(LifecycleModuleBuilder.java:84)
	at org.apache.maven.lifecycle.internal.LifecycleModuleBuilder.buildProject(LifecycleModuleBuilder.java:59)
	at org.apache.maven.lifecycle.internal.LifecycleStarter.singleThreadedBuild(LifecycleStarter.java:183)
	at org.apache.maven.lifecycle.internal.LifecycleStarter.execute(LifecycleStarter.java:161)
	at org.apache.maven.DefaultMaven.doExecute(DefaultMaven.java:320)
	at org.apache.maven.DefaultMaven.execute(DefaultMaven.java:156)
	at org.jvnet.hudson.maven3.launcher.Maven3Launcher.main(Maven3Launcher.java:79)
	at sun.reflect.NativeMethodAccessorImpl.invoke0(Native Method)
	at sun.reflect.NativeMethodAccessorImpl.invoke(NativeMethodAccessorImpl.java:39)
	at sun.reflect.DelegatingMethodAccessorImpl.invoke(DelegatingMethodAccessorImpl.java:25)
	at java.lang.reflect.Method.invoke(Method.java:597)
	at org.codehaus.plexus.classworlds.launcher.Launcher.launchStandard(Launcher.java:329)
	at org.codehaus.plexus.classworlds.launcher.Launcher.launch(Launcher.java:239)
	at org.jvnet.hudson.maven3.agent.Maven3Main.launch(Maven3Main.java:158)
	at hudson.maven.Maven3Builder.call(Maven3Builder.java:100)
	at hudson.maven.Maven3Builder.call(Maven3Builder.java:66)
	at hudson.remoting.UserRequest.perform(UserRequest.java:118)
	at hudson.remoting.UserRequest.perform(UserRequest.java:48)
	at hudson.remoting.Request$2.run(Request.java:326)
	at hudson.remoting.InterceptingExecutorService$1.call(InterceptingExecutorService.java:72)
	at java.util.concurrent.FutureTask$Sync.innerRun(FutureTask.java:303)
	at java.util.concurrent.FutureTask.run(FutureTask.java:138)
	at java.util.concurrent.ThreadPoolExecutor$Worker.runTask(ThreadPoolExecutor.java:895)
	at java.util.concurrent.ThreadPoolExecutor$Worker.run(ThreadPoolExecutor.java:918)
	at java.lang.Thread.run(Thread.java:662)
Caused by: org.apache.maven.plugin.MojoExecutionException: Artifact does not contain any legal
files: activemq-broker-5.9-SNAPSHOT-sources.jar
	at sun.reflect.NativeConstructorAccessorImpl.newInstance0(Native Method)
	at sun.reflect.NativeConstructorAccessorImpl.newInstance(NativeConstructorAccessorImpl.java:39)
	at sun.reflect.DelegatingConstructorAccessorImpl.newInstance(DelegatingConstructorAccessorImpl.java:27)
	at java.lang.reflect.Constructor.newInstance(Constructor.java:513)
	at org.codehaus.groovy.runtime.MetaClassHelper.doConstructorInvoke(MetaClassHelper.java:535)
	at groovy.lang.MetaClassImpl.doConstructorInvoke(MetaClassImpl.java:2356)
	at groovy.lang.MetaClassImpl.invokeConstructor(MetaClassImpl.java:1255)
	at groovy.lang.MetaClassImpl.invokeConstructor(MetaClassImpl.java:1185)
	at org.codehaus.groovy.runtime.InvokerHelper.invokeConstructorOf(InvokerHelper.java:809)
	at org.codehaus.groovy.runtime.ScriptBytecodeAdapter.invokeNewN(ScriptBytecodeAdapter.java:230)
	at org.codehaus.groovy.maven.mojo.GroovyMojo.fail(GroovyMojo.groovy:65)
	at sun.reflect.NativeMethodAccessorImpl.invoke0(Native Method)
	at sun.reflect.NativeMethodAccessorImpl.invoke(NativeMethodAccessorImpl.java:39)
	at sun.reflect.DelegatingMethodAccessorImpl.invoke(DelegatingMethodAccessorImpl.java:25)
	at java.lang.reflect.Method.invoke(Method.java:597)
	at org.codehaus.groovy.reflection.CachedMethod.invoke(CachedMethod.java:86)
	at groovy.lang.MetaMethod.doMethodInvoke(MetaMethod.java:230)
	at org.codehaus.groovy.runtime.metaclass.ClosureMetaClass.invokeMethod(ClosureMetaClass.java:333)
	at org.codehaus.groovy.runtime.ScriptBytecodeAdapter.invokeMethodOnCurrentN(ScriptBytecodeAdapter.java:78)
	at org.codehaus.mojo.ianal.VerifyLegalFilesMojo$_execute_closure2.doCall(VerifyLegalFilesMojo.groovy:165)
	at sun.reflect.NativeMethodAccessorImpl.invoke0(Native Method)
	at sun.reflect.NativeMethodAccessorImpl.invoke(NativeMethodAccessorImpl.java:39)
	at sun.reflect.DelegatingMethodAccessorImpl.invoke(DelegatingMethodAccessorImpl.java:25)
	at java.lang.reflect.Method.invoke(Method.java:597)
	at org.codehaus.groovy.reflection.CachedMethod.invoke(CachedMethod.java:86)
	at groovy.lang.MetaMethod.doMethodInvoke(MetaMethod.java:230)
	at org.codehaus.groovy.runtime.metaclass.ClosureMetaClass.invokeMethod(ClosureMetaClass.java:248)
	at groovy.lang.MetaClassImpl.invokeMethod(MetaClassImpl.java:756)
	at groovy.lang.Closure.call(Closure.java:292)
	at groovy.lang.Closure.call(Closure.java:305)
	at org.codehaus.groovy.runtime.DefaultGroovyMethods.each(DefaultGroovyMethods.java:1079)
	at org.codehaus.groovy.runtime.DefaultGroovyMethods.each(DefaultGroovyMethods.java:1056)
	at sun.reflect.NativeMethodAccessorImpl.invoke0(Native Method)
	at sun.reflect.NativeMethodAccessorImpl.invoke(NativeMethodAccessorImpl.java:39)
	at sun.reflect.DelegatingMethodAccessorImpl.invoke(DelegatingMethodAccessorImpl.java:25)
	at java.lang.reflect.Method.invoke(Method.java:597)
	at org.codehaus.groovy.runtime.metaclass.ReflectionMetaMethod.invoke(ReflectionMetaMethod.java:51)
	at org.codehaus.groovy.runtime.metaclass.NewInstanceMetaMethod.invoke(NewInstanceMetaMethod.java:54)
	at groovy.lang.MetaMethod.doMethodInvoke(MetaMethod.java:230)
	at groovy.lang.MetaClassImpl.invokeMethod(MetaClassImpl.java:912)
	at groovy.lang.MetaClassImpl.invokeMethod(MetaClassImpl.java:756)
	at org.codehaus.groovy.runtime.InvokerHelper.invokePojoMethod(InvokerHelper.java:766)
	at org.codehaus.groovy.runtime.InvokerHelper.invokeMethod(InvokerHelper.java:754)
	at org.codehaus.groovy.runtime.ScriptBytecodeAdapter.invokeMethodN(ScriptBytecodeAdapter.java:170)
	at org.codehaus.mojo.ianal.VerifyLegalFilesMojo.execute(VerifyLegalFilesMojo.groovy:113)
	at org.apache.maven.plugin.DefaultBuildPluginManager.executeMojo(DefaultBuildPluginManager.java:101)
	at org.apache.maven.lifecycle.internal.MojoExecutor.execute(MojoExecutor.java:209)
	... 27 more
message : Internal error: java.lang.reflect.UndeclaredThrowableException
cause : null
Stack trace : 
org.apache.maven.InternalErrorException: Internal error: java.lang.reflect.UndeclaredThrowableException
	at org.apache.maven.lifecycle.internal.BuilderCommon.handleBuildError(BuilderCommon.java:128)
	at org.apache.maven.lifecycle.internal.LifecycleModuleBuilder.buildProject(LifecycleModuleBuilder.java:95)
	at org.apache.maven.lifecycle.internal.LifecycleModuleBuilder.buildProject(LifecycleModuleBuilder.java:59)
	at org.apache.maven.lifecycle.internal.LifecycleStarter.singleThreadedBuild(LifecycleStarter.java:183)
	at org.apache.maven.lifecycle.internal.LifecycleStarter.execute(LifecycleStarter.java:161)
	at org.apache.maven.DefaultMaven.doExecute(DefaultMaven.java:320)
	at org.apache.maven.DefaultMaven.execute(DefaultMaven.java:156)
	at org.jvnet.hudson.maven3.launcher.Maven3Launcher.main(Maven3Launcher.java:79)
	at sun.reflect.NativeMethodAccessorImpl.invoke0(Native Method)
	at sun.reflect.NativeMethodAccessorImpl.invoke(NativeMethodAccessorImpl.java:39)
	at sun.reflect.DelegatingMethodAccessorImpl.invoke(DelegatingMethodAccessorImpl.java:25)
	at java.lang.reflect.Method.invoke(Method.java:597)
	at org.codehaus.plexus.classworlds.launcher.Launcher.launchStandard(Launcher.java:329)
	at org.codehaus.plexus.classworlds.launcher.Launcher.launch(Launcher.java:239)
	at org.jvnet.hudson.maven3.agent.Maven3Main.launch(Maven3Main.java:158)
	at hudson.maven.Maven3Builder.call(Maven3Builder.java:100)
	at hudson.maven.Maven3Builder.call(Maven3Builder.java:66)
	at hudson.remoting.UserRequest.perform(UserRequest.java:118)
	at hudson.remoting.UserRequest.perform(UserRequest.java:48)
	at hudson.remoting.Request$2.run(Request.java:326)
	at hudson.remoting.InterceptingExecutorService$1.call(InterceptingExecutorService.java:72)
	at java.util.concurrent.FutureTask$Sync.innerRun(FutureTask.java:303)
	at java.util.concurrent.FutureTask.run(FutureTask.java:138)
	at java.util.concurrent.ThreadPoolExecutor$Worker.runTask(ThreadPoolExecutor.java:895)
	at java.util.concurrent.ThreadPoolExecutor$Worker.run(ThreadPoolExecutor.java:918)
	at java.lang.Thread.run(Thread.java:662)
Caused by: java.lang.reflect.UndeclaredThrowableException
	at com.sun.proxy.$Proxy2.setExecutedMojos(Unknown Source)
	at hudson.maven.MavenBuildProxy$Filter.setExecutedMojos(MavenBuildProxy.java:243)
	at hudson.maven.Maven3Builder$MavenExecutionListener.recordMojoEnded(Maven3Builder.java:439)
	at hudson.maven.Maven3Builder$MavenExecutionListener.mojoSucceeded(Maven3Builder.java:425)
	at org.apache.maven.lifecycle.internal.DefaultExecutionEventCatapult.fire(DefaultExecutionEventCatapult.java:87)
	at org.apache.maven.lifecycle.internal.DefaultExecutionEventCatapult.fire(DefaultExecutionEventCatapult.java:42)
	at org.apache.maven.lifecycle.internal.MojoExecutor.execute(MojoExecutor.java:228)
	at org.apache.maven.lifecycle.internal.MojoExecutor.execute(MojoExecutor.java:153)
	at org.apache.maven.lifecycle.internal.MojoExecutor.execute(MojoExecutor.java:145)
	at org.apache.maven.lifecycle.internal.LifecycleModuleBuilder.buildProject(LifecycleModuleBuilder.java:84)
	... 24 more
Caused by: java.io.UTFDataFormatException
	at java.io.ObjectInputStream$BlockDataInputStream.readUTFSpan(ObjectInputStream.java:3105)
	at java.io.ObjectInputStream$BlockDataInputStream.readUTFBody(ObjectInputStream.java:3030)
	at java.io.ObjectInputStream$BlockDataInputStream.readUTF(ObjectInputStream.java:2843)
	at java.io.ObjectInputStream.readUTF(ObjectInputStream.java:1069)
	at java.io.ObjectStreamClass.readNonProxy(ObjectStreamClass.java:691)
	at java.io.ObjectInputStream.readClassDescriptor(ObjectInputStream.java:827)
	at java.io.ObjectInputStream.readNonProxyDesc(ObjectInputStream.java:1583)
	at java.io.ObjectInputStream.readClassDesc(ObjectInputStream.java:1514)
	at java.io.ObjectInputStream.readArray(ObjectInputStream.java:1642)
	at java.io.ObjectInputStream.readObject0(ObjectInputStream.java:1341)
	at java.io.ObjectInputStream.defaultReadFields(ObjectInputStream.java:1970)
	at java.io.ObjectInputStream.readSerialData(ObjectInputStream.java:1894)
	at java.io.ObjectInputStream.readOrdinaryObject(ObjectInputStream.java:1777)
	at java.io.ObjectInputStream.readObject0(ObjectInputStream.java:1347)
	at java.io.ObjectInputStream.readObject(ObjectInputStream.java:369)
	at hudson.remoting.UserRequest.deserialize(UserRequest.java:182)
	at hudson.remoting.UserRequest.perform(UserRequest.java:98)
	at hudson.remoting.UserRequest.perform(UserRequest.java:48)
	at hudson.remoting.Request$2.run(Request.java:326)
	at hudson.remoting.InterceptingExecutorService$1.call(InterceptingExecutorService.java:72)
	at java.util.concurrent.FutureTask$Sync.innerRun(FutureTask.java:334)
	at java.util.concurrent.FutureTask.run(FutureTask.java:166)
	at java.util.concurrent.ThreadPoolExecutor.runWorker(ThreadPoolExecutor.java:1145)
	at java.util.concurrent.ThreadPoolExecutor$Worker.run(ThreadPoolExecutor.java:615)
	at java.lang.Thread.run(Thread.java:722)
Sending e-mails to: dev@activemq.apache.org
Sending e-mails to: dev@activemq.apache.org
Sending e-mails to: dev@activemq.apache.org
Sending e-mails to: dev@activemq.apache.org
channel stopped

Mime
View raw message