activemq-dev mailing list archives

Site index · List index
Message view « Date » · « Thread »
Top « Date » · « Thread »
From Apache Jenkins Server <jenk...@builds.apache.org>
Subject Build failed in Jenkins: ActiveMQ-Java7 #256
Date Fri, 26 Jul 2013 00:34:44 GMT
See <https://builds.apache.org/job/ActiveMQ-Java7/256/changes>

Changes:

[tabish] https://issues.apache.org/jira/browse/AMQ-4651

Some new tests showing existing problems with AMQP transacted consumer handling.

[chirino] Warn when there are too many replication nodes attached.

------------------------------------------
[...truncated 6709 lines...]
INFO: ------------------------------------------------------------------------
Jul 26, 2013 12:31:15 AM org.apache.maven.cli.event.ExecutionEventLogger projectSkipped
INFO: Skipping ActiveMQ :: Integration Test :: Spring 3.1
Jul 26, 2013 12:31:15 AM org.apache.maven.cli.event.ExecutionEventLogger projectSkipped
INFO: This project has been banned from the build due to previous failures.
Jul 26, 2013 12:31:15 AM org.apache.maven.cli.event.ExecutionEventLogger projectSkipped
INFO: ------------------------------------------------------------------------
Jul 26, 2013 12:31:15 AM org.apache.maven.cli.event.ExecutionEventLogger projectSkipped
INFO:                                                                         
Jul 26, 2013 12:31:15 AM org.apache.maven.cli.event.ExecutionEventLogger projectSkipped
INFO: ------------------------------------------------------------------------
Jul 26, 2013 12:31:15 AM org.apache.maven.cli.event.ExecutionEventLogger projectSkipped
INFO: Skipping ActiveMQ :: Assembly
Jul 26, 2013 12:31:15 AM org.apache.maven.cli.event.ExecutionEventLogger projectSkipped
INFO: This project has been banned from the build due to previous failures.
Jul 26, 2013 12:31:15 AM org.apache.maven.cli.event.ExecutionEventLogger projectSkipped
INFO: ------------------------------------------------------------------------
Jul 26, 2013 12:31:15 AM org.apache.maven.cli.event.ExecutionEventLogger logReactorSummary
INFO: ------------------------------------------------------------------------
Jul 26, 2013 12:31:15 AM org.apache.maven.cli.event.ExecutionEventLogger logReactorSummary
INFO: Reactor Summary:
Jul 26, 2013 12:31:15 AM org.apache.maven.cli.event.ExecutionEventLogger logReactorSummary
INFO: 
Jul 26, 2013 12:31:15 AM org.apache.maven.cli.event.ExecutionEventLogger logReactorSummary
INFO: ActiveMQ .......................................... SUCCESS [17.965s]
Jul 26, 2013 12:31:15 AM org.apache.maven.cli.event.ExecutionEventLogger logReactorSummary
INFO: ActiveMQ :: Openwire Generator .................... SUCCESS [6.430s]
Jul 26, 2013 12:31:15 AM org.apache.maven.cli.event.ExecutionEventLogger logReactorSummary
INFO: ActiveMQ :: Client ................................ SUCCESS [1:51.817s]
Jul 26, 2013 12:31:15 AM org.apache.maven.cli.event.ExecutionEventLogger logReactorSummary
INFO: ActiveMQ :: Openwire Legacy Support ............... SUCCESS [5.782s]
Jul 26, 2013 12:31:15 AM org.apache.maven.cli.event.ExecutionEventLogger logReactorSummary
INFO: ActiveMQ :: JAAS .................................. SUCCESS [34.555s]
Jul 26, 2013 12:31:15 AM org.apache.maven.cli.event.ExecutionEventLogger logReactorSummary
INFO: ActiveMQ :: Broker ................................ FAILURE [1:00.517s]
Jul 26, 2013 12:31:15 AM org.apache.maven.cli.event.ExecutionEventLogger logReactorSummary
INFO: ActiveMQ :: KahaDB Store .......................... SKIPPED
Jul 26, 2013 12:31:15 AM org.apache.maven.cli.event.ExecutionEventLogger logReactorSummary
INFO: ActiveMQ :: STOMP Protocol ........................ SKIPPED
Jul 26, 2013 12:31:15 AM org.apache.maven.cli.event.ExecutionEventLogger logReactorSummary
INFO: ActiveMQ :: MQTT Protocol ......................... SKIPPED
Jul 26, 2013 12:31:15 AM org.apache.maven.cli.event.ExecutionEventLogger logReactorSummary
INFO: ActiveMQ :: JDBC Store ............................ SKIPPED
Jul 26, 2013 12:31:15 AM org.apache.maven.cli.event.ExecutionEventLogger logReactorSummary
INFO: ActiveMQ :: LevelDB Store ......................... SKIPPED
Jul 26, 2013 12:31:15 AM org.apache.maven.cli.event.ExecutionEventLogger logReactorSummary
INFO: ActiveMQ :: RA .................................... SKIPPED
Jul 26, 2013 12:31:15 AM org.apache.maven.cli.event.ExecutionEventLogger logReactorSummary
INFO: ActiveMQ :: Pool .................................. SKIPPED
Jul 26, 2013 12:31:15 AM org.apache.maven.cli.event.ExecutionEventLogger logReactorSummary
INFO: ActiveMQ :: Spring ................................ SKIPPED
Jul 26, 2013 12:31:15 AM org.apache.maven.cli.event.ExecutionEventLogger logReactorSummary
INFO: ActiveMQ :: AMQP .................................. SKIPPED
Jul 26, 2013 12:31:15 AM org.apache.maven.cli.event.ExecutionEventLogger logReactorSummary
INFO: ActiveMQ :: Console ............................... SKIPPED
Jul 26, 2013 12:31:15 AM org.apache.maven.cli.event.ExecutionEventLogger logReactorSummary
INFO: ActiveMQ :: Unit Tests ............................ SKIPPED
Jul 26, 2013 12:31:15 AM org.apache.maven.cli.event.ExecutionEventLogger logReactorSummary
INFO: ActiveMQ :: Camel ................................. SKIPPED
Jul 26, 2013 12:31:15 AM org.apache.maven.cli.event.ExecutionEventLogger logReactorSummary
INFO: ActiveMQ :: HTTP Protocol Support ................. SKIPPED
Jul 26, 2013 12:31:15 AM org.apache.maven.cli.event.ExecutionEventLogger logReactorSummary
INFO: ActiveMQ :: All JAR bundle ........................ SKIPPED
Jul 26, 2013 12:31:15 AM org.apache.maven.cli.event.ExecutionEventLogger logReactorSummary
INFO: ActiveMQ :: File Server ........................... SKIPPED
Jul 26, 2013 12:31:15 AM org.apache.maven.cli.event.ExecutionEventLogger logReactorSummary
INFO: ActiveMQ :: Log4j Appender ........................ SKIPPED
Jul 26, 2013 12:31:15 AM org.apache.maven.cli.event.ExecutionEventLogger logReactorSummary
INFO: ActiveMQ :: Apache Karaf .......................... SKIPPED
Jul 26, 2013 12:31:15 AM org.apache.maven.cli.event.ExecutionEventLogger logReactorSummary
INFO: ActiveMQ :: RAR ................................... SKIPPED
Jul 26, 2013 12:31:15 AM org.apache.maven.cli.event.ExecutionEventLogger logReactorSummary
INFO: ActiveMQ :: Run Jar ............................... SKIPPED
Jul 26, 2013 12:31:15 AM org.apache.maven.cli.event.ExecutionEventLogger logReactorSummary
INFO: ActiveMQ :: Tooling ............................... SUCCESS [1.309s]
Jul 26, 2013 12:31:15 AM org.apache.maven.cli.event.ExecutionEventLogger logReactorSummary
INFO: ActiveMQ :: Memory Usage Test Plugin .............. SKIPPED
Jul 26, 2013 12:31:15 AM org.apache.maven.cli.event.ExecutionEventLogger logReactorSummary
INFO: ActiveMQ :: Performance Test Plugin ............... SKIPPED
Jul 26, 2013 12:31:15 AM org.apache.maven.cli.event.ExecutionEventLogger logReactorSummary
INFO: ActiveMQ :: StartUp Plugin ........................ SKIPPED
Jul 26, 2013 12:31:15 AM org.apache.maven.cli.event.ExecutionEventLogger logReactorSummary
INFO: ActiveMQ :: Web ................................... SKIPPED
Jul 26, 2013 12:31:15 AM org.apache.maven.cli.event.ExecutionEventLogger logReactorSummary
INFO: ActiveMQ :: OSGi bundle ........................... SKIPPED
Jul 26, 2013 12:31:15 AM org.apache.maven.cli.event.ExecutionEventLogger logReactorSummary
INFO: ActiveMQ :: Blueprint ............................. SUCCESS [7.121s]
Jul 26, 2013 12:31:15 AM org.apache.maven.cli.event.ExecutionEventLogger logReactorSummary
INFO: ActiveMQ :: Web Demo .............................. SKIPPED
Jul 26, 2013 12:31:15 AM org.apache.maven.cli.event.ExecutionEventLogger logReactorSummary
INFO: ActiveMQ :: Web Console ........................... SKIPPED
Jul 26, 2013 12:31:15 AM org.apache.maven.cli.event.ExecutionEventLogger logReactorSummary
INFO: ActiveMQ :: Karaf Integration Tests ............... SKIPPED
Jul 26, 2013 12:31:15 AM org.apache.maven.cli.event.ExecutionEventLogger logReactorSummary
INFO: ActiveMQ :: Integration Test :: Spring 3.1 ........ SKIPPED
Jul 26, 2013 12:31:15 AM org.apache.maven.cli.event.ExecutionEventLogger logReactorSummary
INFO: ActiveMQ :: Assembly .............................. SKIPPED
Jul 26, 2013 12:31:15 AM org.apache.maven.cli.event.ExecutionEventLogger logResult
INFO: ------------------------------------------------------------------------
Jul 26, 2013 12:31:15 AM org.apache.maven.cli.event.ExecutionEventLogger logResult
INFO: BUILD FAILURE
Jul 26, 2013 12:31:15 AM org.apache.maven.cli.event.ExecutionEventLogger logStats
INFO: ------------------------------------------------------------------------
Jul 26, 2013 12:31:15 AM org.apache.maven.cli.event.ExecutionEventLogger logStats
INFO: Total time: 4:12.972s
Jul 26, 2013 12:31:15 AM org.apache.maven.cli.event.ExecutionEventLogger logStats
INFO: Finished at: Fri Jul 26 00:31:15 UTC 2013
Jul 26, 2013 12:31:15 AM org.apache.maven.cli.event.ExecutionEventLogger logStats
INFO: Final Memory: 61M/1102M
Jul 26, 2013 12:31:15 AM org.apache.maven.cli.event.ExecutionEventLogger sessionEnded
INFO: ------------------------------------------------------------------------
[JENKINS] Archiving <https://builds.apache.org/job/ActiveMQ-Java7/ws/activemq-client/pom.xml>
to /home/hudson/hudson/jobs/ActiveMQ-Java7/modules/org.apache.activemq$activemq-client/builds/2013-07-26_00-26-41/archive/org.apache.activemq/activemq-client/5.9-SNAPSHOT/activemq-client-5.9-SNAPSHOT.pom
[JENKINS] Archiving <https://builds.apache.org/job/ActiveMQ-Java7/ws/activemq-client/target/activemq-client-5.9-SNAPSHOT.jar>
to /home/hudson/hudson/jobs/ActiveMQ-Java7/modules/org.apache.activemq$activemq-client/builds/2013-07-26_00-26-41/archive/org.apache.activemq/activemq-client/5.9-SNAPSHOT/activemq-client-5.9-SNAPSHOT.jar
[JENKINS] Archiving <https://builds.apache.org/job/ActiveMQ-Java7/ws/activemq-client/target/activemq-client-5.9-SNAPSHOT-sources.jar>
to /home/hudson/hudson/jobs/ActiveMQ-Java7/modules/org.apache.activemq$activemq-client/builds/2013-07-26_00-26-41/archive/org.apache.activemq/activemq-client/5.9-SNAPSHOT/activemq-client-5.9-SNAPSHOT-sources.jar
[JENKINS] Archiving <https://builds.apache.org/job/ActiveMQ-Java7/ws/activemq-camel/pom.xml>
to /home/hudson/hudson/jobs/ActiveMQ-Java7/modules/org.apache.activemq$activemq-camel/builds/2013-07-26_00-26-43/archive/org.apache.activemq/activemq-camel/5.9-SNAPSHOT/activemq-camel-5.9-SNAPSHOT.pom
[JENKINS] Archiving <https://builds.apache.org/job/ActiveMQ-Java7/ws/pom.xml> to /home/hudson/hudson/jobs/ActiveMQ-Java7/modules/org.apache.activemq$activemq-parent/builds/2013-07-26_00-26-40/archive/org.apache.activemq/activemq-parent/5.9-SNAPSHOT/activemq-parent-5.9-SNAPSHOT.pom
[JENKINS] Archiving <https://builds.apache.org/job/ActiveMQ-Java7/ws/assembly/pom.xml>
to /home/hudson/hudson/jobs/ActiveMQ-Java7/modules/org.apache.activemq$apache-activemq/builds/2013-07-26_00-26-46/archive/org.apache.activemq/apache-activemq/5.9-SNAPSHOT/apache-activemq-5.9-SNAPSHOT.pom
[JENKINS] Archiving <https://builds.apache.org/job/ActiveMQ-Java7/ws/activemq-tooling/pom.xml>
to /home/hudson/hudson/jobs/ActiveMQ-Java7/modules/org.apache.activemq.tooling$activemq-tooling/builds/2013-07-26_00-26-44/archive/org.apache.activemq.tooling/activemq-tooling/5.9-SNAPSHOT/activemq-tooling-5.9-SNAPSHOT.pom
[JENKINS] Archiving <https://builds.apache.org/job/ActiveMQ-Java7/ws/activemq-pool/pom.xml>
to /home/hudson/hudson/jobs/ActiveMQ-Java7/modules/org.apache.activemq$activemq-pool/builds/2013-07-26_00-26-44/archive/org.apache.activemq/activemq-pool/5.9-SNAPSHOT/activemq-pool-5.9-SNAPSHOT.pom
[JENKINS] Archiving <https://builds.apache.org/job/ActiveMQ-Java7/ws/activemq-karaf-itest/pom.xml>
to /home/hudson/hudson/jobs/ActiveMQ-Java7/modules/org.apache.activemq$activemq-karaf-itest/builds/2013-07-26_00-26-45/archive/org.apache.activemq/activemq-karaf-itest/5.9-SNAPSHOT/activemq-karaf-itest-5.9-SNAPSHOT.pom
[JENKINS] Archiving <https://builds.apache.org/job/ActiveMQ-Java7/ws/activemq-broker/pom.xml>
to /home/hudson/hudson/jobs/ActiveMQ-Java7/modules/org.apache.activemq$activemq-broker/builds/2013-07-26_00-26-41/archive/org.apache.activemq/activemq-broker/5.9-SNAPSHOT/activemq-broker-5.9-SNAPSHOT.pom
[JENKINS] Archiving <https://builds.apache.org/job/ActiveMQ-Java7/ws/activemq-tooling/activemq-perf-maven-plugin/pom.xml>
to /home/hudson/hudson/jobs/ActiveMQ-Java7/modules/org.apache.activemq.tooling$activemq-perf-maven-plugin/builds/2013-07-26_00-26-44/archive/org.apache.activemq.tooling/activemq-perf-maven-plugin/5.9-SNAPSHOT/activemq-perf-maven-plugin-5.9-SNAPSHOT.pom
[JENKINS] Archiving <https://builds.apache.org/job/ActiveMQ-Java7/ws/activemq-kahadb-store/pom.xml>
to /home/hudson/hudson/jobs/ActiveMQ-Java7/modules/org.apache.activemq$activemq-kahadb-store/builds/2013-07-26_00-26-42/archive/org.apache.activemq/activemq-kahadb-store/5.9-SNAPSHOT/activemq-kahadb-store-5.9-SNAPSHOT.pom
[JENKINS] Archiving <https://builds.apache.org/job/ActiveMQ-Java7/ws/activemq-blueprint/pom.xml>
to /home/hudson/hudson/jobs/ActiveMQ-Java7/modules/org.apache.activemq$activemq-blueprint/builds/2013-07-26_00-26-45/archive/org.apache.activemq/activemq-blueprint/5.9-SNAPSHOT/activemq-blueprint-5.9-SNAPSHOT.pom
[JENKINS] Archiving <https://builds.apache.org/job/ActiveMQ-Java7/ws/activemq-blueprint/target/activemq-blueprint-5.9-SNAPSHOT.jar>
to /home/hudson/hudson/jobs/ActiveMQ-Java7/modules/org.apache.activemq$activemq-blueprint/builds/2013-07-26_00-26-45/archive/org.apache.activemq/activemq-blueprint/5.9-SNAPSHOT/activemq-blueprint-5.9-SNAPSHOT.jar
[JENKINS] Archiving <https://builds.apache.org/job/ActiveMQ-Java7/ws/activemq-blueprint/target/activemq-blueprint-5.9-SNAPSHOT-sources.jar>
to /home/hudson/hudson/jobs/ActiveMQ-Java7/modules/org.apache.activemq$activemq-blueprint/builds/2013-07-26_00-26-45/archive/org.apache.activemq/activemq-blueprint/5.9-SNAPSHOT/activemq-blueprint-5.9-SNAPSHOT-sources.jar
[JENKINS] Archiving <https://builds.apache.org/job/ActiveMQ-Java7/ws/activemq-stomp/pom.xml>
to /home/hudson/hudson/jobs/ActiveMQ-Java7/modules/org.apache.activemq$activemq-stomp/builds/2013-07-26_00-26-41/archive/org.apache.activemq/activemq-stomp/5.9-SNAPSHOT/activemq-stomp-5.9-SNAPSHOT.pom
[JENKINS] Archiving <https://builds.apache.org/job/ActiveMQ-Java7/ws/activemq-unit-tests/pom.xml>
to /home/hudson/hudson/jobs/ActiveMQ-Java7/modules/org.apache.activemq$activemq-unit-tests/builds/2013-07-26_00-26-43/archive/org.apache.activemq/activemq-unit-tests/5.9-SNAPSHOT/activemq-unit-tests-5.9-SNAPSHOT.pom
[JENKINS] Archiving <https://builds.apache.org/job/ActiveMQ-Java7/ws/activemq-openwire-legacy/pom.xml>
to /home/hudson/hudson/jobs/ActiveMQ-Java7/modules/org.apache.activemq$activemq-openwire-legacy/builds/2013-07-26_00-26-41/archive/org.apache.activemq/activemq-openwire-legacy/5.9-SNAPSHOT/activemq-openwire-legacy-5.9-SNAPSHOT.pom
[JENKINS] Archiving <https://builds.apache.org/job/ActiveMQ-Java7/ws/activemq-openwire-legacy/target/activemq-openwire-legacy-5.9-SNAPSHOT.jar>
to /home/hudson/hudson/jobs/ActiveMQ-Java7/modules/org.apache.activemq$activemq-openwire-legacy/builds/2013-07-26_00-26-41/archive/org.apache.activemq/activemq-openwire-legacy/5.9-SNAPSHOT/activemq-openwire-legacy-5.9-SNAPSHOT.jar
[JENKINS] Archiving <https://builds.apache.org/job/ActiveMQ-Java7/ws/activemq-openwire-legacy/target/activemq-openwire-legacy-5.9-SNAPSHOT-sources.jar>
to /home/hudson/hudson/jobs/ActiveMQ-Java7/modules/org.apache.activemq$activemq-openwire-legacy/builds/2013-07-26_00-26-41/archive/org.apache.activemq/activemq-openwire-legacy/5.9-SNAPSHOT/activemq-openwire-legacy-5.9-SNAPSHOT-sources.jar
[JENKINS] Archiving <https://builds.apache.org/job/ActiveMQ-Java7/ws/activemq-spring/pom.xml>
to /home/hudson/hudson/jobs/ActiveMQ-Java7/modules/org.apache.activemq$activemq-spring/builds/2013-07-26_00-26-44/archive/org.apache.activemq/activemq-spring/5.9-SNAPSHOT/activemq-spring-5.9-SNAPSHOT.pom
[JENKINS] Archiving <https://builds.apache.org/job/ActiveMQ-Java7/ws/activemq-karaf/pom.xml>
to /home/hudson/hudson/jobs/ActiveMQ-Java7/modules/org.apache.activemq$activemq-karaf/builds/2013-07-26_00-26-43/archive/org.apache.activemq/activemq-karaf/5.9-SNAPSHOT/activemq-karaf-5.9-SNAPSHOT.pom
[JENKINS] Archiving <https://builds.apache.org/job/ActiveMQ-Java7/ws/activemq-web-demo/pom.xml>
to /home/hudson/hudson/jobs/ActiveMQ-Java7/modules/org.apache.activemq$activemq-web-demo/builds/2013-07-26_00-26-45/archive/org.apache.activemq/activemq-web-demo/5.9-SNAPSHOT/activemq-web-demo-5.9-SNAPSHOT.pom
[JENKINS] Archiving <https://builds.apache.org/job/ActiveMQ-Java7/ws/activemq-web-console/pom.xml>
to /home/hudson/hudson/jobs/ActiveMQ-Java7/modules/org.apache.activemq$activemq-web-console/builds/2013-07-26_00-26-45/archive/org.apache.activemq/activemq-web-console/5.9-SNAPSHOT/activemq-web-console-5.9-SNAPSHOT.pom
[JENKINS] Archiving <https://builds.apache.org/job/ActiveMQ-Java7/ws/activemq-jdbc-store/pom.xml>
to /home/hudson/hudson/jobs/ActiveMQ-Java7/modules/org.apache.activemq$activemq-jdbc-store/builds/2013-07-26_00-26-42/archive/org.apache.activemq/activemq-jdbc-store/5.9-SNAPSHOT/activemq-jdbc-store-5.9-SNAPSHOT.pom
[JENKINS] Archiving <https://builds.apache.org/job/ActiveMQ-Java7/ws/activemq-jaas/pom.xml>
to /home/hudson/hudson/jobs/ActiveMQ-Java7/modules/org.apache.activemq$activemq-jaas/builds/2013-07-26_00-26-43/archive/org.apache.activemq/activemq-jaas/5.9-SNAPSHOT/activemq-jaas-5.9-SNAPSHOT.pom
[JENKINS] Archiving <https://builds.apache.org/job/ActiveMQ-Java7/ws/activemq-jaas/target/activemq-jaas-5.9-SNAPSHOT.jar>
to /home/hudson/hudson/jobs/ActiveMQ-Java7/modules/org.apache.activemq$activemq-jaas/builds/2013-07-26_00-26-43/archive/org.apache.activemq/activemq-jaas/5.9-SNAPSHOT/activemq-jaas-5.9-SNAPSHOT.jar
[JENKINS] Archiving <https://builds.apache.org/job/ActiveMQ-Java7/ws/activemq-jaas/target/activemq-jaas-5.9-SNAPSHOT-sources.jar>
to /home/hudson/hudson/jobs/ActiveMQ-Java7/modules/org.apache.activemq$activemq-jaas/builds/2013-07-26_00-26-43/archive/org.apache.activemq/activemq-jaas/5.9-SNAPSHOT/activemq-jaas-5.9-SNAPSHOT-sources.jar
[JENKINS] Archiving <https://builds.apache.org/job/ActiveMQ-Java7/ws/activemq-run/pom.xml>
to /home/hudson/hudson/jobs/ActiveMQ-Java7/modules/org.apache.activemq$activemq-run/builds/2013-07-26_00-26-44/archive/org.apache.activemq/activemq-run/5.9-SNAPSHOT/activemq-run-5.9-SNAPSHOT.pom
[JENKINS] Archiving <https://builds.apache.org/job/ActiveMQ-Java7/ws/activemq-amqp/pom.xml>
to /home/hudson/hudson/jobs/ActiveMQ-Java7/modules/org.apache.activemq$activemq-amqp/builds/2013-07-26_00-26-42/archive/org.apache.activemq/activemq-amqp/5.9-SNAPSHOT/activemq-amqp-5.9-SNAPSHOT.pom
[JENKINS] Archiving <https://builds.apache.org/job/ActiveMQ-Java7/ws/activemq-openwire-generator/pom.xml>
to /home/hudson/hudson/jobs/ActiveMQ-Java7/modules/org.apache.activemq$activemq-openwire-generator/builds/2013-07-26_00-26-43/archive/org.apache.activemq/activemq-openwire-generator/5.9-SNAPSHOT/activemq-openwire-generator-5.9-SNAPSHOT.pom
[JENKINS] Archiving <https://builds.apache.org/job/ActiveMQ-Java7/ws/activemq-openwire-generator/target/activemq-openwire-generator-5.9-SNAPSHOT.jar>
to /home/hudson/hudson/jobs/ActiveMQ-Java7/modules/org.apache.activemq$activemq-openwire-generator/builds/2013-07-26_00-26-43/archive/org.apache.activemq/activemq-openwire-generator/5.9-SNAPSHOT/activemq-openwire-generator-5.9-SNAPSHOT.jar
[JENKINS] Archiving <https://builds.apache.org/job/ActiveMQ-Java7/ws/activemq-openwire-generator/target/activemq-openwire-generator-5.9-SNAPSHOT-sources.jar>
to /home/hudson/hudson/jobs/ActiveMQ-Java7/modules/org.apache.activemq$activemq-openwire-generator/builds/2013-07-26_00-26-43/archive/org.apache.activemq/activemq-openwire-generator/5.9-SNAPSHOT/activemq-openwire-generator-5.9-SNAPSHOT-sources.jar
[JENKINS] Archiving <https://builds.apache.org/job/ActiveMQ-Java7/ws/activemq-console/pom.xml>
to /home/hudson/hudson/jobs/ActiveMQ-Java7/modules/org.apache.activemq$activemq-console/builds/2013-07-26_00-26-43/archive/org.apache.activemq/activemq-console/5.9-SNAPSHOT/activemq-console-5.9-SNAPSHOT.pom
[JENKINS] Archiving <https://builds.apache.org/job/ActiveMQ-Java7/ws/activemq-web/pom.xml>
to /home/hudson/hudson/jobs/ActiveMQ-Java7/modules/org.apache.activemq$activemq-web/builds/2013-07-26_00-26-45/archive/org.apache.activemq/activemq-web/5.9-SNAPSHOT/activemq-web-5.9-SNAPSHOT.pom
[JENKINS] Archiving <https://builds.apache.org/job/ActiveMQ-Java7/ws/activemq-log4j-appender/pom.xml>
to /home/hudson/hudson/jobs/ActiveMQ-Java7/modules/org.apache.activemq$activemq-log4j-appender/builds/2013-07-26_00-26-46/archive/org.apache.activemq/activemq-log4j-appender/5.9-SNAPSHOT/activemq-log4j-appender-5.9-SNAPSHOT.pom
[JENKINS] Archiving <https://builds.apache.org/job/ActiveMQ-Java7/ws/activemq-tooling/activemq-memtest-maven-plugin/pom.xml>
to /home/hudson/hudson/jobs/ActiveMQ-Java7/modules/org.apache.activemq.tooling$activemq-memtest-maven-plugin/builds/2013-07-26_00-26-44/archive/org.apache.activemq.tooling/activemq-memtest-maven-plugin/5.9-SNAPSHOT/activemq-memtest-maven-plugin-5.9-SNAPSHOT.pom
[JENKINS] Archiving <https://builds.apache.org/job/ActiveMQ-Java7/ws/activemq-itests-spring31/pom.xml>
to /home/hudson/hudson/jobs/ActiveMQ-Java7/modules/org.apache.activemq$activemq-itests-spring31/builds/2013-07-26_00-26-45/archive/org.apache.activemq/activemq-itests-spring31/5.9-SNAPSHOT/activemq-itests-spring31-5.9-SNAPSHOT.pom
[JENKINS] Archiving <https://builds.apache.org/job/ActiveMQ-Java7/ws/activemq-http/pom.xml>
to /home/hudson/hudson/jobs/ActiveMQ-Java7/modules/org.apache.activemq$activemq-http/builds/2013-07-26_00-26-46/archive/org.apache.activemq/activemq-http/5.9-SNAPSHOT/activemq-http-5.9-SNAPSHOT.pom
[JENKINS] Archiving <https://builds.apache.org/job/ActiveMQ-Java7/ws/activemq-osgi/pom.xml>
to /home/hudson/hudson/jobs/ActiveMQ-Java7/modules/org.apache.activemq$activemq-osgi/builds/2013-07-26_00-26-45/archive/org.apache.activemq/activemq-osgi/5.9-SNAPSHOT/activemq-osgi-5.9-SNAPSHOT.pom
[JENKINS] Archiving <https://builds.apache.org/job/ActiveMQ-Java7/ws/activemq-fileserver/pom.xml>
to /home/hudson/hudson/jobs/ActiveMQ-Java7/modules/org.apache.activemq$activemq-fileserver/builds/2013-07-26_00-26-43/archive/org.apache.activemq/activemq-fileserver/5.9-SNAPSHOT/activemq-fileserver-5.9-SNAPSHOT.pom
[JENKINS] Archiving <https://builds.apache.org/job/ActiveMQ-Java7/ws/activemq-leveldb-store/pom.xml>
to /home/hudson/hudson/jobs/ActiveMQ-Java7/modules/org.apache.activemq$activemq-leveldb-store/builds/2013-07-26_00-26-43/archive/org.apache.activemq/activemq-leveldb-store/5.9-SNAPSHOT/activemq-leveldb-store-5.9-SNAPSHOT.pom
[JENKINS] Archiving <https://builds.apache.org/job/ActiveMQ-Java7/ws/activemq-all/pom.xml>
to /home/hudson/hudson/jobs/ActiveMQ-Java7/modules/org.apache.activemq$activemq-all/builds/2013-07-26_00-26-43/archive/org.apache.activemq/activemq-all/5.9-SNAPSHOT/activemq-all-5.9-SNAPSHOT.pom
[JENKINS] Archiving <https://builds.apache.org/job/ActiveMQ-Java7/ws/activemq-mqtt/pom.xml>
to /home/hudson/hudson/jobs/ActiveMQ-Java7/modules/org.apache.activemq$activemq-mqtt/builds/2013-07-26_00-26-42/archive/org.apache.activemq/activemq-mqtt/5.9-SNAPSHOT/activemq-mqtt-5.9-SNAPSHOT.pom
[JENKINS] Archiving <https://builds.apache.org/job/ActiveMQ-Java7/ws/activemq-tooling/activemq-maven-plugin/pom.xml>
to /home/hudson/hudson/jobs/ActiveMQ-Java7/modules/org.apache.activemq.tooling$activemq-maven-plugin/builds/2013-07-26_00-26-44/archive/org.apache.activemq.tooling/activemq-maven-plugin/5.9-SNAPSHOT/activemq-maven-plugin-5.9-SNAPSHOT.pom
[JENKINS] Archiving <https://builds.apache.org/job/ActiveMQ-Java7/ws/activemq-ra/pom.xml>
to /home/hudson/hudson/jobs/ActiveMQ-Java7/modules/org.apache.activemq$activemq-ra/builds/2013-07-26_00-26-44/archive/org.apache.activemq/activemq-ra/5.9-SNAPSHOT/activemq-ra-5.9-SNAPSHOT.pom
[JENKINS] Archiving <https://builds.apache.org/job/ActiveMQ-Java7/ws/activemq-rar/pom.xml>
to /home/hudson/hudson/jobs/ActiveMQ-Java7/modules/org.apache.activemq$activemq-rar/builds/2013-07-26_00-26-44/archive/org.apache.activemq/activemq-rar/5.9-SNAPSHOT/activemq-rar-5.9-SNAPSHOT.pom
[WARNING] The requested profile "slow-tests" could not be activated because it does not exist.
Waiting for Jenkins to finish collecting data
mavenExecutionResult exceptions not empty
message : Internal error: hudson.remoting.RemotingSystemException: java.io.UTFDataFormatException
cause : java.io.UTFDataFormatException
Stack trace : 
org.apache.maven.InternalErrorException: Internal error: hudson.remoting.RemotingSystemException:
java.io.UTFDataFormatException
	at org.apache.maven.lifecycle.internal.BuilderCommon.handleBuildError(BuilderCommon.java:128)
	at org.apache.maven.lifecycle.internal.LifecycleModuleBuilder.buildProject(LifecycleModuleBuilder.java:95)
	at org.apache.maven.lifecycle.internal.LifecycleModuleBuilder.buildProject(LifecycleModuleBuilder.java:59)
	at org.apache.maven.lifecycle.internal.LifecycleStarter.singleThreadedBuild(LifecycleStarter.java:183)
	at org.apache.maven.lifecycle.internal.LifecycleStarter.execute(LifecycleStarter.java:161)
	at org.apache.maven.DefaultMaven.doExecute(DefaultMaven.java:320)
	at org.apache.maven.DefaultMaven.execute(DefaultMaven.java:156)
	at org.jvnet.hudson.maven3.launcher.Maven3Launcher.main(Maven3Launcher.java:117)
	at sun.reflect.NativeMethodAccessorImpl.invoke0(Native Method)
	at sun.reflect.NativeMethodAccessorImpl.invoke(NativeMethodAccessorImpl.java:57)
	at sun.reflect.DelegatingMethodAccessorImpl.invoke(DelegatingMethodAccessorImpl.java:43)
	at java.lang.reflect.Method.invoke(Method.java:601)
	at org.codehaus.plexus.classworlds.launcher.Launcher.launchStandard(Launcher.java:329)
	at org.codehaus.plexus.classworlds.launcher.Launcher.launch(Launcher.java:239)
	at org.jvnet.hudson.maven3.agent.Maven3Main.launch(Maven3Main.java:178)
	at sun.reflect.NativeMethodAccessorImpl.invoke0(Native Method)
	at sun.reflect.NativeMethodAccessorImpl.invoke(NativeMethodAccessorImpl.java:57)
	at sun.reflect.DelegatingMethodAccessorImpl.invoke(DelegatingMethodAccessorImpl.java:43)
	at java.lang.reflect.Method.invoke(Method.java:601)
	at hudson.maven.Maven3Builder.call(Maven3Builder.java:129)
	at hudson.maven.Maven3Builder.call(Maven3Builder.java:67)
	at hudson.remoting.UserRequest.perform(UserRequest.java:118)
	at hudson.remoting.UserRequest.perform(UserRequest.java:48)
	at hudson.remoting.Request$2.run(Request.java:326)
	at hudson.remoting.InterceptingExecutorService$1.call(InterceptingExecutorService.java:72)
	at java.util.concurrent.FutureTask$Sync.innerRun(FutureTask.java:334)
	at java.util.concurrent.FutureTask.run(FutureTask.java:166)
	at java.util.concurrent.ThreadPoolExecutor.runWorker(ThreadPoolExecutor.java:1110)
	at java.util.concurrent.ThreadPoolExecutor$Worker.run(ThreadPoolExecutor.java:603)
	at java.lang.Thread.run(Thread.java:722)
Caused by: hudson.remoting.RemotingSystemException: java.io.UTFDataFormatException
	at hudson.remoting.RemoteInvocationHandler.invoke(RemoteInvocationHandler.java:183)
	at $Proxy7.setExecutedMojos(Unknown Source)
	at hudson.maven.MavenBuildProxy$Filter.setExecutedMojos(MavenBuildProxy.java:243)
	at hudson.maven.Maven3Builder$MavenExecutionListener.recordMojoEnded(Maven3Builder.java:574)
	at hudson.maven.Maven3Builder$MavenExecutionListener.mojoSucceeded(Maven3Builder.java:560)
	at org.apache.maven.lifecycle.internal.DefaultExecutionEventCatapult.fire(DefaultExecutionEventCatapult.java:87)
	at org.apache.maven.lifecycle.internal.DefaultExecutionEventCatapult.fire(DefaultExecutionEventCatapult.java:42)
	at org.apache.maven.lifecycle.internal.MojoExecutor.execute(MojoExecutor.java:228)
	at org.apache.maven.lifecycle.internal.MojoExecutor.execute(MojoExecutor.java:153)
	at org.apache.maven.lifecycle.internal.MojoExecutor.execute(MojoExecutor.java:145)
	at org.apache.maven.lifecycle.internal.LifecycleModuleBuilder.buildProject(LifecycleModuleBuilder.java:84)
	... 28 more
Caused by: java.io.UTFDataFormatException
	at java.io.ObjectInputStream$BlockDataInputStream.readUTFSpan(ObjectInputStream.java:3105)
	at java.io.ObjectInputStream$BlockDataInputStream.readUTFBody(ObjectInputStream.java:3049)
	at java.io.ObjectInputStream$BlockDataInputStream.readUTF(ObjectInputStream.java:2862)
	at java.io.ObjectInputStream.readString(ObjectInputStream.java:1636)
	at java.io.ObjectInputStream.readObject0(ObjectInputStream.java:1339)
	at java.io.ObjectInputStream.defaultReadFields(ObjectInputStream.java:1989)
	at java.io.ObjectInputStream.readSerialData(ObjectInputStream.java:1913)
	at java.io.ObjectInputStream.readOrdinaryObject(ObjectInputStream.java:1796)
	at java.io.ObjectInputStream.readObject0(ObjectInputStream.java:1348)
	at java.io.ObjectInputStream.readArray(ObjectInputStream.java:1704)
	at java.io.ObjectInputStream.readObject0(ObjectInputStream.java:1342)
	at java.io.ObjectInputStream.defaultReadFields(ObjectInputStream.java:1989)
	at java.io.ObjectInputStream.defaultReadObject(ObjectInputStream.java:499)
	at java.lang.Throwable.readObject(Throwable.java:913)
	at sun.reflect.GeneratedMethodAccessor129.invoke(Unknown Source)
	at sun.reflect.DelegatingMethodAccessorImpl.invoke(DelegatingMethodAccessorImpl.java:43)
	at java.lang.reflect.Method.invoke(Method.java:606)
	at java.io.ObjectStreamClass.invokeReadObject(ObjectStreamClass.java:1017)
	at java.io.ObjectInputStream.readSerialData(ObjectInputStream.java:1891)
	at java.io.ObjectInputStream.readOrdinaryObject(ObjectInputStream.java:1796)
	at java.io.ObjectInputStream.readObject0(ObjectInputStream.java:1348)
	at java.io.ObjectInputStream.defaultReadFields(ObjectInputStream.java:1989)
	at java.io.ObjectInputStream.readSerialData(ObjectInputStream.java:1913)
	at java.io.ObjectInputStream.readOrdinaryObject(ObjectInputStream.java:1796)
	at java.io.ObjectInputStream.readObject0(ObjectInputStream.java:1348)
	at java.io.ObjectInputStream.readObject(ObjectInputStream.java:370)
	at hudson.remoting.UserRequest.deserialize(UserRequest.java:182)
	at hudson.remoting.UserRequest.perform(UserRequest.java:98)
	at hudson.remoting.UserRequest.perform(UserRequest.java:48)
	at hudson.remoting.Request$2.run(Request.java:326)
	at hudson.remoting.InterceptingExecutorService$1.call(InterceptingExecutorService.java:72)
	at java.util.concurrent.FutureTask$Sync.innerRun(FutureTask.java:334)
	at java.util.concurrent.FutureTask.run(FutureTask.java:166)
	at java.util.concurrent.ThreadPoolExecutor.runWorker(ThreadPoolExecutor.java:1145)
	at java.util.concurrent.ThreadPoolExecutor$Worker.run(ThreadPoolExecutor.java:615)
	at java.lang.Thread.run(Thread.java:724)
Sending e-mails to: dev@activemq.apache.org
channel stopped
[locks-and-latches] Releasing all the locks
[locks-and-latches] All the locks released

Mime
View raw message