activemq-dev mailing list archives

Site index · List index
Message view « Date » · « Thread »
Top « Date » · « Thread »
From Apache Jenkins Server <jenk...@builds.apache.org>
Subject Build failed in Jenkins: ActiveMQ #1346
Date Wed, 31 Jul 2013 02:14:59 GMT
See <https://builds.apache.org/job/ActiveMQ/1346/changes>

Changes:

[gtully] https://issues.apache.org/jira/browse/AMQ-4643 - ensure handled ioexceptions are
not propagated back to client when broker or transports are shutdown. additional tests existing
tests refactored to reflect new determinism. IOException handler now throws SuppressReplyException
which is trapped by the transport connector. If store exception need to be processes by the
client, for immediate response rather than failover reconnect, then the ioexception handler
should be configured to ignoreAllErrors

------------------------------------------
[...truncated 7726 lines...]
INFO: ------------------------------------------------------------------------
Jul 31, 2013 2:12:39 AM org.apache.maven.cli.event.ExecutionEventLogger projectSkipped
INFO: Skipping ActiveMQ :: Assembly
Jul 31, 2013 2:12:39 AM org.apache.maven.cli.event.ExecutionEventLogger projectSkipped
INFO: This project has been banned from the build due to previous failures.
Jul 31, 2013 2:12:39 AM org.apache.maven.cli.event.ExecutionEventLogger projectSkipped
INFO: ------------------------------------------------------------------------
Jul 31, 2013 2:12:39 AM org.apache.maven.cli.event.ExecutionEventLogger logReactorSummary
INFO: ------------------------------------------------------------------------
Jul 31, 2013 2:12:39 AM org.apache.maven.cli.event.ExecutionEventLogger logReactorSummary
INFO: Reactor Summary:
Jul 31, 2013 2:12:39 AM org.apache.maven.cli.event.ExecutionEventLogger logReactorSummary
INFO: 
Jul 31, 2013 2:12:39 AM org.apache.maven.cli.event.ExecutionEventLogger logReactorSummary
INFO: ActiveMQ .......................................... SUCCESS [20.289s]
Jul 31, 2013 2:12:39 AM org.apache.maven.cli.event.ExecutionEventLogger logReactorSummary
INFO: ActiveMQ :: Openwire Generator .................... SUCCESS [4.223s]
Jul 31, 2013 2:12:39 AM org.apache.maven.cli.event.ExecutionEventLogger logReactorSummary
INFO: ActiveMQ :: Client ................................ SUCCESS [1:53.288s]
Jul 31, 2013 2:12:39 AM org.apache.maven.cli.event.ExecutionEventLogger logReactorSummary
INFO: ActiveMQ :: Openwire Legacy Support ............... SUCCESS [2.822s]
Jul 31, 2013 2:12:39 AM org.apache.maven.cli.event.ExecutionEventLogger logReactorSummary
INFO: ActiveMQ :: JAAS .................................. SUCCESS [38.736s]
Jul 31, 2013 2:12:39 AM org.apache.maven.cli.event.ExecutionEventLogger logReactorSummary
INFO: ActiveMQ :: Broker ................................ SUCCESS [57.285s]
Jul 31, 2013 2:12:39 AM org.apache.maven.cli.event.ExecutionEventLogger logReactorSummary
INFO: ActiveMQ :: KahaDB Store .......................... SUCCESS [4:40.929s]
Jul 31, 2013 2:12:39 AM org.apache.maven.cli.event.ExecutionEventLogger logReactorSummary
INFO: ActiveMQ :: STOMP Protocol ........................ FAILURE [46:57.648s]
Jul 31, 2013 2:12:39 AM org.apache.maven.cli.event.ExecutionEventLogger logReactorSummary
INFO: ActiveMQ :: MQTT Protocol ......................... SUCCESS [7:57.288s]
Jul 31, 2013 2:12:39 AM org.apache.maven.cli.event.ExecutionEventLogger logReactorSummary
INFO: ActiveMQ :: JDBC Store ............................ SUCCESS [3.257s]
Jul 31, 2013 2:12:39 AM org.apache.maven.cli.event.ExecutionEventLogger logReactorSummary
INFO: ActiveMQ :: LevelDB Store ......................... SUCCESS [6:49.344s]
Jul 31, 2013 2:12:39 AM org.apache.maven.cli.event.ExecutionEventLogger logReactorSummary
INFO: ActiveMQ :: RA .................................... SUCCESS [2:36.341s]
Jul 31, 2013 2:12:39 AM org.apache.maven.cli.event.ExecutionEventLogger logReactorSummary
INFO: ActiveMQ :: Pool .................................. SUCCESS [1:49.819s]
Jul 31, 2013 2:12:39 AM org.apache.maven.cli.event.ExecutionEventLogger logReactorSummary
INFO: ActiveMQ :: Spring ................................ SKIPPED
Jul 31, 2013 2:12:39 AM org.apache.maven.cli.event.ExecutionEventLogger logReactorSummary
INFO: ActiveMQ :: AMQP .................................. SKIPPED
Jul 31, 2013 2:12:39 AM org.apache.maven.cli.event.ExecutionEventLogger logReactorSummary
INFO: ActiveMQ :: Console ............................... SUCCESS [4.465s]
Jul 31, 2013 2:12:39 AM org.apache.maven.cli.event.ExecutionEventLogger logReactorSummary
INFO: ActiveMQ :: Unit Tests ............................ SKIPPED
Jul 31, 2013 2:12:39 AM org.apache.maven.cli.event.ExecutionEventLogger logReactorSummary
INFO: ActiveMQ :: Camel ................................. SKIPPED
Jul 31, 2013 2:12:39 AM org.apache.maven.cli.event.ExecutionEventLogger logReactorSummary
INFO: ActiveMQ :: HTTP Protocol Support ................. SKIPPED
Jul 31, 2013 2:12:39 AM org.apache.maven.cli.event.ExecutionEventLogger logReactorSummary
INFO: ActiveMQ :: All JAR bundle ........................ SKIPPED
Jul 31, 2013 2:12:39 AM org.apache.maven.cli.event.ExecutionEventLogger logReactorSummary
INFO: ActiveMQ :: File Server ........................... SKIPPED
Jul 31, 2013 2:12:39 AM org.apache.maven.cli.event.ExecutionEventLogger logReactorSummary
INFO: ActiveMQ :: Log4j Appender ........................ SUCCESS [6.435s]
Jul 31, 2013 2:12:39 AM org.apache.maven.cli.event.ExecutionEventLogger logReactorSummary
INFO: ActiveMQ :: Apache Karaf .......................... SKIPPED
Jul 31, 2013 2:12:39 AM org.apache.maven.cli.event.ExecutionEventLogger logReactorSummary
INFO: ActiveMQ :: RAR ................................... SKIPPED
Jul 31, 2013 2:12:39 AM org.apache.maven.cli.event.ExecutionEventLogger logReactorSummary
INFO: ActiveMQ :: Run Jar ............................... SUCCESS [4.393s]
Jul 31, 2013 2:12:39 AM org.apache.maven.cli.event.ExecutionEventLogger logReactorSummary
INFO: ActiveMQ :: Tooling ............................... SUCCESS [0.754s]
Jul 31, 2013 2:12:39 AM org.apache.maven.cli.event.ExecutionEventLogger logReactorSummary
INFO: ActiveMQ :: Memory Usage Test Plugin .............. SUCCESS [6.327s]
Jul 31, 2013 2:12:39 AM org.apache.maven.cli.event.ExecutionEventLogger logReactorSummary
INFO: ActiveMQ :: Performance Test Plugin ............... SKIPPED
Jul 31, 2013 2:12:39 AM org.apache.maven.cli.event.ExecutionEventLogger logReactorSummary
INFO: ActiveMQ :: StartUp Plugin ........................ SKIPPED
Jul 31, 2013 2:12:39 AM org.apache.maven.cli.event.ExecutionEventLogger logReactorSummary
INFO: ActiveMQ :: Web ................................... SKIPPED
Jul 31, 2013 2:12:39 AM org.apache.maven.cli.event.ExecutionEventLogger logReactorSummary
INFO: ActiveMQ :: OSGi bundle ........................... SKIPPED
Jul 31, 2013 2:12:39 AM org.apache.maven.cli.event.ExecutionEventLogger logReactorSummary
INFO: ActiveMQ :: Blueprint ............................. SUCCESS [8.799s]
Jul 31, 2013 2:12:39 AM org.apache.maven.cli.event.ExecutionEventLogger logReactorSummary
INFO: ActiveMQ :: Web Demo .............................. SKIPPED
Jul 31, 2013 2:12:39 AM org.apache.maven.cli.event.ExecutionEventLogger logReactorSummary
INFO: ActiveMQ :: Web Console ........................... SKIPPED
Jul 31, 2013 2:12:39 AM org.apache.maven.cli.event.ExecutionEventLogger logReactorSummary
INFO: ActiveMQ :: Karaf Integration Tests ............... SKIPPED
Jul 31, 2013 2:12:39 AM org.apache.maven.cli.event.ExecutionEventLogger logReactorSummary
INFO: ActiveMQ :: Integration Test :: Spring 3.1 ........ SKIPPED
Jul 31, 2013 2:12:39 AM org.apache.maven.cli.event.ExecutionEventLogger logReactorSummary
INFO: ActiveMQ :: Assembly .............................. SKIPPED
Jul 31, 2013 2:12:39 AM org.apache.maven.cli.event.ExecutionEventLogger logResult
INFO: ------------------------------------------------------------------------
Jul 31, 2013 2:12:39 AM org.apache.maven.cli.event.ExecutionEventLogger logResult
INFO: BUILD FAILURE
Jul 31, 2013 2:12:39 AM org.apache.maven.cli.event.ExecutionEventLogger logStats
INFO: ------------------------------------------------------------------------
Jul 31, 2013 2:12:39 AM org.apache.maven.cli.event.ExecutionEventLogger logStats
INFO: Total time: 1:15:30.171s
Jul 31, 2013 2:12:39 AM org.apache.maven.cli.event.ExecutionEventLogger logStats
INFO: Finished at: Wed Jul 31 02:12:39 UTC 2013
Jul 31, 2013 2:12:39 AM org.apache.maven.cli.event.ExecutionEventLogger logStats
INFO: Final Memory: 77M/1159M
Jul 31, 2013 2:12:39 AM org.apache.maven.cli.event.ExecutionEventLogger sessionEnded
INFO: ------------------------------------------------------------------------
[JENKINS] Archiving <https://builds.apache.org/job/ActiveMQ/ws/pom.xml> to /home/hudson/hudson/jobs/ActiveMQ/modules/org.apache.activemq$activemq-parent/builds/2013-07-31_00-56-55/archive/org.apache.activemq/activemq-parent/5.9-SNAPSHOT/activemq-parent-5.9-SNAPSHOT.pom
[JENKINS] Archiving <https://builds.apache.org/job/ActiveMQ/ws/activemq-client/pom.xml>
to /home/hudson/hudson/jobs/ActiveMQ/modules/org.apache.activemq$activemq-client/builds/2013-07-31_00-56-55/archive/org.apache.activemq/activemq-client/5.9-SNAPSHOT/activemq-client-5.9-SNAPSHOT.pom
[JENKINS] Archiving <https://builds.apache.org/job/ActiveMQ/ws/activemq-client/target/activemq-client-5.9-SNAPSHOT.jar>
to /home/hudson/hudson/jobs/ActiveMQ/modules/org.apache.activemq$activemq-client/builds/2013-07-31_00-56-55/archive/org.apache.activemq/activemq-client/5.9-SNAPSHOT/activemq-client-5.9-SNAPSHOT.jar
[JENKINS] Archiving <https://builds.apache.org/job/ActiveMQ/ws/assembly/pom.xml> to
/home/hudson/hudson/jobs/ActiveMQ/modules/org.apache.activemq$apache-activemq/builds/2013-07-31_00-56-59/archive/org.apache.activemq/apache-activemq/5.9-SNAPSHOT/apache-activemq-5.9-SNAPSHOT.pom
[JENKINS] Archiving <https://builds.apache.org/job/ActiveMQ/ws/activemq-camel/pom.xml>
to /home/hudson/hudson/jobs/ActiveMQ/modules/org.apache.activemq$activemq-camel/builds/2013-07-31_00-56-57/archive/org.apache.activemq/activemq-camel/5.9-SNAPSHOT/activemq-camel-5.9-SNAPSHOT.pom
[JENKINS] Archiving <https://builds.apache.org/job/ActiveMQ/ws/activemq-tooling/pom.xml>
to /home/hudson/hudson/jobs/ActiveMQ/modules/org.apache.activemq.tooling$activemq-tooling/builds/2013-07-31_00-56-58/archive/org.apache.activemq.tooling/activemq-tooling/5.9-SNAPSHOT/activemq-tooling-5.9-SNAPSHOT.pom
[JENKINS] Archiving <https://builds.apache.org/job/ActiveMQ/ws/activemq-pool/pom.xml>
to /home/hudson/hudson/jobs/ActiveMQ/modules/org.apache.activemq$activemq-pool/builds/2013-07-31_00-56-58/archive/org.apache.activemq/activemq-pool/5.9-SNAPSHOT/activemq-pool-5.9-SNAPSHOT.pom
[JENKINS] Archiving <https://builds.apache.org/job/ActiveMQ/ws/activemq-pool/target/activemq-pool-5.9-SNAPSHOT.jar>
to /home/hudson/hudson/jobs/ActiveMQ/modules/org.apache.activemq$activemq-pool/builds/2013-07-31_00-56-58/archive/org.apache.activemq/activemq-pool/5.9-SNAPSHOT/activemq-pool-5.9-SNAPSHOT.jar
[JENKINS] Archiving <https://builds.apache.org/job/ActiveMQ/ws/activemq-karaf-itest/pom.xml>
to /home/hudson/hudson/jobs/ActiveMQ/modules/org.apache.activemq$activemq-karaf-itest/builds/2013-07-31_00-56-59/archive/org.apache.activemq/activemq-karaf-itest/5.9-SNAPSHOT/activemq-karaf-itest-5.9-SNAPSHOT.pom
[JENKINS] Archiving <https://builds.apache.org/job/ActiveMQ/ws/activemq-broker/pom.xml>
to /home/hudson/hudson/jobs/ActiveMQ/modules/org.apache.activemq$activemq-broker/builds/2013-07-31_00-56-55/archive/org.apache.activemq/activemq-broker/5.9-SNAPSHOT/activemq-broker-5.9-SNAPSHOT.pom
[JENKINS] Archiving <https://builds.apache.org/job/ActiveMQ/ws/activemq-broker/target/activemq-broker-5.9-SNAPSHOT.jar>
to /home/hudson/hudson/jobs/ActiveMQ/modules/org.apache.activemq$activemq-broker/builds/2013-07-31_00-56-55/archive/org.apache.activemq/activemq-broker/5.9-SNAPSHOT/activemq-broker-5.9-SNAPSHOT.jar
[JENKINS] Archiving <https://builds.apache.org/job/ActiveMQ/ws/activemq-broker/target/activemq-broker-5.9-SNAPSHOT-tests.jar>
to /home/hudson/hudson/jobs/ActiveMQ/modules/org.apache.activemq$activemq-broker/builds/2013-07-31_00-56-55/archive/org.apache.activemq/activemq-broker/5.9-SNAPSHOT/activemq-broker-5.9-SNAPSHOT-tests.jar
[JENKINS] Archiving <https://builds.apache.org/job/ActiveMQ/ws/activemq-tooling/activemq-perf-maven-plugin/pom.xml>
to /home/hudson/hudson/jobs/ActiveMQ/modules/org.apache.activemq.tooling$activemq-perf-maven-plugin/builds/2013-07-31_00-56-58/archive/org.apache.activemq.tooling/activemq-perf-maven-plugin/5.9-SNAPSHOT/activemq-perf-maven-plugin-5.9-SNAPSHOT.pom
[JENKINS] Archiving <https://builds.apache.org/job/ActiveMQ/ws/activemq-kahadb-store/pom.xml>
to /home/hudson/hudson/jobs/ActiveMQ/modules/org.apache.activemq$activemq-kahadb-store/builds/2013-07-31_00-56-56/archive/org.apache.activemq/activemq-kahadb-store/5.9-SNAPSHOT/activemq-kahadb-store-5.9-SNAPSHOT.pom
[JENKINS] Archiving <https://builds.apache.org/job/ActiveMQ/ws/activemq-kahadb-store/target/activemq-kahadb-store-5.9-SNAPSHOT.jar>
to /home/hudson/hudson/jobs/ActiveMQ/modules/org.apache.activemq$activemq-kahadb-store/builds/2013-07-31_00-56-56/archive/org.apache.activemq/activemq-kahadb-store/5.9-SNAPSHOT/activemq-kahadb-store-5.9-SNAPSHOT.jar
[JENKINS] Archiving <https://builds.apache.org/job/ActiveMQ/ws/activemq-blueprint/pom.xml>
to /home/hudson/hudson/jobs/ActiveMQ/modules/org.apache.activemq$activemq-blueprint/builds/2013-07-31_00-56-59/archive/org.apache.activemq/activemq-blueprint/5.9-SNAPSHOT/activemq-blueprint-5.9-SNAPSHOT.pom
[JENKINS] Archiving <https://builds.apache.org/job/ActiveMQ/ws/activemq-blueprint/target/activemq-blueprint-5.9-SNAPSHOT.jar>
to /home/hudson/hudson/jobs/ActiveMQ/modules/org.apache.activemq$activemq-blueprint/builds/2013-07-31_00-56-59/archive/org.apache.activemq/activemq-blueprint/5.9-SNAPSHOT/activemq-blueprint-5.9-SNAPSHOT.jar
[JENKINS] Archiving <https://builds.apache.org/job/ActiveMQ/ws/activemq-stomp/pom.xml>
to /home/hudson/hudson/jobs/ActiveMQ/modules/org.apache.activemq$activemq-stomp/builds/2013-07-31_00-56-56/archive/org.apache.activemq/activemq-stomp/5.9-SNAPSHOT/activemq-stomp-5.9-SNAPSHOT.pom
[JENKINS] Archiving <https://builds.apache.org/job/ActiveMQ/ws/activemq-unit-tests/pom.xml>
to /home/hudson/hudson/jobs/ActiveMQ/modules/org.apache.activemq$activemq-unit-tests/builds/2013-07-31_00-56-57/archive/org.apache.activemq/activemq-unit-tests/5.9-SNAPSHOT/activemq-unit-tests-5.9-SNAPSHOT.pom
[JENKINS] Archiving <https://builds.apache.org/job/ActiveMQ/ws/activemq-spring/pom.xml>
to /home/hudson/hudson/jobs/ActiveMQ/modules/org.apache.activemq$activemq-spring/builds/2013-07-31_00-56-58/archive/org.apache.activemq/activemq-spring/5.9-SNAPSHOT/activemq-spring-5.9-SNAPSHOT.pom
[JENKINS] Archiving <https://builds.apache.org/job/ActiveMQ/ws/activemq-openwire-legacy/pom.xml>
to /home/hudson/hudson/jobs/ActiveMQ/modules/org.apache.activemq$activemq-openwire-legacy/builds/2013-07-31_00-56-55/archive/org.apache.activemq/activemq-openwire-legacy/5.9-SNAPSHOT/activemq-openwire-legacy-5.9-SNAPSHOT.pom
[JENKINS] Archiving <https://builds.apache.org/job/ActiveMQ/ws/activemq-openwire-legacy/target/activemq-openwire-legacy-5.9-SNAPSHOT.jar>
to /home/hudson/hudson/jobs/ActiveMQ/modules/org.apache.activemq$activemq-openwire-legacy/builds/2013-07-31_00-56-55/archive/org.apache.activemq/activemq-openwire-legacy/5.9-SNAPSHOT/activemq-openwire-legacy-5.9-SNAPSHOT.jar
[JENKINS] Archiving <https://builds.apache.org/job/ActiveMQ/ws/activemq-karaf/pom.xml>
to /home/hudson/hudson/jobs/ActiveMQ/modules/org.apache.activemq$activemq-karaf/builds/2013-07-31_00-56-57/archive/org.apache.activemq/activemq-karaf/5.9-SNAPSHOT/activemq-karaf-5.9-SNAPSHOT.pom
[JENKINS] Archiving <https://builds.apache.org/job/ActiveMQ/ws/activemq-web-demo/pom.xml>
to /home/hudson/hudson/jobs/ActiveMQ/modules/org.apache.activemq$activemq-web-demo/builds/2013-07-31_00-56-59/archive/org.apache.activemq/activemq-web-demo/5.9-SNAPSHOT/activemq-web-demo-5.9-SNAPSHOT.pom
[JENKINS] Archiving <https://builds.apache.org/job/ActiveMQ/ws/activemq-web-console/pom.xml>
to /home/hudson/hudson/jobs/ActiveMQ/modules/org.apache.activemq$activemq-web-console/builds/2013-07-31_00-56-59/archive/org.apache.activemq/activemq-web-console/5.9-SNAPSHOT/activemq-web-console-5.9-SNAPSHOT.pom
[JENKINS] Archiving <https://builds.apache.org/job/ActiveMQ/ws/activemq-jdbc-store/pom.xml>
to /home/hudson/hudson/jobs/ActiveMQ/modules/org.apache.activemq$activemq-jdbc-store/builds/2013-07-31_00-56-56/archive/org.apache.activemq/activemq-jdbc-store/5.9-SNAPSHOT/activemq-jdbc-store-5.9-SNAPSHOT.pom
[JENKINS] Archiving <https://builds.apache.org/job/ActiveMQ/ws/activemq-jdbc-store/target/activemq-jdbc-store-5.9-SNAPSHOT.jar>
to /home/hudson/hudson/jobs/ActiveMQ/modules/org.apache.activemq$activemq-jdbc-store/builds/2013-07-31_00-56-56/archive/org.apache.activemq/activemq-jdbc-store/5.9-SNAPSHOT/activemq-jdbc-store-5.9-SNAPSHOT.jar
[JENKINS] Archiving <https://builds.apache.org/job/ActiveMQ/ws/activemq-jaas/pom.xml>
to /home/hudson/hudson/jobs/ActiveMQ/modules/org.apache.activemq$activemq-jaas/builds/2013-07-31_00-56-57/archive/org.apache.activemq/activemq-jaas/5.9-SNAPSHOT/activemq-jaas-5.9-SNAPSHOT.pom
[JENKINS] Archiving <https://builds.apache.org/job/ActiveMQ/ws/activemq-jaas/target/activemq-jaas-5.9-SNAPSHOT.jar>
to /home/hudson/hudson/jobs/ActiveMQ/modules/org.apache.activemq$activemq-jaas/builds/2013-07-31_00-56-57/archive/org.apache.activemq/activemq-jaas/5.9-SNAPSHOT/activemq-jaas-5.9-SNAPSHOT.jar
[JENKINS] Archiving <https://builds.apache.org/job/ActiveMQ/ws/activemq-run/dependency-reduced-pom.xml>
to /home/hudson/hudson/jobs/ActiveMQ/modules/org.apache.activemq$activemq-run/builds/2013-07-31_00-56-58/archive/org.apache.activemq/activemq-run/5.9-SNAPSHOT/activemq-run-5.9-SNAPSHOT.pom
[JENKINS] Archiving <https://builds.apache.org/job/ActiveMQ/ws/activemq-run/target/activemq-run-5.9-SNAPSHOT.jar>
to /home/hudson/hudson/jobs/ActiveMQ/modules/org.apache.activemq$activemq-run/builds/2013-07-31_00-56-58/archive/org.apache.activemq/activemq-run/5.9-SNAPSHOT/activemq-run-5.9-SNAPSHOT.jar
[JENKINS] Archiving <https://builds.apache.org/job/ActiveMQ/ws/activemq-amqp/pom.xml>
to /home/hudson/hudson/jobs/ActiveMQ/modules/org.apache.activemq$activemq-amqp/builds/2013-07-31_00-56-56/archive/org.apache.activemq/activemq-amqp/5.9-SNAPSHOT/activemq-amqp-5.9-SNAPSHOT.pom
[JENKINS] Archiving <https://builds.apache.org/job/ActiveMQ/ws/activemq-openwire-generator/pom.xml>
to /home/hudson/hudson/jobs/ActiveMQ/modules/org.apache.activemq$activemq-openwire-generator/builds/2013-07-31_00-56-57/archive/org.apache.activemq/activemq-openwire-generator/5.9-SNAPSHOT/activemq-openwire-generator-5.9-SNAPSHOT.pom
[JENKINS] Archiving <https://builds.apache.org/job/ActiveMQ/ws/activemq-openwire-generator/target/activemq-openwire-generator-5.9-SNAPSHOT.jar>
to /home/hudson/hudson/jobs/ActiveMQ/modules/org.apache.activemq$activemq-openwire-generator/builds/2013-07-31_00-56-57/archive/org.apache.activemq/activemq-openwire-generator/5.9-SNAPSHOT/activemq-openwire-generator-5.9-SNAPSHOT.jar
[JENKINS] Archiving <https://builds.apache.org/job/ActiveMQ/ws/activemq-web/pom.xml>
to /home/hudson/hudson/jobs/ActiveMQ/modules/org.apache.activemq$activemq-web/builds/2013-07-31_00-56-59/archive/org.apache.activemq/activemq-web/5.9-SNAPSHOT/activemq-web-5.9-SNAPSHOT.pom
[JENKINS] Archiving <https://builds.apache.org/job/ActiveMQ/ws/activemq-console/pom.xml>
to /home/hudson/hudson/jobs/ActiveMQ/modules/org.apache.activemq$activemq-console/builds/2013-07-31_00-56-57/archive/org.apache.activemq/activemq-console/5.9-SNAPSHOT/activemq-console-5.9-SNAPSHOT.pom
[JENKINS] Archiving <https://builds.apache.org/job/ActiveMQ/ws/activemq-console/target/activemq-console-5.9-SNAPSHOT.jar>
to /home/hudson/hudson/jobs/ActiveMQ/modules/org.apache.activemq$activemq-console/builds/2013-07-31_00-56-57/archive/org.apache.activemq/activemq-console/5.9-SNAPSHOT/activemq-console-5.9-SNAPSHOT.jar
[JENKINS] Archiving <https://builds.apache.org/job/ActiveMQ/ws/activemq-log4j-appender/pom.xml>
to /home/hudson/hudson/jobs/ActiveMQ/modules/org.apache.activemq$activemq-log4j-appender/builds/2013-07-31_00-57-00/archive/org.apache.activemq/activemq-log4j-appender/5.9-SNAPSHOT/activemq-log4j-appender-5.9-SNAPSHOT.pom
[JENKINS] Archiving <https://builds.apache.org/job/ActiveMQ/ws/activemq-log4j-appender/target/activemq-log4j-appender-5.9-SNAPSHOT.jar>
to /home/hudson/hudson/jobs/ActiveMQ/modules/org.apache.activemq$activemq-log4j-appender/builds/2013-07-31_00-57-00/archive/org.apache.activemq/activemq-log4j-appender/5.9-SNAPSHOT/activemq-log4j-appender-5.9-SNAPSHOT.jar
[JENKINS] Archiving <https://builds.apache.org/job/ActiveMQ/ws/activemq-tooling/activemq-memtest-maven-plugin/pom.xml>
to /home/hudson/hudson/jobs/ActiveMQ/modules/org.apache.activemq.tooling$activemq-memtest-maven-plugin/builds/2013-07-31_00-56-58/archive/org.apache.activemq.tooling/activemq-memtest-maven-plugin/5.9-SNAPSHOT/activemq-memtest-maven-plugin-5.9-SNAPSHOT.pom
[JENKINS] Archiving <https://builds.apache.org/job/ActiveMQ/ws/activemq-tooling/activemq-memtest-maven-plugin/target/activemq-memtest-maven-plugin-5.9-SNAPSHOT.jar>
to /home/hudson/hudson/jobs/ActiveMQ/modules/org.apache.activemq.tooling$activemq-memtest-maven-plugin/builds/2013-07-31_00-56-58/archive/org.apache.activemq.tooling/activemq-memtest-maven-plugin/5.9-SNAPSHOT/activemq-memtest-maven-plugin-5.9-SNAPSHOT.jar
[JENKINS] Archiving <https://builds.apache.org/job/ActiveMQ/ws/activemq-itests-spring31/pom.xml>
to /home/hudson/hudson/jobs/ActiveMQ/modules/org.apache.activemq$activemq-itests-spring31/builds/2013-07-31_00-56-59/archive/org.apache.activemq/activemq-itests-spring31/5.9-SNAPSHOT/activemq-itests-spring31-5.9-SNAPSHOT.pom
[JENKINS] Archiving <https://builds.apache.org/job/ActiveMQ/ws/activemq-http/pom.xml>
to /home/hudson/hudson/jobs/ActiveMQ/modules/org.apache.activemq$activemq-http/builds/2013-07-31_00-57-00/archive/org.apache.activemq/activemq-http/5.9-SNAPSHOT/activemq-http-5.9-SNAPSHOT.pom
[JENKINS] Archiving <https://builds.apache.org/job/ActiveMQ/ws/activemq-osgi/pom.xml>
to /home/hudson/hudson/jobs/ActiveMQ/modules/org.apache.activemq$activemq-osgi/builds/2013-07-31_00-56-59/archive/org.apache.activemq/activemq-osgi/5.9-SNAPSHOT/activemq-osgi-5.9-SNAPSHOT.pom
[JENKINS] Archiving <https://builds.apache.org/job/ActiveMQ/ws/activemq-fileserver/pom.xml>
to /home/hudson/hudson/jobs/ActiveMQ/modules/org.apache.activemq$activemq-fileserver/builds/2013-07-31_00-56-57/archive/org.apache.activemq/activemq-fileserver/5.9-SNAPSHOT/activemq-fileserver-5.9-SNAPSHOT.pom
[JENKINS] Archiving <https://builds.apache.org/job/ActiveMQ/ws/activemq-leveldb-store/pom.xml>
to /home/hudson/hudson/jobs/ActiveMQ/modules/org.apache.activemq$activemq-leveldb-store/builds/2013-07-31_00-56-57/archive/org.apache.activemq/activemq-leveldb-store/5.9-SNAPSHOT/activemq-leveldb-store-5.9-SNAPSHOT.pom
[JENKINS] Archiving <https://builds.apache.org/job/ActiveMQ/ws/activemq-leveldb-store/target/activemq-leveldb-store-5.9-SNAPSHOT.jar>
to /home/hudson/hudson/jobs/ActiveMQ/modules/org.apache.activemq$activemq-leveldb-store/builds/2013-07-31_00-56-57/archive/org.apache.activemq/activemq-leveldb-store/5.9-SNAPSHOT/activemq-leveldb-store-5.9-SNAPSHOT.jar
[JENKINS] Archiving <https://builds.apache.org/job/ActiveMQ/ws/activemq-all/pom.xml>
to /home/hudson/hudson/jobs/ActiveMQ/modules/org.apache.activemq$activemq-all/builds/2013-07-31_00-56-57/archive/org.apache.activemq/activemq-all/5.9-SNAPSHOT/activemq-all-5.9-SNAPSHOT.pom
[JENKINS] Archiving <https://builds.apache.org/job/ActiveMQ/ws/activemq-mqtt/pom.xml>
to /home/hudson/hudson/jobs/ActiveMQ/modules/org.apache.activemq$activemq-mqtt/builds/2013-07-31_00-56-56/archive/org.apache.activemq/activemq-mqtt/5.9-SNAPSHOT/activemq-mqtt-5.9-SNAPSHOT.pom
[JENKINS] Archiving <https://builds.apache.org/job/ActiveMQ/ws/activemq-mqtt/target/activemq-mqtt-5.9-SNAPSHOT.jar>
to /home/hudson/hudson/jobs/ActiveMQ/modules/org.apache.activemq$activemq-mqtt/builds/2013-07-31_00-56-56/archive/org.apache.activemq/activemq-mqtt/5.9-SNAPSHOT/activemq-mqtt-5.9-SNAPSHOT.jar
[JENKINS] Archiving <https://builds.apache.org/job/ActiveMQ/ws/activemq-tooling/activemq-maven-plugin/pom.xml>
to /home/hudson/hudson/jobs/ActiveMQ/modules/org.apache.activemq.tooling$activemq-maven-plugin/builds/2013-07-31_00-56-59/archive/org.apache.activemq.tooling/activemq-maven-plugin/5.9-SNAPSHOT/activemq-maven-plugin-5.9-SNAPSHOT.pom
[JENKINS] Archiving <https://builds.apache.org/job/ActiveMQ/ws/activemq-ra/pom.xml>
to /home/hudson/hudson/jobs/ActiveMQ/modules/org.apache.activemq$activemq-ra/builds/2013-07-31_00-56-58/archive/org.apache.activemq/activemq-ra/5.9-SNAPSHOT/activemq-ra-5.9-SNAPSHOT.pom
[JENKINS] Archiving <https://builds.apache.org/job/ActiveMQ/ws/activemq-ra/target/activemq-ra-5.9-SNAPSHOT.jar>
to /home/hudson/hudson/jobs/ActiveMQ/modules/org.apache.activemq$activemq-ra/builds/2013-07-31_00-56-58/archive/org.apache.activemq/activemq-ra/5.9-SNAPSHOT/activemq-ra-5.9-SNAPSHOT.jar
[JENKINS] Archiving <https://builds.apache.org/job/ActiveMQ/ws/activemq-ra/target/xbean/activemq-ra.xsd>
to /home/hudson/hudson/jobs/ActiveMQ/modules/org.apache.activemq$activemq-ra/builds/2013-07-31_00-56-58/archive/org.apache.activemq/activemq-ra/5.9-SNAPSHOT/activemq-ra-5.9-SNAPSHOT.xsd
[JENKINS] Archiving <https://builds.apache.org/job/ActiveMQ/ws/activemq-ra/target/xbean/activemq-ra.xsd.html>
to /home/hudson/hudson/jobs/ActiveMQ/modules/org.apache.activemq$activemq-ra/builds/2013-07-31_00-56-58/archive/org.apache.activemq/activemq-ra/5.9-SNAPSHOT/activemq-ra-5.9-SNAPSHOT-schema.html
[JENKINS] Archiving <https://builds.apache.org/job/ActiveMQ/ws/activemq-ra/target/xbean/activemq-ra.xsd.html>
to /home/hudson/hudson/jobs/ActiveMQ/modules/org.apache.activemq$activemq-ra/builds/2013-07-31_00-56-58/archive/org.apache.activemq/activemq-ra/5.9-SNAPSHOT/activemq-ra-5.9-SNAPSHOT.xsd.html
[JENKINS] Archiving <https://builds.apache.org/job/ActiveMQ/ws/activemq-rar/pom.xml>
to /home/hudson/hudson/jobs/ActiveMQ/modules/org.apache.activemq$activemq-rar/builds/2013-07-31_00-56-58/archive/org.apache.activemq/activemq-rar/5.9-SNAPSHOT/activemq-rar-5.9-SNAPSHOT.pom
Waiting for Jenkins to finish collecting data
mavenExecutionResult exceptions not empty
message : Internal error: hudson.remoting.RemotingSystemException: java.io.UTFDataFormatException
cause : java.io.UTFDataFormatException
Stack trace : 
org.apache.maven.InternalErrorException: Internal error: hudson.remoting.RemotingSystemException:
java.io.UTFDataFormatException
	at org.apache.maven.lifecycle.internal.BuilderCommon.handleBuildError(BuilderCommon.java:128)
	at org.apache.maven.lifecycle.internal.LifecycleModuleBuilder.buildProject(LifecycleModuleBuilder.java:95)
	at org.apache.maven.lifecycle.internal.LifecycleModuleBuilder.buildProject(LifecycleModuleBuilder.java:59)
	at org.apache.maven.lifecycle.internal.LifecycleStarter.singleThreadedBuild(LifecycleStarter.java:183)
	at org.apache.maven.lifecycle.internal.LifecycleStarter.execute(LifecycleStarter.java:161)
	at org.apache.maven.DefaultMaven.doExecute(DefaultMaven.java:320)
	at org.apache.maven.DefaultMaven.execute(DefaultMaven.java:156)
	at org.jvnet.hudson.maven3.launcher.Maven3Launcher.main(Maven3Launcher.java:117)
	at sun.reflect.NativeMethodAccessorImpl.invoke0(Native Method)
	at sun.reflect.NativeMethodAccessorImpl.invoke(NativeMethodAccessorImpl.java:39)
	at sun.reflect.DelegatingMethodAccessorImpl.invoke(DelegatingMethodAccessorImpl.java:25)
	at java.lang.reflect.Method.invoke(Method.java:597)
	at org.codehaus.plexus.classworlds.launcher.Launcher.launchStandard(Launcher.java:329)
	at org.codehaus.plexus.classworlds.launcher.Launcher.launch(Launcher.java:239)
	at org.jvnet.hudson.maven3.agent.Maven3Main.launch(Maven3Main.java:178)
	at sun.reflect.NativeMethodAccessorImpl.invoke0(Native Method)
	at sun.reflect.NativeMethodAccessorImpl.invoke(NativeMethodAccessorImpl.java:39)
	at sun.reflect.DelegatingMethodAccessorImpl.invoke(DelegatingMethodAccessorImpl.java:25)
	at java.lang.reflect.Method.invoke(Method.java:597)
	at hudson.maven.Maven3Builder.call(Maven3Builder.java:129)
	at hudson.maven.Maven3Builder.call(Maven3Builder.java:67)
	at hudson.remoting.UserRequest.perform(UserRequest.java:118)
	at hudson.remoting.UserRequest.perform(UserRequest.java:48)
	at hudson.remoting.Request$2.run(Request.java:326)
	at hudson.remoting.InterceptingExecutorService$1.call(InterceptingExecutorService.java:72)
	at java.util.concurrent.FutureTask$Sync.innerRun(FutureTask.java:303)
	at java.util.concurrent.FutureTask.run(FutureTask.java:138)
	at java.util.concurrent.ThreadPoolExecutor$Worker.runTask(ThreadPoolExecutor.java:895)
	at java.util.concurrent.ThreadPoolExecutor$Worker.run(ThreadPoolExecutor.java:918)
	at java.lang.Thread.run(Thread.java:662)
Caused by: hudson.remoting.RemotingSystemException: java.io.UTFDataFormatException
	at hudson.remoting.RemoteInvocationHandler.invoke(RemoteInvocationHandler.java:183)
	at com.sun.proxy.$Proxy7.setExecutedMojos(Unknown Source)
	at hudson.maven.MavenBuildProxy$Filter.setExecutedMojos(MavenBuildProxy.java:243)
	at hudson.maven.Maven3Builder$MavenExecutionListener.recordMojoEnded(Maven3Builder.java:574)
	at hudson.maven.Maven3Builder$MavenExecutionListener.mojoSucceeded(Maven3Builder.java:560)
	at org.apache.maven.lifecycle.internal.DefaultExecutionEventCatapult.fire(DefaultExecutionEventCatapult.java:87)
	at org.apache.maven.lifecycle.internal.DefaultExecutionEventCatapult.fire(DefaultExecutionEventCatapult.java:42)
	at org.apache.maven.lifecycle.internal.MojoExecutor.execute(MojoExecutor.java:228)
	at org.apache.maven.lifecycle.internal.MojoExecutor.execute(MojoExecutor.java:153)
	at org.apache.maven.lifecycle.internal.MojoExecutor.execute(MojoExecutor.java:145)
	at org.apache.maven.lifecycle.internal.LifecycleModuleBuilder.buildProject(LifecycleModuleBuilder.java:84)
	... 28 more
Caused by: java.io.UTFDataFormatException
	at java.io.ObjectInputStream$BlockDataInputStream.readUTFSpan(ObjectInputStream.java:3124)
	at java.io.ObjectInputStream$BlockDataInputStream.readUTFBody(ObjectInputStream.java:3049)
	at java.io.ObjectInputStream$BlockDataInputStream.readUTF(ObjectInputStream.java:2862)
	at java.io.ObjectInputStream.readString(ObjectInputStream.java:1636)
	at java.io.ObjectInputStream.readObject0(ObjectInputStream.java:1339)
	at java.io.ObjectInputStream.defaultReadFields(ObjectInputStream.java:1989)
	at java.io.ObjectInputStream.readSerialData(ObjectInputStream.java:1913)
	at java.io.ObjectInputStream.readOrdinaryObject(ObjectInputStream.java:1796)
	at java.io.ObjectInputStream.readObject0(ObjectInputStream.java:1348)
	at java.io.ObjectInputStream.readArray(ObjectInputStream.java:1704)
	at java.io.ObjectInputStream.readObject0(ObjectInputStream.java:1342)
	at java.io.ObjectInputStream.defaultReadFields(ObjectInputStream.java:1989)
	at java.io.ObjectInputStream.defaultReadObject(ObjectInputStream.java:499)
	at java.lang.Throwable.readObject(Throwable.java:913)
	at sun.reflect.GeneratedMethodAccessor129.invoke(Unknown Source)
	at sun.reflect.DelegatingMethodAccessorImpl.invoke(DelegatingMethodAccessorImpl.java:43)
	at java.lang.reflect.Method.invoke(Method.java:606)
	at java.io.ObjectStreamClass.invokeReadObject(ObjectStreamClass.java:1017)
	at java.io.ObjectInputStream.readSerialData(ObjectInputStream.java:1891)
	at java.io.ObjectInputStream.readOrdinaryObject(ObjectInputStream.java:1796)
	at java.io.ObjectInputStream.readObject0(ObjectInputStream.java:1348)
	at java.io.ObjectInputStream.defaultReadFields(ObjectInputStream.java:1989)
	at java.io.ObjectInputStream.readSerialData(ObjectInputStream.java:1913)
	at java.io.ObjectInputStream.readOrdinaryObject(ObjectInputStream.java:1796)
	at java.io.ObjectInputStream.readObject0(ObjectInputStream.java:1348)
	at java.io.ObjectInputStream.readObject(ObjectInputStream.java:370)
	at hudson.remoting.UserRequest.deserialize(UserRequest.java:182)
	at hudson.remoting.UserRequest.perform(UserRequest.java:98)
	at hudson.remoting.UserRequest.perform(UserRequest.java:48)
	at hudson.remoting.Request$2.run(Request.java:326)
	at hudson.remoting.InterceptingExecutorService$1.call(InterceptingExecutorService.java:72)
	at java.util.concurrent.FutureTask$Sync.innerRun(FutureTask.java:334)
	at java.util.concurrent.FutureTask.run(FutureTask.java:166)
	at java.util.concurrent.ThreadPoolExecutor.runWorker(ThreadPoolExecutor.java:1145)
	at java.util.concurrent.ThreadPoolExecutor$Worker.run(ThreadPoolExecutor.java:615)
	at java.lang.Thread.run(Thread.java:724)
Maven failed with error.
Sending e-mails to: dev@activemq.apache.org
channel stopped
[locks-and-latches] Releasing all the locks
[locks-and-latches] All the locks released

Mime
View raw message