activemq-dev mailing list archives

Site index · List index
Message view « Date » · « Thread »
Top « Date » · « Thread »
From Apache Jenkins Server <jenk...@builds.apache.org>
Subject Build failed in Jenkins: ActiveMQ #1323
Date Fri, 28 Jun 2013 01:45:00 GMT
See <https://builds.apache.org/job/ActiveMQ/1323/changes>

Changes:

[dejanb] https://issues.apache.org/jira/browse/AMQ-4098 - fix favicon for web apps

------------------------------------------
[...truncated 6865 lines...]

[WARNING] Bundle org.apache.activemq:activemq-blueprint:bundle:5.9-SNAPSHOT : Superfluous
export-package instructions: [org.apache.activemq**]
[INFO] 
[INFO] --- maven-site-plugin:3.1:attach-descriptor (attach-descriptor) @ activemq-blueprint
---
[INFO] [INFO] Checking legal files in: activemq-blueprint-5.9-SNAPSHOT.jar

[INFO] --- ianal-maven-plugin:1.0-alpha-1:verify-legal-files (default) @ activemq-blueprint
---
[INFO] [INFO] Installing <https://builds.apache.org/job/ActiveMQ/ws/activemq-blueprint/target/activemq-blueprint-5.9-SNAPSHOT.jar>
to /home/jenkins/jenkins-slave/maven-repositories/0/org/apache/activemq/activemq-blueprint/5.9-SNAPSHOT/activemq-blueprint-5.9-SNAPSHOT.jar

[INFO] --- maven-install-plugin:2.3.1:install (default-install) @ activemq-blueprint ---
[INFO] Installing <https://builds.apache.org/job/ActiveMQ/ws/activemq-blueprint/pom.xml>
to /home/jenkins/jenkins-slave/maven-repositories/0/org/apache/activemq/activemq-blueprint/5.9-SNAPSHOT/activemq-blueprint-5.9-SNAPSHOT.pom
[INFO] [WARNING] Exception while updating local OBR: Unable to read repository xml: file:/home/jenkins/jenkins-slave/maven-repositories/0/repository.xml
org.apache.maven.plugin.MojoExecutionException: Unable to read repository xml: file:/home/jenkins/jenkins-slave/maven-repositories/0/repository.xml
	at org.apache.felix.obrplugin.ObrUpdate.parseRepositoryXml(ObrUpdate.java:324)
	at org.apache.felix.obrplugin.ObrInstall.execute(ObrInstall.java:141)
	at org.apache.maven.plugin.DefaultBuildPluginManager.executeMojo(DefaultBuildPluginManager.java:101)
	at org.apache.maven.lifecycle.internal.MojoExecutor.execute(MojoExecutor.java:209)
	at org.apache.maven.lifecycle.internal.MojoExecutor.execute(MojoExecutor.java:153)
	at org.apache.maven.lifecycle.internal.MojoExecutor.execute(MojoExecutor.java:145)
	at org.apache.maven.lifecycle.internal.LifecycleModuleBuilder.buildProject(LifecycleModuleBuilder.java:84)
	at org.apache.maven.lifecycle.internal.LifecycleModuleBuilder.buildProject(LifecycleModuleBuilder.java:59)
	at org.apache.maven.lifecycle.internal.LifecycleStarter.singleThreadedBuild(LifecycleStarter.java:183)
	at org.apache.maven.lifecycle.internal.LifecycleStarter.execute(LifecycleStarter.java:161)
	at org.apache.maven.DefaultMaven.doExecute(DefaultMaven.java:320)
	at org.apache.maven.DefaultMaven.execute(DefaultMaven.java:156)
	at org.jvnet.hudson.maven3.launcher.Maven3Launcher.main(Maven3Launcher.java:79)
	at sun.reflect.NativeMethodAccessorImpl.invoke0(Native Method)
	at sun.reflect.NativeMethodAccessorImpl.invoke(NativeMethodAccessorImpl.java:39)
	at sun.reflect.DelegatingMethodAccessorImpl.invoke(DelegatingMethodAccessorImpl.java:25)
	at java.lang.reflect.Method.invoke(Method.java:597)
	at org.codehaus.plexus.classworlds.launcher.Launcher.launchStandard(Launcher.java:329)
	at org.codehaus.plexus.classworlds.launcher.Launcher.launch(Launcher.java:239)
	at org.jvnet.hudson.maven3.agent.Maven3Main.launch(Maven3Main.java:158)
	at hudson.maven.Maven3Builder.call(Maven3Builder.java:100)
	at hudson.maven.Maven3Builder.call(Maven3Builder.java:66)
	at hudson.remoting.UserRequest.perform(UserRequest.java:118)
	at hudson.remoting.UserRequest.perform(UserRequest.java:48)
	at hudson.remoting.Request$2.run(Request.java:326)
	at hudson.remoting.InterceptingExecutorService$1.call(InterceptingExecutorService.java:72)
	at java.util.concurrent.FutureTask$Sync.innerRun(FutureTask.java:303)
	at java.util.concurrent.FutureTask.run(FutureTask.java:138)
	at java.util.concurrent.ThreadPoolExecutor$Worker.runTask(ThreadPoolExecutor.java:895)
	at java.util.concurrent.ThreadPoolExecutor$Worker.run(ThreadPoolExecutor.java:918)
	at java.lang.Thread.run(Thread.java:662)
Caused by: org.xmlpull.v1.XmlPullParserException: unexpected type (position:END_DOCUMENT null@3:1
in java.io.InputStreamReader@7509f0) 
	at org.kxml2.io.KXmlParser.exception(Unknown Source)
	at org.kxml2.io.KXmlParser.nextTag(Unknown Source)
	at org.apache.felix.bundlerepository.impl.PullParser.parseRepository(PullParser.java:43)
	at org.apache.felix.bundlerepository.impl.DataModelHelperImpl.repository(DataModelHelperImpl.java:147)
	at org.apache.felix.bundlerepository.impl.DataModelHelperImpl.repository(DataModelHelperImpl.java:118)
	at org.apache.felix.obrplugin.ObrUpdate.parseRepositoryXml(ObrUpdate.java:316)
	... 30 more

[INFO] --- maven-bundle-plugin:2.3.7:install (default-install) @ activemq-blueprint ---
[01:43:06] [INFO]                                                                        

[INFO] ------------------------------------------------------------------------
[INFO] Skipping ActiveMQ :: Web Demo
[INFO] This project has been banned from the build due to previous failures.
[INFO] ------------------------------------------------------------------------
[INFO]                                                                         
[INFO] ------------------------------------------------------------------------
[INFO] Skipping ActiveMQ :: Web Console
[INFO] This project has been banned from the build due to previous failures.
[INFO] ------------------------------------------------------------------------
[INFO]                                                                         
[INFO] ------------------------------------------------------------------------
[INFO] Skipping ActiveMQ :: Karaf Integration Tests
[INFO] This project has been banned from the build due to previous failures.
[INFO] ------------------------------------------------------------------------
[INFO]                                                                         
[INFO] ------------------------------------------------------------------------
[INFO] Skipping ActiveMQ :: Integration Test :: Spring 3.1
[INFO] This project has been banned from the build due to previous failures.
[INFO] ------------------------------------------------------------------------
[INFO]                                                                         
[INFO] ------------------------------------------------------------------------
[INFO] Skipping ActiveMQ :: Assembly
[INFO] This project has been banned from the build due to previous failures.
[INFO] ------------------------------------------------------------------------
[INFO] ------------------------------------------------------------------------
[INFO] Reactor Summary:
[INFO] 
[INFO] ActiveMQ .......................................... SUCCESS [23.086s]
[INFO] ActiveMQ :: Openwire Generator .................... SUCCESS [5.409s]
[INFO] ActiveMQ :: Client ................................ SUCCESS [2:14.530s]
[INFO] ActiveMQ :: Openwire Legacy Support ............... SUCCESS [3.397s]
[INFO] ActiveMQ :: JAAS .................................. SUCCESS [32.896s]
[INFO] ActiveMQ :: Broker ................................ SUCCESS [57.479s]
[INFO] ActiveMQ :: KahaDB Store .......................... SUCCESS [4:48.974s]
[INFO] ActiveMQ :: STOMP Protocol ........................ SUCCESS [47:09.379s]
[INFO] ActiveMQ :: MQTT Protocol ......................... SUCCESS [2:37.116s]
[INFO] ActiveMQ :: JDBC Store ............................ SUCCESS [2.640s]
[INFO] ActiveMQ :: LevelDB Store ......................... SUCCESS [10:07.252s]
[INFO] ActiveMQ :: RA .................................... SUCCESS [2:30.554s]
[INFO] ActiveMQ :: Pool .................................. SUCCESS [1:45.008s]
[INFO] ActiveMQ :: Spring ................................ SUCCESS [1:22.563s]
[INFO] ActiveMQ :: AMQP .................................. FAILURE [1.753s]
[INFO] ActiveMQ :: Console ............................... SUCCESS [3.974s]
[INFO] ActiveMQ :: Unit Tests ............................ SKIPPED
[INFO] ActiveMQ :: Camel ................................. SKIPPED
[INFO] ActiveMQ :: HTTP Protocol Support ................. SKIPPED
[INFO] ActiveMQ :: All JAR bundle ........................ SKIPPED
[INFO] ActiveMQ :: File Server ........................... SKIPPED
[INFO] ActiveMQ :: Log4j Appender ........................ SUCCESS [6.854s]
[INFO] ActiveMQ :: Apache Karaf .......................... SKIPPED
[INFO] ActiveMQ :: RAR ................................... SKIPPED
[INFO] ActiveMQ :: Run Jar ............................... SUCCESS [3.812s]
[INFO] ActiveMQ :: Tooling ............................... SUCCESS [1.102s]
[INFO] ActiveMQ :: Memory Usage Test Plugin .............. SUCCESS [6.069s]
[INFO] ActiveMQ :: Performance Test Plugin ............... SUCCESS [4.891s]
[INFO] ActiveMQ :: StartUp Plugin ........................ SKIPPED
[INFO] ActiveMQ :: Web ................................... SKIPPED
[INFO] ActiveMQ :: OSGi bundle ........................... SKIPPED
[INFO] ActiveMQ :: Blueprint ............................. SUCCESS [3.326s]
[INFO] ActiveMQ :: Web Demo .............................. SKIPPED
[INFO] ActiveMQ :: Web Console ........................... SKIPPED
[INFO] ActiveMQ :: Karaf Integration Tests ............... SKIPPED
[INFO] ActiveMQ :: Integration Test :: Spring 3.1 ........ SKIPPED
[INFO] ActiveMQ :: Assembly .............................. SKIPPED
[INFO] ------------------------------------------------------------------------
[INFO] BUILD FAILURE
[INFO] ------------------------------------------------------------------------
[INFO] Total time: 1:15:18.312s
[INFO] Finished at: Fri Jun 28 01:43:06 UTC 2013
[INFO] Final Memory: 139M/1149M
[INFO] ------------------------------------------------------------------------
[JENKINS] Archiving <https://builds.apache.org/job/ActiveMQ/ws/pom.xml> to /home/hudson/hudson/jobs/ActiveMQ/modules/org.apache.activemq$activemq-parent/builds/2013-06-28_00-27-28/archive/org.apache.activemq/activemq-parent/5.9-SNAPSHOT/activemq-parent-5.9-SNAPSHOT.pom
[JENKINS] Archiving <https://builds.apache.org/job/ActiveMQ/ws/activemq-client/pom.xml>
to /home/hudson/hudson/jobs/ActiveMQ/modules/org.apache.activemq$activemq-client/builds/2013-06-28_00-27-29/archive/org.apache.activemq/activemq-client/5.9-SNAPSHOT/activemq-client-5.9-SNAPSHOT.pom
[JENKINS] Archiving <https://builds.apache.org/job/ActiveMQ/ws/activemq-client/target/activemq-client-5.9-SNAPSHOT.jar>
to /home/hudson/hudson/jobs/ActiveMQ/modules/org.apache.activemq$activemq-client/builds/2013-06-28_00-27-29/archive/org.apache.activemq/activemq-client/5.9-SNAPSHOT/activemq-client-5.9-SNAPSHOT.jar
[JENKINS] Archiving <https://builds.apache.org/job/ActiveMQ/ws/assembly/pom.xml> to
/home/hudson/hudson/jobs/ActiveMQ/modules/org.apache.activemq$apache-activemq/builds/2013-06-28_00-27-32/archive/org.apache.activemq/apache-activemq/5.9-SNAPSHOT/apache-activemq-5.9-SNAPSHOT.pom
[JENKINS] Archiving <https://builds.apache.org/job/ActiveMQ/ws/activemq-camel/pom.xml>
to /home/hudson/hudson/jobs/ActiveMQ/modules/org.apache.activemq$activemq-camel/builds/2013-06-28_00-27-30/archive/org.apache.activemq/activemq-camel/5.9-SNAPSHOT/activemq-camel-5.9-SNAPSHOT.pom
[JENKINS] Archiving <https://builds.apache.org/job/ActiveMQ/ws/activemq-tooling/pom.xml>
to /home/hudson/hudson/jobs/ActiveMQ/modules/org.apache.activemq.tooling$activemq-tooling/builds/2013-06-28_00-27-31/archive/org.apache.activemq.tooling/activemq-tooling/5.9-SNAPSHOT/activemq-tooling-5.9-SNAPSHOT.pom
[JENKINS] Archiving <https://builds.apache.org/job/ActiveMQ/ws/activemq-pool/pom.xml>
to /home/hudson/hudson/jobs/ActiveMQ/modules/org.apache.activemq$activemq-pool/builds/2013-06-28_00-27-31/archive/org.apache.activemq/activemq-pool/5.9-SNAPSHOT/activemq-pool-5.9-SNAPSHOT.pom
[JENKINS] Archiving <https://builds.apache.org/job/ActiveMQ/ws/activemq-pool/target/activemq-pool-5.9-SNAPSHOT.jar>
to /home/hudson/hudson/jobs/ActiveMQ/modules/org.apache.activemq$activemq-pool/builds/2013-06-28_00-27-31/archive/org.apache.activemq/activemq-pool/5.9-SNAPSHOT/activemq-pool-5.9-SNAPSHOT.jar
[JENKINS] Archiving <https://builds.apache.org/job/ActiveMQ/ws/activemq-karaf-itest/pom.xml>
to /home/hudson/hudson/jobs/ActiveMQ/modules/org.apache.activemq$activemq-karaf-itest/builds/2013-06-28_00-27-32/archive/org.apache.activemq/activemq-karaf-itest/5.9-SNAPSHOT/activemq-karaf-itest-5.9-SNAPSHOT.pom
[JENKINS] Archiving <https://builds.apache.org/job/ActiveMQ/ws/activemq-broker/pom.xml>
to /home/hudson/hudson/jobs/ActiveMQ/modules/org.apache.activemq$activemq-broker/builds/2013-06-28_00-27-29/archive/org.apache.activemq/activemq-broker/5.9-SNAPSHOT/activemq-broker-5.9-SNAPSHOT.pom
[JENKINS] Archiving <https://builds.apache.org/job/ActiveMQ/ws/activemq-broker/target/activemq-broker-5.9-SNAPSHOT.jar>
to /home/hudson/hudson/jobs/ActiveMQ/modules/org.apache.activemq$activemq-broker/builds/2013-06-28_00-27-29/archive/org.apache.activemq/activemq-broker/5.9-SNAPSHOT/activemq-broker-5.9-SNAPSHOT.jar
[JENKINS] Archiving <https://builds.apache.org/job/ActiveMQ/ws/activemq-broker/target/activemq-broker-5.9-SNAPSHOT-tests.jar>
to /home/hudson/hudson/jobs/ActiveMQ/modules/org.apache.activemq$activemq-broker/builds/2013-06-28_00-27-29/archive/org.apache.activemq/activemq-broker/5.9-SNAPSHOT/activemq-broker-5.9-SNAPSHOT-tests.jar
[JENKINS] Archiving <https://builds.apache.org/job/ActiveMQ/ws/activemq-tooling/activemq-perf-maven-plugin/pom.xml>
to /home/hudson/hudson/jobs/ActiveMQ/modules/org.apache.activemq.tooling$activemq-perf-maven-plugin/builds/2013-06-28_00-27-31/archive/org.apache.activemq.tooling/activemq-perf-maven-plugin/5.9-SNAPSHOT/activemq-perf-maven-plugin-5.9-SNAPSHOT.pom
[JENKINS] Archiving <https://builds.apache.org/job/ActiveMQ/ws/activemq-tooling/activemq-perf-maven-plugin/target/activemq-perf-maven-plugin-5.9-SNAPSHOT.jar>
to /home/hudson/hudson/jobs/ActiveMQ/modules/org.apache.activemq.tooling$activemq-perf-maven-plugin/builds/2013-06-28_00-27-31/archive/org.apache.activemq.tooling/activemq-perf-maven-plugin/5.9-SNAPSHOT/activemq-perf-maven-plugin-5.9-SNAPSHOT.jar
[JENKINS] Archiving <https://builds.apache.org/job/ActiveMQ/ws/activemq-kahadb-store/pom.xml>
to /home/hudson/hudson/jobs/ActiveMQ/modules/org.apache.activemq$activemq-kahadb-store/builds/2013-06-28_00-27-30/archive/org.apache.activemq/activemq-kahadb-store/5.9-SNAPSHOT/activemq-kahadb-store-5.9-SNAPSHOT.pom
[JENKINS] Archiving <https://builds.apache.org/job/ActiveMQ/ws/activemq-kahadb-store/target/activemq-kahadb-store-5.9-SNAPSHOT.jar>
to /home/hudson/hudson/jobs/ActiveMQ/modules/org.apache.activemq$activemq-kahadb-store/builds/2013-06-28_00-27-30/archive/org.apache.activemq/activemq-kahadb-store/5.9-SNAPSHOT/activemq-kahadb-store-5.9-SNAPSHOT.jar
[JENKINS] Archiving <https://builds.apache.org/job/ActiveMQ/ws/activemq-blueprint/pom.xml>
to /home/hudson/hudson/jobs/ActiveMQ/modules/org.apache.activemq$activemq-blueprint/builds/2013-06-28_00-27-32/archive/org.apache.activemq/activemq-blueprint/5.9-SNAPSHOT/activemq-blueprint-5.9-SNAPSHOT.pom
[JENKINS] Archiving <https://builds.apache.org/job/ActiveMQ/ws/activemq-blueprint/target/activemq-blueprint-5.9-SNAPSHOT.jar>
to /home/hudson/hudson/jobs/ActiveMQ/modules/org.apache.activemq$activemq-blueprint/builds/2013-06-28_00-27-32/archive/org.apache.activemq/activemq-blueprint/5.9-SNAPSHOT/activemq-blueprint-5.9-SNAPSHOT.jar
[JENKINS] Archiving <https://builds.apache.org/job/ActiveMQ/ws/activemq-stomp/pom.xml>
to /home/hudson/hudson/jobs/ActiveMQ/modules/org.apache.activemq$activemq-stomp/builds/2013-06-28_00-27-29/archive/org.apache.activemq/activemq-stomp/5.9-SNAPSHOT/activemq-stomp-5.9-SNAPSHOT.pom
[JENKINS] Archiving <https://builds.apache.org/job/ActiveMQ/ws/activemq-stomp/target/activemq-stomp-5.9-SNAPSHOT.jar>
to /home/hudson/hudson/jobs/ActiveMQ/modules/org.apache.activemq$activemq-stomp/builds/2013-06-28_00-27-29/archive/org.apache.activemq/activemq-stomp/5.9-SNAPSHOT/activemq-stomp-5.9-SNAPSHOT.jar
[JENKINS] Archiving <https://builds.apache.org/job/ActiveMQ/ws/activemq-unit-tests/pom.xml>
to /home/hudson/hudson/jobs/ActiveMQ/modules/org.apache.activemq$activemq-unit-tests/builds/2013-06-28_00-27-30/archive/org.apache.activemq/activemq-unit-tests/5.9-SNAPSHOT/activemq-unit-tests-5.9-SNAPSHOT.pom
[JENKINS] Archiving <https://builds.apache.org/job/ActiveMQ/ws/activemq-spring/pom.xml>
to /home/hudson/hudson/jobs/ActiveMQ/modules/org.apache.activemq$activemq-spring/builds/2013-06-28_00-27-31/archive/org.apache.activemq/activemq-spring/5.9-SNAPSHOT/activemq-spring-5.9-SNAPSHOT.pom
[JENKINS] Archiving <https://builds.apache.org/job/ActiveMQ/ws/activemq-spring/target/activemq-spring-5.9-SNAPSHOT.jar>
to /home/hudson/hudson/jobs/ActiveMQ/modules/org.apache.activemq$activemq-spring/builds/2013-06-28_00-27-31/archive/org.apache.activemq/activemq-spring/5.9-SNAPSHOT/activemq-spring-5.9-SNAPSHOT.jar
[JENKINS] Archiving <https://builds.apache.org/job/ActiveMQ/ws/activemq-spring/target/classes/activemq.xsd>
to /home/hudson/hudson/jobs/ActiveMQ/modules/org.apache.activemq$activemq-spring/builds/2013-06-28_00-27-31/archive/org.apache.activemq/activemq-spring/5.9-SNAPSHOT/activemq-spring-5.9-SNAPSHOT.xsd
[JENKINS] Archiving <https://builds.apache.org/job/ActiveMQ/ws/activemq-spring/target/classes/activemq.xsd.html>
to /home/hudson/hudson/jobs/ActiveMQ/modules/org.apache.activemq$activemq-spring/builds/2013-06-28_00-27-31/archive/org.apache.activemq/activemq-spring/5.9-SNAPSHOT/activemq-spring-5.9-SNAPSHOT-schema.html
[JENKINS] Archiving <https://builds.apache.org/job/ActiveMQ/ws/activemq-openwire-legacy/pom.xml>
to /home/hudson/hudson/jobs/ActiveMQ/modules/org.apache.activemq$activemq-openwire-legacy/builds/2013-06-28_00-27-29/archive/org.apache.activemq/activemq-openwire-legacy/5.9-SNAPSHOT/activemq-openwire-legacy-5.9-SNAPSHOT.pom
[JENKINS] Archiving <https://builds.apache.org/job/ActiveMQ/ws/activemq-openwire-legacy/target/activemq-openwire-legacy-5.9-SNAPSHOT.jar>
to /home/hudson/hudson/jobs/ActiveMQ/modules/org.apache.activemq$activemq-openwire-legacy/builds/2013-06-28_00-27-29/archive/org.apache.activemq/activemq-openwire-legacy/5.9-SNAPSHOT/activemq-openwire-legacy-5.9-SNAPSHOT.jar
[JENKINS] Archiving <https://builds.apache.org/job/ActiveMQ/ws/activemq-karaf/pom.xml>
to /home/hudson/hudson/jobs/ActiveMQ/modules/org.apache.activemq$activemq-karaf/builds/2013-06-28_00-27-30/archive/org.apache.activemq/activemq-karaf/5.9-SNAPSHOT/activemq-karaf-5.9-SNAPSHOT.pom
[JENKINS] Archiving <https://builds.apache.org/job/ActiveMQ/ws/activemq-web-demo/pom.xml>
to /home/hudson/hudson/jobs/ActiveMQ/modules/org.apache.activemq$activemq-web-demo/builds/2013-06-28_00-27-32/archive/org.apache.activemq/activemq-web-demo/5.9-SNAPSHOT/activemq-web-demo-5.9-SNAPSHOT.pom
[JENKINS] Archiving <https://builds.apache.org/job/ActiveMQ/ws/activemq-web-console/pom.xml>
to /home/hudson/hudson/jobs/ActiveMQ/modules/org.apache.activemq$activemq-web-console/builds/2013-06-28_00-27-32/archive/org.apache.activemq/activemq-web-console/5.9-SNAPSHOT/activemq-web-console-5.9-SNAPSHOT.pom
[JENKINS] Archiving <https://builds.apache.org/job/ActiveMQ/ws/activemq-jdbc-store/pom.xml>
to /home/hudson/hudson/jobs/ActiveMQ/modules/org.apache.activemq$activemq-jdbc-store/builds/2013-06-28_00-27-30/archive/org.apache.activemq/activemq-jdbc-store/5.9-SNAPSHOT/activemq-jdbc-store-5.9-SNAPSHOT.pom
[JENKINS] Archiving <https://builds.apache.org/job/ActiveMQ/ws/activemq-jdbc-store/target/activemq-jdbc-store-5.9-SNAPSHOT.jar>
to /home/hudson/hudson/jobs/ActiveMQ/modules/org.apache.activemq$activemq-jdbc-store/builds/2013-06-28_00-27-30/archive/org.apache.activemq/activemq-jdbc-store/5.9-SNAPSHOT/activemq-jdbc-store-5.9-SNAPSHOT.jar
[JENKINS] Archiving <https://builds.apache.org/job/ActiveMQ/ws/activemq-jaas/pom.xml>
to /home/hudson/hudson/jobs/ActiveMQ/modules/org.apache.activemq$activemq-jaas/builds/2013-06-28_00-27-30/archive/org.apache.activemq/activemq-jaas/5.9-SNAPSHOT/activemq-jaas-5.9-SNAPSHOT.pom
[JENKINS] Archiving <https://builds.apache.org/job/ActiveMQ/ws/activemq-jaas/target/activemq-jaas-5.9-SNAPSHOT.jar>
to /home/hudson/hudson/jobs/ActiveMQ/modules/org.apache.activemq$activemq-jaas/builds/2013-06-28_00-27-30/archive/org.apache.activemq/activemq-jaas/5.9-SNAPSHOT/activemq-jaas-5.9-SNAPSHOT.jar
[JENKINS] Archiving <https://builds.apache.org/job/ActiveMQ/ws/activemq-run/dependency-reduced-pom.xml>
to /home/hudson/hudson/jobs/ActiveMQ/modules/org.apache.activemq$activemq-run/builds/2013-06-28_00-27-31/archive/org.apache.activemq/activemq-run/5.9-SNAPSHOT/activemq-run-5.9-SNAPSHOT.pom
[JENKINS] Archiving <https://builds.apache.org/job/ActiveMQ/ws/activemq-run/target/activemq-run-5.9-SNAPSHOT.jar>
to /home/hudson/hudson/jobs/ActiveMQ/modules/org.apache.activemq$activemq-run/builds/2013-06-28_00-27-31/archive/org.apache.activemq/activemq-run/5.9-SNAPSHOT/activemq-run-5.9-SNAPSHOT.jar
[JENKINS] Archiving <https://builds.apache.org/job/ActiveMQ/ws/activemq-amqp/pom.xml>
to /home/hudson/hudson/jobs/ActiveMQ/modules/org.apache.activemq$activemq-amqp/builds/2013-06-28_00-27-29/archive/org.apache.activemq/activemq-amqp/5.9-SNAPSHOT/activemq-amqp-5.9-SNAPSHOT.pom
[JENKINS] Archiving <https://builds.apache.org/job/ActiveMQ/ws/activemq-openwire-generator/pom.xml>
to /home/hudson/hudson/jobs/ActiveMQ/modules/org.apache.activemq$activemq-openwire-generator/builds/2013-06-28_00-27-31/archive/org.apache.activemq/activemq-openwire-generator/5.9-SNAPSHOT/activemq-openwire-generator-5.9-SNAPSHOT.pom
[JENKINS] Archiving <https://builds.apache.org/job/ActiveMQ/ws/activemq-openwire-generator/target/activemq-openwire-generator-5.9-SNAPSHOT.jar>
to /home/hudson/hudson/jobs/ActiveMQ/modules/org.apache.activemq$activemq-openwire-generator/builds/2013-06-28_00-27-31/archive/org.apache.activemq/activemq-openwire-generator/5.9-SNAPSHOT/activemq-openwire-generator-5.9-SNAPSHOT.jar
[JENKINS] Archiving <https://builds.apache.org/job/ActiveMQ/ws/activemq-web/pom.xml>
to /home/hudson/hudson/jobs/ActiveMQ/modules/org.apache.activemq$activemq-web/builds/2013-06-28_00-27-32/archive/org.apache.activemq/activemq-web/5.9-SNAPSHOT/activemq-web-5.9-SNAPSHOT.pom
[JENKINS] Archiving <https://builds.apache.org/job/ActiveMQ/ws/activemq-console/pom.xml>
to /home/hudson/hudson/jobs/ActiveMQ/modules/org.apache.activemq$activemq-console/builds/2013-06-28_00-27-30/archive/org.apache.activemq/activemq-console/5.9-SNAPSHOT/activemq-console-5.9-SNAPSHOT.pom
[JENKINS] Archiving <https://builds.apache.org/job/ActiveMQ/ws/activemq-console/target/activemq-console-5.9-SNAPSHOT.jar>
to /home/hudson/hudson/jobs/ActiveMQ/modules/org.apache.activemq$activemq-console/builds/2013-06-28_00-27-30/archive/org.apache.activemq/activemq-console/5.9-SNAPSHOT/activemq-console-5.9-SNAPSHOT.jar
[JENKINS] Archiving <https://builds.apache.org/job/ActiveMQ/ws/activemq-log4j-appender/pom.xml>
to /home/hudson/hudson/jobs/ActiveMQ/modules/org.apache.activemq$activemq-log4j-appender/builds/2013-06-28_00-27-32/archive/org.apache.activemq/activemq-log4j-appender/5.9-SNAPSHOT/activemq-log4j-appender-5.9-SNAPSHOT.pom
[JENKINS] Archiving <https://builds.apache.org/job/ActiveMQ/ws/activemq-log4j-appender/target/activemq-log4j-appender-5.9-SNAPSHOT.jar>
to /home/hudson/hudson/jobs/ActiveMQ/modules/org.apache.activemq$activemq-log4j-appender/builds/2013-06-28_00-27-32/archive/org.apache.activemq/activemq-log4j-appender/5.9-SNAPSHOT/activemq-log4j-appender-5.9-SNAPSHOT.jar
[JENKINS] Archiving <https://builds.apache.org/job/ActiveMQ/ws/activemq-tooling/activemq-memtest-maven-plugin/pom.xml>
to /home/hudson/hudson/jobs/ActiveMQ/modules/org.apache.activemq.tooling$activemq-memtest-maven-plugin/builds/2013-06-28_00-27-31/archive/org.apache.activemq.tooling/activemq-memtest-maven-plugin/5.9-SNAPSHOT/activemq-memtest-maven-plugin-5.9-SNAPSHOT.pom
[JENKINS] Archiving <https://builds.apache.org/job/ActiveMQ/ws/activemq-tooling/activemq-memtest-maven-plugin/target/activemq-memtest-maven-plugin-5.9-SNAPSHOT.jar>
to /home/hudson/hudson/jobs/ActiveMQ/modules/org.apache.activemq.tooling$activemq-memtest-maven-plugin/builds/2013-06-28_00-27-31/archive/org.apache.activemq.tooling/activemq-memtest-maven-plugin/5.9-SNAPSHOT/activemq-memtest-maven-plugin-5.9-SNAPSHOT.jar
[JENKINS] Archiving <https://builds.apache.org/job/ActiveMQ/ws/activemq-itests-spring31/pom.xml>
to /home/hudson/hudson/jobs/ActiveMQ/modules/org.apache.activemq$activemq-itests-spring31/builds/2013-06-28_00-27-32/archive/org.apache.activemq/activemq-itests-spring31/5.9-SNAPSHOT/activemq-itests-spring31-5.9-SNAPSHOT.pom
[JENKINS] Archiving <https://builds.apache.org/job/ActiveMQ/ws/activemq-http/pom.xml>
to /home/hudson/hudson/jobs/ActiveMQ/modules/org.apache.activemq$activemq-http/builds/2013-06-28_00-27-32/archive/org.apache.activemq/activemq-http/5.9-SNAPSHOT/activemq-http-5.9-SNAPSHOT.pom
[JENKINS] Archiving <https://builds.apache.org/job/ActiveMQ/ws/activemq-osgi/pom.xml>
to /home/hudson/hudson/jobs/ActiveMQ/modules/org.apache.activemq$activemq-osgi/builds/2013-06-28_00-27-32/archive/org.apache.activemq/activemq-osgi/5.9-SNAPSHOT/activemq-osgi-5.9-SNAPSHOT.pom
[JENKINS] Archiving <https://builds.apache.org/job/ActiveMQ/ws/activemq-fileserver/pom.xml>
to /home/hudson/hudson/jobs/ActiveMQ/modules/org.apache.activemq$activemq-fileserver/builds/2013-06-28_00-27-30/archive/org.apache.activemq/activemq-fileserver/5.9-SNAPSHOT/activemq-fileserver-5.9-SNAPSHOT.pom
[JENKINS] Archiving <https://builds.apache.org/job/ActiveMQ/ws/activemq-leveldb-store/pom.xml>
to /home/hudson/hudson/jobs/ActiveMQ/modules/org.apache.activemq$activemq-leveldb-store/builds/2013-06-28_00-27-30/archive/org.apache.activemq/activemq-leveldb-store/5.9-SNAPSHOT/activemq-leveldb-store-5.9-SNAPSHOT.pom
[JENKINS] Archiving <https://builds.apache.org/job/ActiveMQ/ws/activemq-leveldb-store/target/activemq-leveldb-store-5.9-SNAPSHOT.jar>
to /home/hudson/hudson/jobs/ActiveMQ/modules/org.apache.activemq$activemq-leveldb-store/builds/2013-06-28_00-27-30/archive/org.apache.activemq/activemq-leveldb-store/5.9-SNAPSHOT/activemq-leveldb-store-5.9-SNAPSHOT.jar
[JENKINS] Archiving <https://builds.apache.org/job/ActiveMQ/ws/activemq-all/pom.xml>
to /home/hudson/hudson/jobs/ActiveMQ/modules/org.apache.activemq$activemq-all/builds/2013-06-28_00-27-30/archive/org.apache.activemq/activemq-all/5.9-SNAPSHOT/activemq-all-5.9-SNAPSHOT.pom
[JENKINS] Archiving <https://builds.apache.org/job/ActiveMQ/ws/activemq-mqtt/pom.xml>
to /home/hudson/hudson/jobs/ActiveMQ/modules/org.apache.activemq$activemq-mqtt/builds/2013-06-28_00-27-29/archive/org.apache.activemq/activemq-mqtt/5.9-SNAPSHOT/activemq-mqtt-5.9-SNAPSHOT.pom
[JENKINS] Archiving <https://builds.apache.org/job/ActiveMQ/ws/activemq-mqtt/target/activemq-mqtt-5.9-SNAPSHOT.jar>
to /home/hudson/hudson/jobs/ActiveMQ/modules/org.apache.activemq$activemq-mqtt/builds/2013-06-28_00-27-29/archive/org.apache.activemq/activemq-mqtt/5.9-SNAPSHOT/activemq-mqtt-5.9-SNAPSHOT.jar
[JENKINS] Archiving <https://builds.apache.org/job/ActiveMQ/ws/activemq-tooling/activemq-maven-plugin/pom.xml>
to /home/hudson/hudson/jobs/ActiveMQ/modules/org.apache.activemq.tooling$activemq-maven-plugin/builds/2013-06-28_00-27-31/archive/org.apache.activemq.tooling/activemq-maven-plugin/5.9-SNAPSHOT/activemq-maven-plugin-5.9-SNAPSHOT.pom
[JENKINS] Archiving <https://builds.apache.org/job/ActiveMQ/ws/activemq-ra/pom.xml>
to /home/hudson/hudson/jobs/ActiveMQ/modules/org.apache.activemq$activemq-ra/builds/2013-06-28_00-27-31/archive/org.apache.activemq/activemq-ra/5.9-SNAPSHOT/activemq-ra-5.9-SNAPSHOT.pom
[JENKINS] Archiving <https://builds.apache.org/job/ActiveMQ/ws/activemq-ra/target/activemq-ra-5.9-SNAPSHOT.jar>
to /home/hudson/hudson/jobs/ActiveMQ/modules/org.apache.activemq$activemq-ra/builds/2013-06-28_00-27-31/archive/org.apache.activemq/activemq-ra/5.9-SNAPSHOT/activemq-ra-5.9-SNAPSHOT.jar
[JENKINS] Archiving <https://builds.apache.org/job/ActiveMQ/ws/activemq-ra/target/xbean/activemq-ra.xsd>
to /home/hudson/hudson/jobs/ActiveMQ/modules/org.apache.activemq$activemq-ra/builds/2013-06-28_00-27-31/archive/org.apache.activemq/activemq-ra/5.9-SNAPSHOT/activemq-ra-5.9-SNAPSHOT.xsd
[JENKINS] Archiving <https://builds.apache.org/job/ActiveMQ/ws/activemq-ra/target/xbean/activemq-ra.xsd.html>
to /home/hudson/hudson/jobs/ActiveMQ/modules/org.apache.activemq$activemq-ra/builds/2013-06-28_00-27-31/archive/org.apache.activemq/activemq-ra/5.9-SNAPSHOT/activemq-ra-5.9-SNAPSHOT-schema.html
[JENKINS] Archiving <https://builds.apache.org/job/ActiveMQ/ws/activemq-ra/target/xbean/activemq-ra.xsd.html>
to /home/hudson/hudson/jobs/ActiveMQ/modules/org.apache.activemq$activemq-ra/builds/2013-06-28_00-27-31/archive/org.apache.activemq/activemq-ra/5.9-SNAPSHOT/activemq-ra-5.9-SNAPSHOT.xsd.html
[JENKINS] Archiving <https://builds.apache.org/job/ActiveMQ/ws/activemq-rar/pom.xml>
to /home/hudson/hudson/jobs/ActiveMQ/modules/org.apache.activemq$activemq-rar/builds/2013-06-28_00-27-31/archive/org.apache.activemq/activemq-rar/5.9-SNAPSHOT/activemq-rar-5.9-SNAPSHOT.pom
Waiting for Jenkins to finish collecting data
mavenExecutionResult exceptions not empty
message : Failed to execute goal on project activemq-amqp: Could not resolve dependencies
for project org.apache.activemq:activemq-amqp:jar:5.9-SNAPSHOT: Could not find artifact org.apache.qpid:proton-jms:jar:0.3.0-fuse-4
in com.fusesource.m2 (http://repo.fusesource.com/nexus/content/groups/public/)
cause : Could not resolve dependencies for project org.apache.activemq:activemq-amqp:jar:5.9-SNAPSHOT:
Could not find artifact org.apache.qpid:proton-jms:jar:0.3.0-fuse-4 in com.fusesource.m2 (http://repo.fusesource.com/nexus/content/groups/public/)
Stack trace : 
org.apache.maven.lifecycle.LifecycleExecutionException: Failed to execute goal on project
activemq-amqp: Could not resolve dependencies for project org.apache.activemq:activemq-amqp:jar:5.9-SNAPSHOT:
Could not find artifact org.apache.qpid:proton-jms:jar:0.3.0-fuse-4 in com.fusesource.m2 (http://repo.fusesource.com/nexus/content/groups/public/)
	at org.apache.maven.lifecycle.internal.LifecycleDependencyResolver.getDependencies(LifecycleDependencyResolver.java:210)
	at org.apache.maven.lifecycle.internal.LifecycleDependencyResolver.resolveProjectDependencies(LifecycleDependencyResolver.java:117)
	at org.apache.maven.lifecycle.internal.MojoExecutor.ensureDependenciesAreResolved(MojoExecutor.java:258)
	at org.apache.maven.lifecycle.internal.MojoExecutor.execute(MojoExecutor.java:201)
	at org.apache.maven.lifecycle.internal.MojoExecutor.execute(MojoExecutor.java:153)
	at org.apache.maven.lifecycle.internal.MojoExecutor.execute(MojoExecutor.java:145)
	at org.apache.maven.lifecycle.internal.LifecycleModuleBuilder.buildProject(LifecycleModuleBuilder.java:84)
	at org.apache.maven.lifecycle.internal.LifecycleModuleBuilder.buildProject(LifecycleModuleBuilder.java:59)
	at org.apache.maven.lifecycle.internal.LifecycleStarter.singleThreadedBuild(LifecycleStarter.java:183)
	at org.apache.maven.lifecycle.internal.LifecycleStarter.execute(LifecycleStarter.java:161)
	at org.apache.maven.DefaultMaven.doExecute(DefaultMaven.java:320)
	at org.apache.maven.DefaultMaven.execute(DefaultMaven.java:156)
	at org.jvnet.hudson.maven3.launcher.Maven3Launcher.main(Maven3Launcher.java:79)
	at sun.reflect.NativeMethodAccessorImpl.invoke0(Native Method)
	at sun.reflect.NativeMethodAccessorImpl.invoke(NativeMethodAccessorImpl.java:39)
	at sun.reflect.DelegatingMethodAccessorImpl.invoke(DelegatingMethodAccessorImpl.java:25)
	at java.lang.reflect.Method.invoke(Method.java:597)
	at org.codehaus.plexus.classworlds.launcher.Launcher.launchStandard(Launcher.java:329)
	at org.codehaus.plexus.classworlds.launcher.Launcher.launch(Launcher.java:239)
	at org.jvnet.hudson.maven3.agent.Maven3Main.launch(Maven3Main.java:158)
	at hudson.maven.Maven3Builder.call(Maven3Builder.java:100)
	at hudson.maven.Maven3Builder.call(Maven3Builder.java:66)
	at hudson.remoting.UserRequest.perform(UserRequest.java:118)
	at hudson.remoting.UserRequest.perform(UserRequest.java:48)
	at hudson.remoting.Request$2.run(Request.java:326)
	at hudson.remoting.InterceptingExecutorService$1.call(InterceptingExecutorService.java:72)
	at java.util.concurrent.FutureTask$Sync.innerRun(FutureTask.java:303)
	at java.util.concurrent.FutureTask.run(FutureTask.java:138)
	at java.util.concurrent.ThreadPoolExecutor$Worker.runTask(ThreadPoolExecutor.java:895)
	at java.util.concurrent.ThreadPoolExecutor$Worker.run(ThreadPoolExecutor.java:918)
	at java.lang.Thread.run(Thread.java:662)
Caused by: org.apache.maven.project.DependencyResolutionException: Could not resolve dependencies
for project org.apache.activemq:activemq-amqp:jar:5.9-SNAPSHOT: Could not find artifact org.apache.qpid:proton-jms:jar:0.3.0-fuse-4
in com.fusesource.m2 (http://repo.fusesource.com/nexus/content/groups/public/)
	at org.apache.maven.project.DefaultProjectDependenciesResolver.resolve(DefaultProjectDependenciesResolver.java:189)
	at org.apache.maven.lifecycle.internal.LifecycleDependencyResolver.getDependencies(LifecycleDependencyResolver.java:185)
	... 30 more
Caused by: org.sonatype.aether.resolution.DependencyResolutionException: Could not find artifact
org.apache.qpid:proton-jms:jar:0.3.0-fuse-4 in com.fusesource.m2 (http://repo.fusesource.com/nexus/content/groups/public/)
	at org.sonatype.aether.impl.internal.DefaultRepositorySystem.resolveDependencies(DefaultRepositorySystem.java:375)
	at org.apache.maven.project.DefaultProjectDependenciesResolver.resolve(DefaultProjectDependenciesResolver.java:183)
	... 31 more
Caused by: org.sonatype.aether.resolution.ArtifactResolutionException: Could not find artifact
org.apache.qpid:proton-jms:jar:0.3.0-fuse-4 in com.fusesource.m2 (http://repo.fusesource.com/nexus/content/groups/public/)
	at org.sonatype.aether.impl.internal.DefaultArtifactResolver.resolve(DefaultArtifactResolver.java:538)
	at org.sonatype.aether.impl.internal.DefaultArtifactResolver.resolveArtifacts(DefaultArtifactResolver.java:216)
	at org.sonatype.aether.impl.internal.DefaultRepositorySystem.resolveDependencies(DefaultRepositorySystem.java:358)
	... 32 more
Caused by: org.sonatype.aether.transfer.ArtifactNotFoundException: Could not find artifact
org.apache.qpid:proton-jms:jar:0.3.0-fuse-4 in com.fusesource.m2 (http://repo.fusesource.com/nexus/content/groups/public/)
	at org.sonatype.aether.connector.wagon.WagonRepositoryConnector$4.wrap(WagonRepositoryConnector.java:947)
	at org.sonatype.aether.connector.wagon.WagonRepositoryConnector$4.wrap(WagonRepositoryConnector.java:941)
	at org.sonatype.aether.connector.wagon.WagonRepositoryConnector$GetTask.run(WagonRepositoryConnector.java:669)
	at org.sonatype.aether.util.concurrency.RunnableErrorForwarder$1.run(RunnableErrorForwarder.java:60)
	... 3 more
Maven failed with error.
Sending e-mails to: dev@activemq.apache.org
channel stopped
[locks-and-latches] Releasing all the locks
[locks-and-latches] All the locks released

Mime
View raw message