activemq-dev mailing list archives

Site index · List index
Message view « Date » · « Thread »
Top « Date » · « Thread »
From Apache Jenkins Server <jenk...@builds.apache.org>
Subject Build failed in Jenkins: ActiveMQ-Trunk-Deploy » ActiveMQ :: Unit Tests #774
Date Mon, 13 May 2013 03:14:45 GMT
See <https://builds.apache.org/job/ActiveMQ-Trunk-Deploy/org.apache.activemq$activemq-unit-tests/774/>

------------------------------------------
[INFO]                                                                         
[INFO] ------------------------------------------------------------------------
[INFO] Building ActiveMQ :: Unit Tests 5.9-SNAPSHOT
[INFO] ------------------------------------------------------------------------
[INFO] 
[INFO] --- maven-clean-plugin:2.5:clean (default-clean) @ activemq-unit-tests ---
[INFO] 
[INFO] --- maven-enforcer-plugin:1.0.1:enforce (default) @ activemq-unit-tests ---
[INFO] 
[INFO] --- maven-bundle-plugin:2.3.7:cleanVersions (cleanVersions) @ activemq-unit-tests ---
[INFO] 
[INFO] --- maven-remote-resources-plugin:1.3:process (default) @ activemq-unit-tests ---
[INFO] [debug] execute contextualize
[INFO] Using 'UTF-8' encoding to copy filtered resources.
[INFO] skip non existing resourceDirectory <https://builds.apache.org/job/ActiveMQ-Trunk-Deploy/org.apache.activemq$activemq-unit-tests/ws/src/main/resources>
[INFO] skip non existing resourceDirectory <https://builds.apache.org/job/ActiveMQ-Trunk-Deploy/org.apache.activemq$activemq-unit-tests/ws/src/main/filtered-resources>
[INFO] Copying 3 resources

[INFO] --- maven-resources-plugin:2.5:resources (default-resources) @ activemq-unit-tests
---
[INFO] [INFO] Nothing to compile - all classes are up to date

[INFO] --- maven-compiler-plugin:2.5.1:compile (default-compile) @ activemq-unit-tests ---
[debug] execute contextualize
[INFO] [INFO] Using 'UTF-8' encoding to copy filtered resources.

[INFO] --- maven-resources-plugin:2.5:testResources (default-testResources) @ activemq-unit-tests
---
[INFO] Copying 200 resources
[INFO] Copying 3 resources
[INFO] 
[INFO] --- maven-compiler-plugin:2.5.1:testCompile (default-testCompile) @ activemq-unit-tests
---
[INFO] Compiling 1282 source files to <https://builds.apache.org/job/ActiveMQ-Trunk-Deploy/org.apache.activemq$activemq-unit-tests/ws/target/test-classes>
[INFO] -------------------------------------------------------------
[ERROR] COMPILATION ERROR : 
[INFO] -------------------------------------------------------------
[ERROR] <https://builds.apache.org/job/ActiveMQ-Trunk-Deploy/org.apache.activemq$activemq-unit-tests/ws/src/test/java/org/apache/activemq/transport/reliable/ReliableTransportTest.java>:[35,14]
[deprecation] org.apache.activemq.transport.reliable.ReliableTransport in org.apache.activemq.transport.reliable
has been deprecated
[ERROR] <https://builds.apache.org/job/ActiveMQ-Trunk-Deploy/org.apache.activemq$activemq-unit-tests/ws/src/test/java/org/apache/activemq/usecases/BrowseDLQTest.java>:[38,29]
[deprecation] junit.framework.Assert in junit.framework has been deprecated
[ERROR] org/apache/directory/shared/ldap/model/name/Dn.class(org/apache/directory/shared/ldap/model/name:Dn.class):
warning: Cannot find annotation method 'value()' in type 'edu.umd.cs.findbugs.annotations.SuppressWarnings':
class file for edu.umd.cs.findbugs.annotations.SuppressWarnings not found
org/apache/directory/shared/ldap/model/name/Dn.class(org/apache/directory/shared/ldap/model/name:Dn.class):
warning: Cannot find annotation method 'justification()' in type 'edu.umd.cs.findbugs.annotations.SuppressWarnings'
<https://builds.apache.org/job/ActiveMQ-Trunk-Deploy/org.apache.activemq$activemq-unit-tests/ws/src/test/java/org/apache/activemq/command/ActiveMQMessageTest.java>:[434,92]
<anonymous org.apache.activemq.command.ActiveMQMessageTest$1> is not abstract and does
not override abstract method storeContentAndClear() in org.apache.activemq.command.Message
[ERROR] <https://builds.apache.org/job/ActiveMQ-Trunk-Deploy/org.apache.activemq$activemq-unit-tests/ws/src/test/java/org/apache/activemq/transport/reliable/ReliableTransportTest.java>:[128,24]
[deprecation] org.apache.activemq.transport.reliable.ReliableTransport in org.apache.activemq.transport.reliable
has been deprecated
[ERROR] <https://builds.apache.org/job/ActiveMQ-Trunk-Deploy/org.apache.activemq$activemq-unit-tests/ws/src/test/java/org/apache/activemq/transport/reliable/UnreliableUdpTransportTest.java>:[57,8]
[deprecation] org.apache.activemq.transport.reliable.ReliableTransport in org.apache.activemq.transport.reliable
has been deprecated
[ERROR] <https://builds.apache.org/job/ActiveMQ-Trunk-Deploy/org.apache.activemq$activemq-unit-tests/ws/src/test/java/org/apache/activemq/transport/reliable/UnreliableUdpTransportTest.java>:[57,50]
[deprecation] org.apache.activemq.transport.reliable.ReliableTransport in org.apache.activemq.transport.reliable
has been deprecated
[ERROR] <https://builds.apache.org/job/ActiveMQ-Trunk-Deploy/org.apache.activemq$activemq-unit-tests/ws/src/test/java/org/apache/activemq/transport/reliable/UnreliableUdpTransportTest.java>:[70,8]
[deprecation] org.apache.activemq.transport.reliable.ReliableTransport in org.apache.activemq.transport.reliable
has been deprecated
[ERROR] <https://builds.apache.org/job/ActiveMQ-Trunk-Deploy/org.apache.activemq$activemq-unit-tests/ws/src/test/java/org/apache/activemq/transport/reliable/UnreliableUdpTransportTest.java>:[70,50]
[deprecation] org.apache.activemq.transport.reliable.ReliableTransport in org.apache.activemq.transport.reliable
has been deprecated
[INFO] 8 errors 
[INFO] -------------------------------------------------------------

Mime
View raw message