activemq-dev mailing list archives

Site index · List index
Message view « Date » · « Thread »
Top « Date » · « Thread »
From Apache Jenkins Server <jenk...@builds.apache.org>
Subject Build failed in Jenkins: ActiveMQ-Java7 » ActiveMQ :: Spring #191
Date Thu, 02 May 2013 09:05:16 GMT
See <https://builds.apache.org/job/ActiveMQ-Java7/org.apache.activemq$activemq-spring/191/>

------------------------------------------
[INFO]                                                                         
[INFO] ------------------------------------------------------------------------
[INFO] Building ActiveMQ :: Spring 5.9-SNAPSHOT
[INFO] ------------------------------------------------------------------------
Downloading: http://repo.maven.apache.org/maven2/org/eclipse/jetty/maven-jetty-plugin/7.6.7.v20120910/maven-jetty-plugin-7.6.7.v20120910.pom
[WARNING] The POM for org.eclipse.jetty:maven-jetty-plugin:jar:7.6.7.v20120910 is missing,
no dependency information available
[WARNING] Failed to retrieve plugin descriptor for org.eclipse.jetty:maven-jetty-plugin:7.6.7.v20120910:
Plugin org.eclipse.jetty:maven-jetty-plugin:7.6.7.v20120910 or one of its dependencies could
not be resolved: Failed to read artifact descriptor for org.eclipse.jetty:maven-jetty-plugin:jar:7.6.7.v20120910
[INFO] 
[INFO] --- maven-clean-plugin:2.5:clean (default-clean) @ activemq-spring ---
[INFO] 
[INFO] --- maven-enforcer-plugin:1.0.1:enforce (default) @ activemq-spring ---
[INFO] 
[INFO] --- maven-bundle-plugin:2.3.7:cleanVersions (cleanVersions) @ activemq-spring ---
[INFO] 
[INFO] --- maven-remote-resources-plugin:1.3:process (default) @ activemq-spring ---
[debug] execute contextualize
[INFO] [INFO] Using 'UTF-8' encoding to copy filtered resources.
[INFO] Copying 1 resource
[INFO] Copying 3 resources

[INFO] --- maven-resources-plugin:2.5:resources (default-resources) @ activemq-spring ---
[INFO] [INFO] Compiling 20 source files to <https://builds.apache.org/job/ActiveMQ-Java7/org.apache.activemq$activemq-spring/ws/target/classes>

[INFO] --- maven-compiler-plugin:2.5.1:compile (default-compile) @ activemq-spring ---
[INFO] 
[INFO] --- maven-xbean-plugin:3.12:mapping (default) @ activemq-spring ---
[INFO] Generating META-INF properties file: <https://builds.apache.org/job/ActiveMQ-Java7/org.apache.activemq$activemq-spring/ws/target/classes/META-INF/services/org/apache/xbean/spring/http/activemq.apache.org/schema/core>
for namespace: http://activemq.apache.org/schema/core
[INFO] Generating Spring 2.0 handler mapping: <https://builds.apache.org/job/ActiveMQ-Java7/org.apache.activemq$activemq-spring/ws/target/classes/META-INF/spring.handlers>
for namespace: http://activemq.apache.org/schema/core
[INFO] Generating HTML documentation file: <https://builds.apache.org/job/ActiveMQ-Java7/org.apache.activemq$activemq-spring/ws/target/classes/activemq.xsd.html>
for namespace: http://activemq.apache.org/schema/core
Warning, could not load class: T: java.lang.ClassNotFoundException: T
Warning, could not load class: T: java.lang.ClassNotFoundException: T
Warning, could not load class: T: java.lang.ClassNotFoundException: T
Warning, could not load class: T: java.lang.ClassNotFoundException: T
[INFO] Generating XSD file: <https://builds.apache.org/job/ActiveMQ-Java7/org.apache.activemq$activemq-spring/ws/target/classes/activemq.xsd>
for namespace: http://activemq.apache.org/schema/core
[INFO] Generating WIKI documentation file: <https://builds.apache.org/job/ActiveMQ-Java7/org.apache.activemq$activemq-spring/ws/target/classes/activemq.xsd.wiki>
for namespace: http://activemq.apache.org/schema/core
[INFO] ...done.
[debug] execute contextualize
[INFO] [INFO] Using 'UTF-8' encoding to copy filtered resources.

[INFO] --- maven-resources-plugin:2.5:testResources (default-testResources) @ activemq-spring
---
[INFO] Copying 7 resources
[INFO] Copying 3 resources
[INFO] 
[INFO] --- maven-compiler-plugin:2.5.1:testCompile (default-testCompile) @ activemq-spring
---
[INFO] Compiling 11 source files to <https://builds.apache.org/job/ActiveMQ-Java7/org.apache.activemq$activemq-spring/ws/target/test-classes>
[INFO] [INFO] Surefire report directory: <https://builds.apache.org/job/ActiveMQ-Java7/org.apache.activemq$activemq-spring/ws/target/surefire-reports>

[INFO] --- maven-surefire-plugin:2.10:test (default-test) @ activemq-spring ---

-------------------------------------------------------
 T E S T S
-------------------------------------------------------
Running org.apache.activemq.store.leveldb.LevelDBConfigTest
Tests run: 1, Failures: 0, Errors: 0, Skipped: 0, Time elapsed: 4.881 sec
Running org.apache.activemq.spring.ParallelXATransactionTest
Tests run: 1, Failures: 0, Errors: 0, Skipped: 0, Time elapsed: 16.785 sec
Running org.apache.activemq.spring.ListenerTest
Tests run: 2, Failures: 0, Errors: 0, Skipped: 0, Time elapsed: 8.127 sec
Running org.apache.activemq.spring.SpringTest
Tests run: 1, Failures: 0, Errors: 0, Skipped: 0, Time elapsed: 2.224 sec
Running org.apache.bugs.LoadBalanceTest
Tests run: 2, Failures: 0, Errors: 0, Skipped: 1, Time elapsed: 4.042 sec
Running org.apache.bugs.AMQ1730Test
Tests run: 1, Failures: 0, Errors: 0, Skipped: 0, Time elapsed: 17.288 sec
Running org.apache.bugs.AMQ2754Test
Tests run: 1, Failures: 0, Errors: 0, Skipped: 0, Time elapsed: 18.045 sec

Results :

Tests run: 9, Failures: 0, Errors: 0, Skipped: 1


Mime
View raw message