activemq-dev mailing list archives

Site index · List index
Message view « Date » · « Thread »
Top « Date » · « Thread »
From Apache Jenkins Server <jenk...@builds.apache.org>
Subject Build failed in Jenkins: ActiveMQ #1275
Date Mon, 29 Apr 2013 03:04:57 GMT
See <https://builds.apache.org/job/ActiveMQ/1275/changes>

Changes:

[chirino] Add more replication tests.

------------------------------------------
[...truncated 5123 lines...]
[INFO] Building ActiveMQ 5.9-SNAPSHOT
[INFO] ------------------------------------------------------------------------
Downloading: http://repo.maven.apache.org/maven2/org/eclipse/jetty/maven-jetty-plugin/7.6.7.v20120910/maven-jetty-plugin-7.6.7.v20120910.pom
[WARNING] The POM for org.eclipse.jetty:maven-jetty-plugin:jar:7.6.7.v20120910 is missing,
no dependency information available
[WARNING] Failed to retrieve plugin descriptor for org.eclipse.jetty:maven-jetty-plugin:7.6.7.v20120910:
Plugin org.eclipse.jetty:maven-jetty-plugin:7.6.7.v20120910 or one of its dependencies could
not be resolved: Failed to read artifact descriptor for org.eclipse.jetty:maven-jetty-plugin:jar:7.6.7.v20120910
[INFO] 
[INFO] --- maven-clean-plugin:2.5:clean (default-clean) @ activemq-parent ---
[INFO] 
[INFO] --- maven-enforcer-plugin:1.0.1:enforce (default) @ activemq-parent ---
[INFO] 
[INFO] --- maven-bundle-plugin:2.3.7:cleanVersions (cleanVersions) @ activemq-parent ---
[INFO] 
[INFO] --- maven-remote-resources-plugin:1.3:process (default) @ activemq-parent ---
[INFO] 
[INFO] --- maven-site-plugin:3.1:attach-descriptor (attach-descriptor) @ activemq-parent ---
[INFO] 
[INFO] --- ianal-maven-plugin:1.0-alpha-1:verify-legal-files (default) @ activemq-parent ---
[INFO] 
[INFO] --- maven-install-plugin:2.3.1:install (default-install) @ activemq-parent ---
[INFO] Installing <https://builds.apache.org/job/ActiveMQ/ws/pom.xml> to /home/jenkins/jenkins-slave/maven-repositories/0/org/apache/activemq/activemq-parent/5.9-SNAPSHOT/activemq-parent-5.9-SNAPSHOT.pom
[INFO] 
[INFO] --- maven-enforcer-plugin:1.0.1:enforce (default) @ activemq-parent ---
[INFO] 
[INFO] --- maven-bundle-plugin:2.3.7:cleanVersions (cleanVersions) @ activemq-parent ---
Apr 29, 2013 2:01:13 AM hudson.maven.ExecutedMojo <init>
WARNING: Failed to getClass for org.apache.maven.plugin.source.SourceJarMojo
[INFO] 
[INFO] --- maven-source-plugin:2.1.2:jar (default-cli) @ activemq-parent ---
[INFO]                                                                         
[INFO] ------------------------------------------------------------------------
[INFO] Building ActiveMQ :: Openwire Generator 5.9-SNAPSHOT
[INFO] ------------------------------------------------------------------------
Downloading: http://repo.maven.apache.org/maven2/org/eclipse/jetty/maven-jetty-plugin/7.6.7.v20120910/maven-jetty-plugin-7.6.7.v20120910.pom
[WARNING] The POM for org.eclipse.jetty:maven-jetty-plugin:jar:7.6.7.v20120910 is missing,
no dependency information available
[WARNING] Failed to retrieve plugin descriptor for org.eclipse.jetty:maven-jetty-plugin:7.6.7.v20120910:
Plugin org.eclipse.jetty:maven-jetty-plugin:7.6.7.v20120910 or one of its dependencies could
not be resolved: Failed to read artifact descriptor for org.eclipse.jetty:maven-jetty-plugin:jar:7.6.7.v20120910
Downloading: http://repo.fusesource.com/nexus/content/groups/public/groovy/gram/1.1/gram-1.1.pom
Downloaded: http://repo.fusesource.com/nexus/content/groups/public/groovy/gram/1.1/gram-1.1.pom
(3 KB at 0.9 KB/sec)
Downloading: http://repo.fusesource.com/nexus/content/groups/public/groovy/groovy-all/1.0-jsr-03/groovy-all-1.0-jsr-03.pom
Downloaded: http://repo.fusesource.com/nexus/content/groups/public/groovy/groovy-all/1.0-jsr-03/groovy-all-1.0-jsr-03.pom
(155 B at 0.1 KB/sec)
Downloading: http://repo.fusesource.com/nexus/content/groups/public/annogen/annogen/0.1.0/annogen-0.1.0.pom
Downloaded: http://repo.fusesource.com/nexus/content/groups/public/annogen/annogen/0.1.0/annogen-0.1.0.pom
(148 B at 0.1 KB/sec)
Downloading: http://repo.fusesource.com/nexus/content/groups/public/ant/ant/1.6.2/ant-1.6.2.pom
Downloaded: http://repo.fusesource.com/nexus/content/groups/public/ant/ant/1.6.2/ant-1.6.2.pom
(521 B at 0.3 KB/sec)
Downloading: http://repo.fusesource.com/nexus/content/groups/public/groovy/gram/1.1/gram-1.1.jar
Downloading: http://repo.fusesource.com/nexus/content/groups/public/groovy/groovy-all/1.0-jsr-03/groovy-all-1.0-jsr-03.jar
Downloaded: http://repo.fusesource.com/nexus/content/groups/public/groovy/gram/1.1/gram-1.1.jar
(10 KB at 0.8 KB/sec)
Downloading: http://repo.fusesource.com/nexus/content/groups/public/annogen/annogen/0.1.0/annogen-0.1.0.jar
Downloading: http://repo.fusesource.com/nexus/content/groups/public/ant/ant/1.6.2/ant-1.6.2.jar
Downloaded: http://repo.fusesource.com/nexus/content/groups/public/annogen/annogen/0.1.0/annogen-0.1.0.jar
(243 KB at 156.3 KB/sec)
Downloaded: http://repo.fusesource.com/nexus/content/groups/public/ant/ant/1.6.2/ant-1.6.2.jar
(977 KB at 232.8 KB/sec)
Downloaded: http://repo.fusesource.com/nexus/content/groups/public/groovy/groovy-all/1.0-jsr-03/groovy-all-1.0-jsr-03.jar
(1551 KB at 73.1 KB/sec)
[INFO] 
[INFO] --- maven-clean-plugin:2.5:clean (default-clean) @ activemq-openwire-generator ---
[INFO] 
[INFO] --- maven-enforcer-plugin:1.0.1:enforce (default) @ activemq-openwire-generator ---
[INFO] 
[INFO] --- maven-bundle-plugin:2.3.7:cleanVersions (cleanVersions) @ activemq-openwire-generator
---
[INFO] 
[INFO] --- maven-remote-resources-plugin:1.3:process (default) @ activemq-openwire-generator
---
[INFO] 
[INFO] --- maven-resources-plugin:2.5:resources (default-resources) @ activemq-openwire-generator
---
[debug] execute contextualize
[INFO] Using 'UTF-8' encoding to copy filtered resources.
[INFO] skip non existing resourceDirectory <https://builds.apache.org/job/ActiveMQ/ws/activemq-openwire-generator/src/main/resources>
[INFO] Copying 3 resources
[INFO] 
[INFO] --- maven-compiler-plugin:2.5.1:compile (default-compile) @ activemq-openwire-generator
---
[INFO] Compiling 18 source files to <https://builds.apache.org/job/ActiveMQ/ws/activemq-openwire-generator/target/classes>
[INFO] 
[INFO] --- maven-resources-plugin:2.5:testResources (default-testResources) @ activemq-openwire-generator
---
[debug] execute contextualize
[INFO] Using 'UTF-8' encoding to copy filtered resources.
[INFO] skip non existing resourceDirectory <https://builds.apache.org/job/ActiveMQ/ws/activemq-openwire-generator/src/test/resources>
[INFO] Copying 3 resources
[INFO] No sources to compile
[INFO] 
[INFO] --- maven-compiler-plugin:2.5.1:testCompile (default-testCompile) @ activemq-openwire-generator
---
[INFO] 
[INFO] --- maven-surefire-plugin:2.10:test (default-test) @ activemq-openwire-generator ---
[INFO] Tests are skipped.
[INFO] 
[INFO] --- maven-jar-plugin:2.4:jar (default-jar) @ activemq-openwire-generator ---
[INFO] Building jar: <https://builds.apache.org/job/ActiveMQ/ws/activemq-openwire-generator/target/activemq-openwire-generator-5.9-SNAPSHOT.jar>
[INFO] 
[INFO] --- maven-site-plugin:3.1:attach-descriptor (attach-descriptor) @ activemq-openwire-generator
---
[INFO] 
[INFO] --- ianal-maven-plugin:1.0-alpha-1:verify-legal-files (default) @ activemq-openwire-generator
---
[INFO] Checking legal files in: activemq-openwire-generator-5.9-SNAPSHOT.jar
[INFO] 
[INFO] --- maven-install-plugin:2.3.1:install (default-install) @ activemq-openwire-generator
---
[INFO] Installing <https://builds.apache.org/job/ActiveMQ/ws/activemq-openwire-generator/target/activemq-openwire-generator-5.9-SNAPSHOT.jar>
to /home/jenkins/jenkins-slave/maven-repositories/0/org/apache/activemq/activemq-openwire-generator/5.9-SNAPSHOT/activemq-openwire-generator-5.9-SNAPSHOT.jar
[INFO] Installing <https://builds.apache.org/job/ActiveMQ/ws/activemq-openwire-generator/pom.xml>
to /home/jenkins/jenkins-slave/maven-repositories/0/org/apache/activemq/activemq-openwire-generator/5.9-SNAPSHOT/activemq-openwire-generator-5.9-SNAPSHOT.pom
[INFO] 
[INFO] --- maven-enforcer-plugin:1.0.1:enforce (default) @ activemq-openwire-generator ---
[INFO] 
[INFO] --- maven-bundle-plugin:2.3.7:cleanVersions (cleanVersions) @ activemq-openwire-generator
---
Apr 29, 2013 2:18:56 AM hudson.maven.ExecutedMojo <init>
WARNING: Failed to getClass for org.apache.maven.plugin.source.SourceJarMojo
[INFO] 
[INFO] --- maven-source-plugin:2.1.2:jar (default-cli) @ activemq-openwire-generator ---
[INFO] META-INF already added, skipping
[INFO] META-INF/LICENSE already added, skipping
[INFO] META-INF/NOTICE already added, skipping
[INFO] META-INF/DEPENDENCIES already added, skipping
[INFO] Building jar: <https://builds.apache.org/job/ActiveMQ/ws/activemq-openwire-generator/target/activemq-openwire-generator-5.9-SNAPSHOT-sources.jar>
[INFO] META-INF already added, skipping
[INFO] META-INF/LICENSE already added, skipping
[INFO] META-INF/NOTICE already added, skipping
[INFO] META-INF/DEPENDENCIES already added, skipping
[INFO]                                                                         
[INFO] ------------------------------------------------------------------------
[INFO] Building ActiveMQ :: Client 5.9-SNAPSHOT
[INFO] ------------------------------------------------------------------------
Downloading: http://repo.maven.apache.org/maven2/org/eclipse/jetty/maven-jetty-plugin/7.6.7.v20120910/maven-jetty-plugin-7.6.7.v20120910.pom
[WARNING] The POM for org.eclipse.jetty:maven-jetty-plugin:jar:7.6.7.v20120910 is missing,
no dependency information available
[WARNING] Failed to retrieve plugin descriptor for org.eclipse.jetty:maven-jetty-plugin:7.6.7.v20120910:
Plugin org.eclipse.jetty:maven-jetty-plugin:7.6.7.v20120910 or one of its dependencies could
not be resolved: Failed to read artifact descriptor for org.eclipse.jetty:maven-jetty-plugin:jar:7.6.7.v20120910
Downloading: http://repo.fusesource.com/nexus/content/groups/public/javax/jmdns/jmdns/3.4.1/jmdns-3.4.1.pom
Downloading: http://repo.maven.apache.org/maven2/javax/jmdns/jmdns/3.4.1/jmdns-3.4.1.pom
Downloaded: http://repo.maven.apache.org/maven2/javax/jmdns/jmdns/3.4.1/jmdns-3.4.1.pom (17
KB at 6.5 KB/sec)
Downloading: http://repo.fusesource.com/nexus/content/groups/public/javax/jmdns/jmdns/3.4.1/jmdns-3.4.1.jar
Downloading: http://repo.maven.apache.org/maven2/javax/jmdns/jmdns/3.4.1/jmdns-3.4.1.jar
Downloaded: http://repo.maven.apache.org/maven2/javax/jmdns/jmdns/3.4.1/jmdns-3.4.1.jar (201
KB at 14.3 KB/sec)
[INFO] 
[INFO] --- maven-clean-plugin:2.5:clean (default-clean) @ activemq-client ---
[INFO] 
[INFO] --- maven-enforcer-plugin:1.0.1:enforce (default) @ activemq-client ---
[INFO] 
[INFO] --- maven-bundle-plugin:2.3.7:cleanVersions (cleanVersions) @ activemq-client ---
[INFO] 
[INFO] --- javacc-maven-plugin:2.6:javacc (default) @ activemq-client ---
Java Compiler Compiler Version 5.0 (Parser Generator)
(type "javacc" with no arguments for help)
Reading from file <https://builds.apache.org/job/ActiveMQ/ws/activemq-client/src/main/grammar/SelectorParser.jj>
. . .
Note: UNICODE_INPUT option is specified. Please make sure you create the parser/lexer using
a Reader with the correct character encoding.
File "TokenMgrError.java" does not exist.  Will create one.
File "ParseException.java" does not exist.  Will create one.
File "Token.java" does not exist.  Will create one.
File "SimpleCharStream.java" does not exist.  Will create one.
Parser generated successfully.
[INFO] Processed 1 grammar
[INFO] 
[INFO] --- maven-remote-resources-plugin:1.3:process (default) @ activemq-client ---
[INFO] [debug] execute contextualize
[INFO] Using 'UTF-8' encoding to copy filtered resources.

[INFO] --- maven-resources-plugin:2.5:resources (default-resources) @ activemq-client ---
[INFO] Copying 16 resources
[INFO] Copying 1 resource
[INFO] Copying 3 resources
[INFO] 
[INFO] --- maven-compiler-plugin:2.5.1:compile (default-compile) @ activemq-client ---
[INFO] Compiling 568 source files to <https://builds.apache.org/job/ActiveMQ/ws/activemq-client/target/classes>
[WARNING] <https://builds.apache.org/job/ActiveMQ/ws/activemq-client/src/main/java/org/apache/activemq/transport/udp/UdpTransportFactory.java>:[35,45]
[deprecation] org.apache.activemq.transport.reliable.ReliableTransport in org.apache.activemq.transport.reliable
has been deprecated
[WARNING] <https://builds.apache.org/job/ActiveMQ/ws/activemq-client/src/main/java/org/apache/activemq/transport/reliable/ReplayStrategy.java>:[38,29]
[deprecation] org.apache.activemq.transport.reliable.ReliableTransport in org.apache.activemq.transport.reliable
has been deprecated
[WARNING] <https://builds.apache.org/job/ActiveMQ/ws/activemq-client/src/main/java/org/apache/activemq/transport/reliable/ReplayStrategy.java>:[40,26]
[deprecation] org.apache.activemq.transport.reliable.ReliableTransport in org.apache.activemq.transport.reliable
has been deprecated
[WARNING] <https://builds.apache.org/job/ActiveMQ/ws/activemq-client/src/main/java/org/apache/activemq/transport/udp/UdpTransportServer.java>:[35,45]
[deprecation] org.apache.activemq.transport.reliable.ReliableTransport in org.apache.activemq.transport.reliable
has been deprecated
[WARNING] <https://builds.apache.org/job/ActiveMQ/ws/activemq-client/src/main/java/org/apache/activemq/transport/reliable/DefaultReplayStrategy.java>:[38,36]
[deprecation] org.apache.activemq.transport.reliable.ReliableTransport in org.apache.activemq.transport.reliable
has been deprecated
[WARNING] <https://builds.apache.org/job/ActiveMQ/ws/activemq-client/src/main/java/org/apache/activemq/transport/reliable/DefaultReplayStrategy.java>:[53,33]
[deprecation] org.apache.activemq.transport.reliable.ReliableTransport in org.apache.activemq.transport.reliable
has been deprecated
[WARNING] <https://builds.apache.org/job/ActiveMQ/ws/activemq-client/src/main/java/org/apache/activemq/transport/multicast/MulticastTransportFactory.java>:[25,40]
[deprecation] org.apache.activemq.transport.udp.UdpTransportFactory in org.apache.activemq.transport.udp
has been deprecated
[WARNING] <https://builds.apache.org/job/ActiveMQ/ws/activemq-client/src/main/java/org/apache/activemq/transport/multicast/MulticastTransportFactory.java>:[33,47]
[deprecation] org.apache.activemq.transport.udp.UdpTransportFactory in org.apache.activemq.transport.udp
has been deprecated
[WARNING] <https://builds.apache.org/job/ActiveMQ/ws/activemq-client/src/main/java/org/apache/activemq/transport/reliable/ExceptionIfDroppedReplayStrategy.java>:[38,36]
[deprecation] org.apache.activemq.transport.reliable.ReliableTransport in org.apache.activemq.transport.reliable
has been deprecated
[WARNING] <https://builds.apache.org/job/ActiveMQ/ws/activemq-client/src/main/java/org/apache/activemq/transport/reliable/ExceptionIfDroppedReplayStrategy.java>:[49,33]
[deprecation] org.apache.activemq.transport.reliable.ReliableTransport in org.apache.activemq.transport.reliable
has been deprecated
[INFO] [debug] execute contextualize
[INFO] Using 'UTF-8' encoding to copy filtered resources.

[INFO] --- maven-resources-plugin:2.5:testResources (default-testResources) @ activemq-client
---
[INFO] Copying 3 resources
[INFO] Copying 3 resources
[INFO] 
[INFO] --- maven-compiler-plugin:2.5.1:testCompile (default-testCompile) @ activemq-client
---
[INFO] Compiling 14 source files to <https://builds.apache.org/job/ActiveMQ/ws/activemq-client/target/test-classes>
[INFO] 
[INFO] --- maven-surefire-plugin:2.10:test (default-test) @ activemq-client ---
[INFO] Surefire report directory: <https://builds.apache.org/job/ActiveMQ/ws/activemq-client/target/surefire-reports>
Downloading: http://repo.maven.apache.org/maven2/org/apache/maven/surefire/surefire-junit4/2.10/surefire-junit4-2.10.pom
Downloaded: http://repo.maven.apache.org/maven2/org/apache/maven/surefire/surefire-junit4/2.10/surefire-junit4-2.10.pom
(3 KB at 1.1 KB/sec)
Downloading: http://repo.maven.apache.org/maven2/org/apache/maven/surefire/surefire-junit4/2.10/surefire-junit4-2.10.jar
Downloaded: http://repo.maven.apache.org/maven2/org/apache/maven/surefire/surefire-junit4/2.10/surefire-junit4-2.10.jar
(33 KB at 14.0 KB/sec)

-------------------------------------------------------
 T E S T S
-------------------------------------------------------

-------------------------------------------------------
 T E S T S
-------------------------------------------------------
Running org.apache.activemq.ActiveMQSslConnectionFactoryTest
Tests run: 12, Failures: 0, Errors: 0, Skipped: 0, Time elapsed: 41.649 sec
Running org.apache.activemq.broker.scheduler.CronParserTest
Tests run: 13, Failures: 0, Errors: 0, Skipped: 0, Time elapsed: 1.853 sec
Running org.apache.activemq.thread.PooledTaskRunnerTest
Tests run: 3, Failures: 0, Errors: 0, Skipped: 0, Time elapsed: 36.203 sec
Sending e-mails to: dev@activemq.apache.org
[locks-and-latches] Releasing all the locks
[locks-and-latches] All the locks released
ERROR: Failed to parse POMs
hudson.remoting.ChannelClosedException: channel is already closed
	at hudson.remoting.Channel.send(Channel.java:494)
	at hudson.remoting.Request.call(Request.java:129)
	at hudson.remoting.Channel.call(Channel.java:672)
	at hudson.remoting.RemoteInvocationHandler.invoke(RemoteInvocationHandler.java:158)
	at sun.proxy.$Proxy38.isAlive(Unknown Source)
	at hudson.Launcher$RemoteLauncher$ProcImpl.isAlive(Launcher.java:920)
	at hudson.maven.ProcessCache$MavenProcess.call(ProcessCache.java:161)
	at hudson.maven.MavenModuleSetBuild$MavenModuleSetBuildExecution.doRun(MavenModuleSetBuild.java:755)
	at hudson.model.AbstractBuild$AbstractBuildExecution.run(AbstractBuild.java:592)
	at hudson.model.Run.execute(Run.java:1568)
	at hudson.maven.MavenModuleSetBuild.run(MavenModuleSetBuild.java:477)
	at hudson.model.ResourceController.execute(ResourceController.java:88)
	at hudson.model.Executor.run(Executor.java:236)
Caused by: hudson.remoting.Channel$OrderlyShutdown: java.util.concurrent.TimeoutException:
Ping started on 1367204271315 hasn't completed at 1367204511315
	at hudson.remoting.Channel$CloseCommand.execute(Channel.java:850)
	at hudson.remoting.Channel$2.handle(Channel.java:435)
	at hudson.remoting.SynchronousCommandTransport$ReaderThread.run(SynchronousCommandTransport.java:60)
Caused by: Command close created at
	at hudson.remoting.Command.<init>(Command.java:56)
	at hudson.remoting.Channel$CloseCommand.<init>(Channel.java:844)
	at hudson.remoting.Channel$CloseCommand.<init>(Channel.java:842)
	at hudson.remoting.Channel.close(Channel.java:909)
	at hudson.slaves.ChannelPinger$1.onDead(ChannelPinger.java:110)
	at hudson.remoting.PingThread.ping(PingThread.java:120)
	at hudson.remoting.PingThread.run(PingThread.java:81)
Caused by: java.util.concurrent.TimeoutException: Ping started on 1367204271315 hasn't completed
at 1367204511315
	... 2 more
FATAL: channel is already closed
hudson.remoting.ChannelClosedException: channel is already closed
	at hudson.remoting.Channel.send(Channel.java:494)
	at hudson.remoting.Request.call(Request.java:129)
	at hudson.remoting.Channel.call(Channel.java:672)
	at hudson.Launcher$RemoteLauncher.kill(Launcher.java:877)
	at hudson.model.AbstractBuild$AbstractBuildExecution.run(AbstractBuild.java:615)
	at hudson.model.Run.execute(Run.java:1568)
	at hudson.maven.MavenModuleSetBuild.run(MavenModuleSetBuild.java:477)
	at hudson.model.ResourceController.execute(ResourceController.java:88)
	at hudson.model.Executor.run(Executor.java:236)
Caused by: hudson.remoting.Channel$OrderlyShutdown: java.util.concurrent.TimeoutException:
Ping started on 1367204271315 hasn't completed at 1367204511315
	at hudson.remoting.Channel$CloseCommand.execute(Channel.java:850)
	at hudson.remoting.Channel$2.handle(Channel.java:435)
	at hudson.remoting.SynchronousCommandTransport$ReaderThread.run(SynchronousCommandTransport.java:60)
Caused by: Command close created at
	at hudson.remoting.Command.<init>(Command.java:56)
	at hudson.remoting.Channel$CloseCommand.<init>(Channel.java:844)
	at hudson.remoting.Channel$CloseCommand.<init>(Channel.java:842)
	at hudson.remoting.Channel.close(Channel.java:909)
	at hudson.slaves.ChannelPinger$1.onDead(ChannelPinger.java:110)
	at hudson.remoting.PingThread.ping(PingThread.java:120)
	at hudson.remoting.PingThread.run(PingThread.java:81)
Caused by: java.util.concurrent.TimeoutException: Ping started on 1367204271315 hasn't completed
at 1367204511315
	... 2 more

Mime
View raw message