activemq-dev mailing list archives

Site index · List index
Message view « Date » · « Thread »
Top « Date » · « Thread »
From Apache Jenkins Server <jenk...@builds.apache.org>
Subject Build failed in Jenkins: ActiveMQ-Java7 » ActiveMQ :: Unit Tests #162
Date Sat, 16 Mar 2013 14:32:29 GMT
See <https://builds.apache.org/job/ActiveMQ-Java7/org.apache.activemq$activemq-unit-tests/162/>

------------------------------------------
[...truncated 423 lines...]
Running org.apache.activemq.network.DemandForwardingBridgeTest
Tests run: 6, Failures: 0, Errors: 0, Skipped: 0, Time elapsed: 4.816 sec
Running org.apache.activemq.network.DynamicallyIncludedDestinationsDuplexNetworkTest
Tests run: 7, Failures: 0, Errors: 0, Skipped: 0, Time elapsed: 55.422 sec
Running org.apache.activemq.network.ForwardingBridgeTest
Tests run: 8, Failures: 0, Errors: 0, Skipped: 0, Time elapsed: 16.817 sec
Running org.apache.activemq.network.NetworkDestinationFilterTest
Tests run: 1, Failures: 0, Errors: 0, Skipped: 0, Time elapsed: 0.188 sec
Running org.apache.activemq.openwire.BooleanStreamTest
Tests run: 4, Failures: 0, Errors: 0, Skipped: 0, Time elapsed: 1.509 sec
Running org.apache.activemq.openwire.ItStillMarshallsTheSameTest
Tests run: 1, Failures: 0, Errors: 0, Skipped: 0, Time elapsed: 0.248 sec
Running org.apache.activemq.openwire.NumberRangesWhileMarshallingTest
Tests run: 3, Failures: 0, Errors: 0, Skipped: 0, Time elapsed: 0.291 sec
Running org.apache.activemq.pool.JmsSendReceiveTwoConnectionsWithSenderUsingPoolTest
Tests run: 1, Failures: 0, Errors: 0, Skipped: 0, Time elapsed: 2.132 sec
Running org.apache.activemq.security.AuthorizationMapTest
Tests run: 3, Failures: 0, Errors: 0, Skipped: 0, Time elapsed: 0.094 sec
Running org.apache.activemq.security.CachedLDAPAuthorizationModuleLegacyOpenLDAPTest
Tests run: 1, Failures: 0, Errors: 0, Skipped: 1, Time elapsed: 0.045 sec
Running org.apache.activemq.security.CachedLDAPAuthorizationModuleLegacyTest
Tests run: 12, Failures: 0, Errors: 0, Skipped: 0, Time elapsed: 34.763 sec
Running org.apache.activemq.security.CachedLDAPAuthorizationModuleOpenLDAPTest
Tests run: 1, Failures: 0, Errors: 0, Skipped: 1, Time elapsed: 0.046 sec
Running org.apache.activemq.security.CachedLDAPAuthorizationModuleTest
Tests run: 12, Failures: 0, Errors: 0, Skipped: 0, Time elapsed: 35.454 sec
Running org.apache.activemq.security.CachedLDAPSecurityLegacyTest
Tests run: 4, Failures: 0, Errors: 0, Skipped: 0, Time elapsed: 9.234 sec
Running org.apache.activemq.security.CachedLDAPSecurityTest
Tests run: 4, Failures: 0, Errors: 0, Skipped: 0, Time elapsed: 10.115 sec
Running org.apache.activemq.security.JaasCertificateAuthenticationBrokerTest
Tests run: 3, Failures: 0, Errors: 0, Skipped: 0, Time elapsed: 0.125 sec
Running org.apache.activemq.security.JaasDualAuthenticationBrokerTest
Tests run: 2, Failures: 0, Errors: 0, Skipped: 0, Time elapsed: 0.34 sec
Running org.apache.activemq.security.LDAPAuthorizationMapTest
Tests run: 7, Failures: 0, Errors: 0, Skipped: 0, Time elapsed: 5.6 sec
Running org.apache.activemq.security.SimpleAnonymousPluginTest
Tests run: 45, Failures: 0, Errors: 0, Skipped: 0, Time elapsed: 106.499 sec
Running org.apache.activemq.security.SimpleAuthenticationPluginSeparatorTest
Tests run: 29, Failures: 0, Errors: 0, Skipped: 0, Time elapsed: 70.224 sec
Running org.apache.activemq.security.SimpleAuthenticationPluginTest
Tests run: 33, Failures: 0, Errors: 0, Skipped: 0, Time elapsed: 79.733 sec
Running org.apache.activemq.security.SimpleAuthorizationMapTest
Tests run: 3, Failures: 0, Errors: 0, Skipped: 0, Time elapsed: 0.221 sec
Running org.apache.activemq.security.SimpleSecurityBrokerSystemTest
Tests run: 58, Failures: 0, Errors: 0, Skipped: 0, Time elapsed: 20.834 sec
Running org.apache.activemq.security.XBeanSecurityTest
Tests run: 29, Failures: 0, Errors: 0, Skipped: 0, Time elapsed: 15.831 sec
Running org.apache.activemq.security.XBeanSecurityWithGuestTest
Tests run: 7, Failures: 0, Errors: 0, Skipped: 0, Time elapsed: 16.838 sec
Running org.apache.activemq.selector.SelectorParserTest
Tests run: 2, Failures: 0, Errors: 0, Skipped: 0, Time elapsed: 0.217 sec
Running org.apache.activemq.selector.SelectorTest
Tests run: 20, Failures: 0, Errors: 0, Skipped: 0, Time elapsed: 0.872 sec
Running org.apache.activemq.spring.ActiveMQConnectionFactoryFactoryBeanTest
Tests run: 6, Failures: 0, Errors: 0, Skipped: 0, Time elapsed: 0.254 sec
Running org.apache.activemq.spring.SpringTest
Tests run: 7, Failures: 0, Errors: 0, Skipped: 0, Time elapsed: 20.423 sec
Running org.apache.activemq.store.jdbc.DatabaseLockerConfigTest
Tests run: 4, Failures: 0, Errors: 0, Skipped: 0, Time elapsed: 0.21 sec
Running org.apache.activemq.store.jdbc.LeaseDatabaseLockerTest
Tests run: 2, Failures: 0, Errors: 0, Skipped: 0, Time elapsed: 59.624 sec
Running org.apache.activemq.store.kahadb.CustomLockerTest
Tests run: 1, Failures: 0, Errors: 0, Skipped: 0, Time elapsed: 5.119 sec
Running org.apache.activemq.store.kahadb.KahaDBPersistenceAdapterTest
Tests run: 2, Failures: 0, Errors: 0, Skipped: 0, Time elapsed: 3.116 sec
Running org.apache.activemq.store.kahadb.KahaDBStoreBrokerTest
Tests run: 129, Failures: 0, Errors: 0, Skipped: 0, Time elapsed: 145.736 sec
Running org.apache.activemq.store.kahadb.KahaDBStoreOrderTest
Tests run: 2, Failures: 0, Errors: 0, Skipped: 0, Time elapsed: 7.223 sec
Running org.apache.activemq.store.kahadb.NoSpaceIOTest
Tests run: 1, Failures: 0, Errors: 0, Skipped: 1, Time elapsed: 0.097 sec
Running org.apache.activemq.store.kahadb.PBMesssagesTest
Tests run: 1, Failures: 0, Errors: 0, Skipped: 0, Time elapsed: 0.09 sec
Running org.apache.activemq.store.kahadb.TempKahaDBStoreBrokerTest
Tests run: 129, Failures: 0, Errors: 0, Skipped: 0, Time elapsed: 253.334 sec
Running org.apache.activemq.store.kahadb.plist.KahaDBFilePendingMessageCursorTest
Tests run: 3, Failures: 0, Errors: 0, Skipped: 0, Time elapsed: 4.858 sec
Running org.apache.activemq.store.leveldb.LevelDBStoreBrokerTest
Tests run: 129, Failures: 0, Errors: 0, Skipped: 0, Time elapsed: 232.2 sec
Running org.apache.activemq.streams.JMSInputStreamTest
Tests run: 10, Failures: 0, Errors: 0, Skipped: 0, Time elapsed: 3.024 sec
Running org.apache.activemq.test.JmsTopicSendReceiveTest
Tests run: 1, Failures: 0, Errors: 0, Skipped: 0, Time elapsed: 1.967 sec
Running org.apache.activemq.test.JmsTopicSendReceiveWithTwoConnectionsAndByteSelectorTest
Tests run: 1, Failures: 0, Errors: 0, Skipped: 0, Time elapsed: 1.976 sec
Running org.apache.activemq.test.JmsTopicSendReceiveWithTwoConnectionsTest
Tests run: 1, Failures: 0, Errors: 0, Skipped: 0, Time elapsed: 1.923 sec
Running org.apache.activemq.test.TemporaryDestinationToFromNameTest
Tests run: 2, Failures: 0, Errors: 0, Skipped: 0, Time elapsed: 0.892 sec
Running org.apache.activemq.test.retroactive.RetroactiveConsumerTestWithDestinationBasedBufferTest
Tests run: 1, Failures: 0, Errors: 0, Skipped: 0, Time elapsed: 1.86 sec
Running org.apache.activemq.test.retroactive.RetroactiveConsumerTestWithLastImagePolicyWithWildcardTest
Tests run: 1, Failures: 0, Errors: 0, Skipped: 0, Time elapsed: 2.201 sec
Running org.apache.activemq.test.retroactive.RetroactiveConsumerTestWithSimpleMessageListTest
Tests run: 1, Failures: 0, Errors: 0, Skipped: 0, Time elapsed: 1.915 sec
Running org.apache.activemq.test.retroactive.RetroactiveConsumerTestWithTimePolicyTest
Tests run: 1, Failures: 0, Errors: 0, Skipped: 0, Time elapsed: 2.617 sec
Running org.apache.activemq.test.retroactive.RetroactiveConsumerWithMessageQueryTest
Tests run: 1, Failures: 0, Errors: 0, Skipped: 0, Time elapsed: 1.959 sec
Running org.apache.activemq.test.rollback.CloseRollbackRedeliveryQueueTest
Tests run: 3, Failures: 0, Errors: 0, Skipped: 0, Time elapsed: 1.243 sec
Running org.apache.activemq.transport.failover.BadConnectionTest
Tests run: 1, Failures: 0, Errors: 0, Skipped: 0, Time elapsed: 1.119 sec
Running org.apache.activemq.transport.failover.FailoverBackupLeakTest
Tests run: 2, Failures: 0, Errors: 0, Skipped: 0, Time elapsed: 5.143 sec
Running org.apache.activemq.transport.failover.FailoverTransportTest
Tests run: 3, Failures: 0, Errors: 0, Skipped: 1, Time elapsed: 0.358 sec
Running org.apache.activemq.transport.failover.FailoverTransportUriHandlingTest
Tests run: 4, Failures: 0, Errors: 0, Skipped: 0, Time elapsed: 0.353 sec
Running org.apache.activemq.transport.failover.FailoverUriTest
Tests run: 16, Failures: 0, Errors: 0, Skipped: 0, Time elapsed: 39.681 sec
Running org.apache.activemq.transport.failover.SlowConnectionTest
Tests run: 1, Failures: 0, Errors: 0, Skipped: 0, Time elapsed: 1.563 sec
Running org.apache.activemq.transport.reliable.ReliableTransportTest
Tests run: 7, Failures: 0, Errors: 0, Skipped: 0, Time elapsed: 0.254 sec
Running org.apache.activemq.transport.tcp.QualityOfServiceUtilsTest
Tests run: 6, Failures: 0, Errors: 0, Skipped: 0, Time elapsed: 0.075 sec
Running org.apache.activemq.transport.tcp.SslTransportFactoryTest
Tests run: 2, Failures: 0, Errors: 0, Skipped: 0, Time elapsed: 0.835 sec
Running org.apache.activemq.transport.tcp.SslTransportServerTest
Tests run: 2, Failures: 0, Errors: 0, Skipped: 0, Time elapsed: 0.219 sec
Running org.apache.activemq.transport.tcp.SslTransportTest
Tests run: 1, Failures: 0, Errors: 0, Skipped: 0, Time elapsed: 0.252 sec
Running org.apache.activemq.transport.tcp.TcpTransportBindTest
Tests run: 2, Failures: 0, Errors: 0, Skipped: 0, Time elapsed: 3.985 sec
Running org.apache.activemq.transport.tcp.TcpTransportServerTest
Tests run: 1, Failures: 0, Errors: 0, Skipped: 0, Time elapsed: 2.269 sec
Running org.apache.activemq.transport.tcp.TransportUriTest
Tests run: 14, Failures: 0, Errors: 0, Skipped: 0, Time elapsed: 30.572 sec
Running org.apache.activemq.transport.tcp.WireformatNegociationTest
Tests run: 5, Failures: 0, Errors: 0, Skipped: 0, Time elapsed: 10.505 sec
Running org.apache.activemq.transport.udp.UdpSendReceiveWithTwoConnectionsAndLargeMessagesTest
Tests run: 1, Failures: 0, Errors: 0, Skipped: 0, Time elapsed: 2.008 sec
Running org.apache.activemq.transport.udp.UdpSendReceiveWithTwoConnectionsTest
Tests run: 1, Failures: 0, Errors: 0, Skipped: 0, Time elapsed: 2.435 sec
Running org.apache.activemq.transport.udp.UdpTransportTest
Tests run: 3, Failures: 0, Errors: 0, Skipped: 0, Time elapsed: 0.679 sec
Running org.apache.activemq.transport.udp.UdpTransportUsingServerTest
Tests run: 4, Failures: 0, Errors: 0, Skipped: 0, Time elapsed: 0.595 sec
Running org.apache.activemq.transport.udp.UpdTransportBindTest
Tests run: 1, Failures: 0, Errors: 0, Skipped: 0, Time elapsed: 0.892 sec
Running org.apache.activemq.transport.vm.VMTransportEmbeddedBrokerTest
Tests run: 1, Failures: 0, Errors: 0, Skipped: 0, Time elapsed: 0.82 sec
Running org.apache.activemq.transport.vm.VMTransportThreadSafeTest
Tests run: 18, Failures: 0, Errors: 0, Skipped: 0, Time elapsed: 63.172 sec
Running org.apache.activemq.usage.CompositeMessageCursorUsageTest
Tests run: 1, Failures: 0, Errors: 0, Skipped: 0, Time elapsed: 1.665 sec
Running org.apache.activemq.usage.JobSchedulerStoreUsageTest
Tests run: 1, Failures: 0, Errors: 0, Skipped: 0, Time elapsed: 33.222 sec
Running org.apache.activemq.usecases.AdvisoryTopicDeletionTest
Tests run: 2, Failures: 0, Errors: 0, Skipped: 0, Time elapsed: 0.984 sec
Running org.apache.activemq.usecases.AuthorizationFromAdminViewTest
Tests run: 1, Failures: 0, Errors: 0, Skipped: 0, Time elapsed: 0.92 sec
Running org.apache.activemq.usecases.BacklogNetworkCrossTalkTest
Running org.apache.activemq.usecases.BrokerQueueNetworkWithDisconnectTest
Tests run: 4, Failures: 0, Errors: 0, Skipped: 0, Time elapsed: 128.502 sec
Running org.apache.activemq.usecases.ChangeSentMessageTest
Tests run: 1, Failures: 0, Errors: 0, Skipped: 0, Time elapsed: 1.017 sec
Running org.apache.activemq.usecases.ChangeSessionDeliveryModeTest
Tests run: 1, Failures: 0, Errors: 0, Skipped: 0, Time elapsed: 0.846 sec
Running org.apache.activemq.usecases.CompositeConsumeTest
Tests run: 1, Failures: 0, Errors: 0, Skipped: 0, Time elapsed: 0.99 sec
Running org.apache.activemq.usecases.ConsumeQueuePrefetchTest
Tests run: 4, Failures: 0, Errors: 0, Skipped: 0, Time elapsed: 8.403 sec
Running org.apache.activemq.usecases.ConsumeTopicPrefetchTest
Tests run: 3, Failures: 0, Errors: 0, Skipped: 0, Time elapsed: 1.258 sec
Running org.apache.activemq.usecases.CreateTemporaryQueueBeforeStartTest
Tests run: 3, Failures: 0, Errors: 0, Skipped: 0, Time elapsed: 6.932 sec
Running org.apache.activemq.usecases.DurableSubProcessConcurrentCommitActivateNoDuplicateTest
Tests run: 1, Failures: 0, Errors: 0, Skipped: 1, Time elapsed: 0.187 sec
Running org.apache.activemq.usecases.DurableSubProcessWithRestartTest
Tests run: 1, Failures: 0, Errors: 0, Skipped: 1, Time elapsed: 0.149 sec
Running org.apache.activemq.usecases.DurableSubsOfflineSelectorConcurrentConsumeIndexUseTest
Tests run: 1, Failures: 0, Errors: 0, Skipped: 0, Time elapsed: 612.243 sec
Running org.apache.activemq.usecases.DurableSubsOfflineSelectorIndexUseTest
Tests run: 3, Failures: 0, Errors: 0, Skipped: 0, Time elapsed: 103.979 sec
Running org.apache.activemq.usecases.ExceptionListenerTest
Tests run: 1, Failures: 0, Errors: 0, Skipped: 0, Time elapsed: 0.065 sec
Running org.apache.activemq.usecases.LevelDBDurableSubscriptionTest
Tests run: 11, Failures: 0, Errors: 0, Skipped: 0, Time elapsed: 38.796 sec
Running org.apache.activemq.usecases.ManagedDurableSubscriptionTest
Tests run: 1, Failures: 0, Errors: 0, Skipped: 0, Time elapsed: 4.291 sec
Running org.apache.activemq.usecases.MessageGroupLateArrivalsTest
Tests run: 2, Failures: 0, Errors: 0, Skipped: 0, Time elapsed: 5.686 sec
Running org.apache.activemq.usecases.NewConsumerCreatesDestinationTest
Tests run: 1, Failures: 0, Errors: 0, Skipped: 0, Time elapsed: 1.128 sec
Running org.apache.activemq.usecases.ObjectMessageNotSerializableTest
Tests run: 2, Failures: 0, Errors: 0, Skipped: 0, Time elapsed: 4.74 sec
Running org.apache.activemq.usecases.PublishOnDurableTopicConsumedMessageTest
Tests run: 1, Failures: 0, Errors: 0, Skipped: 0, Time elapsed: 3.753 sec
Running org.apache.activemq.usecases.PublishOnQueueConsumedMessageTest
Tests run: 1, Failures: 0, Errors: 0, Skipped: 0, Time elapsed: 3.403 sec
Running org.apache.activemq.usecases.PublishOnTemporaryQueueConsumedMessageTest
Tests run: 1, Failures: 0, Errors: 0, Skipped: 0, Time elapsed: 3.719 sec
Running org.apache.activemq.usecases.QueueBrowsingTest
Tests run: 3, Failures: 0, Errors: 0, Skipped: 0, Time elapsed: 97.564 sec
Running org.apache.activemq.usecases.QueueRepeaterTest
Tests run: 1, Failures: 0, Errors: 0, Skipped: 0, Time elapsed: 0.956 sec
Running org.apache.activemq.usecases.RequestReplyTempDestRemovalAdvisoryRaceTest
Tests run: 8, Failures: 0, Errors: 0, Skipped: 0, Time elapsed: 157.962 sec
Running org.apache.activemq.usecases.RequestReplyToTopicViaThreeNetworkHopsTest
Tests run: 1, Failures: 0, Errors: 1, Skipped: 0, Time elapsed: 0.34 sec <<< FAILURE!
Running org.apache.activemq.usecases.SubscribeClosePublishThenConsumeTest
Tests run: 1, Failures: 0, Errors: 0, Skipped: 0, Time elapsed: 1.975 sec
Running org.apache.activemq.usecases.ThreeBrokerTempDestDemandSubscriptionCleanupTest
Tests run: 2, Failures: 0, Errors: 0, Skipped: 0, Time elapsed: 14.778 sec
Running org.apache.activemq.usecases.TopicDurableConnectStatsTest
Tests run: 1, Failures: 0, Errors: 0, Skipped: 0, Time elapsed: 12.728 sec
Running org.apache.activemq.usecases.TopicSubscriptionZeroPrefetchTest
Tests run: 2, Failures: 0, Errors: 0, Skipped: 0, Time elapsed: 3.832 sec
Running org.apache.activemq.usecases.TransactionRollbackOrderTest
Tests run: 1, Failures: 0, Errors: 0, Skipped: 0, Time elapsed: 1.978 sec
Running org.apache.activemq.usecases.TransactionTest
Tests run: 1, Failures: 0, Errors: 0, Skipped: 0, Time elapsed: 1.091 sec
Running org.apache.activemq.usecases.TwoSecureBrokerRequestReplyTest
Tests run: 1, Failures: 0, Errors: 0, Skipped: 0, Time elapsed: 43.187 sec
Running org.apache.activemq.usecases.VirtualTopicNetworkClusterReactivationTest
Tests run: 1, Failures: 1, Errors: 0, Skipped: 0, Time elapsed: 12.407 sec <<< FAILURE!
Running org.apache.activemq.util.LinkedNodeTest
Tests run: 3, Failures: 0, Errors: 0, Skipped: 0, Time elapsed: 0.088 sec
Running org.apache.activemq.util.ReflectionSupportTest
Tests run: 3, Failures: 0, Errors: 0, Skipped: 0, Time elapsed: 0.298 sec
Running org.apache.activemq.xbean.JDBCPersistenceAdapterXBeanConfigTest
Tests run: 1, Failures: 0, Errors: 0, Skipped: 0, Time elapsed: 9.948 sec
Running org.apache.activemq.xbean.ManagementContextXBeanConfigTest
Tests run: 3, Failures: 0, Errors: 0, Skipped: 0, Time elapsed: 4.923 sec
Running org.apache.activemq.xbean.MultipleTestsWithEmbeddedBrokerAndPersistenceTest
Tests run: 2, Failures: 0, Errors: 0, Skipped: 0, Time elapsed: 2.868 sec
Running org.apache.activemq.xbean.MultipleTestsWithEmbeddedBrokerTest
Tests run: 2, Failures: 0, Errors: 0, Skipped: 0, Time elapsed: 0.886 sec
Running org.apache.activemq.xbean.XBeanConfigTest
Tests run: 1, Failures: 0, Errors: 0, Skipped: 0, Time elapsed: 1.861 sec
Running org.apache.activemq.xbean.XBeanStartFalseTest
Tests run: 1, Failures: 0, Errors: 0, Skipped: 0, Time elapsed: 1.614 sec

Results :

Failed tests:   testTransactedStoreUsageSuspendResume(org.apache.activemq.bugs.TransactedStoreUsageSuspendResumeTest):
Got all messages: java.util.concurrent.CountDownLatch@7ec0c6c9[Count = 7580]
  testDurableSubReconnectFromAtoB(org.apache.activemq.usecases.VirtualTopicNetworkClusterReactivationTest)

Tests in error: 
  runWithTempTopicReplyTo(org.apache.activemq.usecases.RequestReplyToTopicViaThreeNetworkHopsTest):
Failed to bind to server socket: tcp://127.0.0.1:60000 due to: java.net.BindException: Address
already in use

Tests run: 2433, Failures: 2, Errors: 1, Skipped: 8

[ERROR] There are test failures.

Please refer to <https://builds.apache.org/job/ActiveMQ-Java7/org.apache.activemq$activemq-unit-tests/ws/target/surefire-reports>
for the individual test results.

Mime
View raw message