activemq-dev mailing list archives

Site index · List index
Message view « Date » · « Thread »
Top « Date » · « Thread »
From Apache Jenkins Server <jenk...@builds.apache.org>
Subject Build failed in Jenkins: ActiveMQ-Java7 » ActiveMQ :: STOMP Protocol #160
Date Thu, 14 Mar 2013 14:32:29 GMT
See <https://builds.apache.org/job/ActiveMQ-Java7/org.apache.activemq$activemq-stomp/160/changes>

Changes:

[tabish] Update to the tests for better stability on some platforms.

------------------------------------------
[INFO] Downloading: http://repo.maven.apache.org/maven2/org/eclipse/jetty/maven-jetty-plugin/7.6.7.v20120910/maven-jetty-plugin-7.6.7.v20120910.pom
[WARNING] The POM for org.eclipse.jetty:maven-jetty-plugin:jar:7.6.7.v20120910 is missing,
no dependency information available
[WARNING] Failed to retrieve plugin descriptor for org.eclipse.jetty:maven-jetty-plugin:7.6.7.v20120910:
Plugin org.eclipse.jetty:maven-jetty-plugin:7.6.7.v20120910 or one of its dependencies could
not be resolved: Failed to read artifact descriptor for org.eclipse.jetty:maven-jetty-plugin:jar:7.6.7.v20120910
                                                                        
[INFO] ------------------------------------------------------------------------
[INFO] Building ActiveMQ :: STOMP Protocol 5.9-SNAPSHOT
[INFO] ------------------------------------------------------------------------
[INFO] 
[INFO] --- maven-clean-plugin:2.5:clean (default-clean) @ activemq-stomp ---
[INFO] 
[INFO] --- maven-enforcer-plugin:1.0.1:enforce (default) @ activemq-stomp ---
[INFO] 
[INFO] --- maven-bundle-plugin:2.3.7:cleanVersions (cleanVersions) @ activemq-stomp ---
[INFO] 
[INFO] --- maven-remote-resources-plugin:1.3:process (default) @ activemq-stomp ---
[debug] execute contextualize
[INFO] [INFO] Using 'UTF-8' encoding to copy filtered resources.
[INFO] Copying 14 resources
[INFO] skip non existing resourceDirectory <https://builds.apache.org/job/ActiveMQ-Java7/org.apache.activemq$activemq-stomp/ws/src/main/filtered-resources>
[INFO] Copying 3 resources

[INFO] --- maven-resources-plugin:2.5:resources (default-resources) @ activemq-stomp ---
[INFO] [INFO] Compiling 24 source files to <https://builds.apache.org/job/ActiveMQ-Java7/org.apache.activemq$activemq-stomp/ws/target/classes>

[INFO] --- maven-compiler-plugin:2.5.1:compile (default-compile) @ activemq-stomp ---
[INFO] [debug] execute contextualize
[INFO] Using 'UTF-8' encoding to copy filtered resources.
[INFO] Copying 6 resources
[INFO] Copying 3 resources

[INFO] --- maven-resources-plugin:2.5:testResources (default-testResources) @ activemq-stomp
---
[INFO] [INFO] Compiling 29 source files to <https://builds.apache.org/job/ActiveMQ-Java7/org.apache.activemq$activemq-stomp/ws/target/test-classes>

[INFO] --- maven-compiler-plugin:2.5.1:testCompile (default-testCompile) @ activemq-stomp
---
[WARNING] bootstrap class path not set in conjunction with -source 1.6
<https://builds.apache.org/job/ActiveMQ-Java7/org.apache.activemq$activemq-stomp/ws/src/test/java/org/apache/activemq/transport/stomp/ConnectTest.java>:[35,29]
[deprecation] Assert in junit.framework has been deprecated
[WARNING] <https://builds.apache.org/job/ActiveMQ-Java7/org.apache.activemq$activemq-stomp/ws/src/test/java/org/apache/activemq/transport/stomp/StompVirtualTopicTest.java>:[31,22]
[deprecation] Assert in junit.framework has been deprecated
[WARNING] <https://builds.apache.org/job/ActiveMQ-Java7/org.apache.activemq$activemq-stomp/ws/src/test/java/org/apache/activemq/transport/stomp/StompVirtualTopicTest.java>:[133,12]
[deprecation] Assert in junit.framework has been deprecated
[WARNING] <https://builds.apache.org/job/ActiveMQ-Java7/org.apache.activemq$activemq-stomp/ws/src/test/java/org/apache/activemq/transport/stomp/StompVirtualTopicTest.java>:[192,20]
[deprecation] Assert in junit.framework has been deprecated
[INFO] [INFO] Surefire report directory: <https://builds.apache.org/job/ActiveMQ-Java7/org.apache.activemq$activemq-stomp/ws/target/surefire-reports>

-------------------------------------------------------
 T E S T S
-------------------------------------------------------

-------------------------------------------------------
 T E S T S
-------------------------------------------------------

[INFO] --- maven-surefire-plugin:2.10:test (default-test) @ activemq-stomp ---
Running org.apache.activemq.transport.stomp.ConnectTest
Tests run: 3, Failures: 0, Errors: 0, Skipped: 0, Time elapsed: 35.732 sec
Running org.apache.activemq.transport.stomp.Stomp11NIOSSLTest
Tests run: 25, Failures: 1, Errors: 0, Skipped: 0, Time elapsed: 111.374 sec <<<
FAILURE!
Running org.apache.activemq.transport.stomp.Stomp11NIOTest
Tests run: 25, Failures: 1, Errors: 0, Skipped: 0, Time elapsed: 110.55 sec <<< FAILURE!
Running org.apache.activemq.transport.stomp.Stomp11SslAuthTest
Tests run: 25, Failures: 1, Errors: 0, Skipped: 0, Time elapsed: 138.177 sec <<<
FAILURE!
Running org.apache.activemq.transport.stomp.Stomp11Test
Tests run: 25, Failures: 1, Errors: 0, Skipped: 0, Time elapsed: 110.704 sec <<<
FAILURE!
Running org.apache.activemq.transport.stomp.Stomp12NIOSSLTest
Tests run: 4, Failures: 1, Errors: 0, Skipped: 0, Time elapsed: 11.687 sec <<< FAILURE!
Running org.apache.activemq.transport.stomp.Stomp12NIOTest
Tests run: 4, Failures: 1, Errors: 0, Skipped: 0, Time elapsed: 10.597 sec <<< FAILURE!
Running org.apache.activemq.transport.stomp.Stomp12SslAuthTest
Tests run: 4, Failures: 1, Errors: 0, Skipped: 0, Time elapsed: 13.886 sec <<< FAILURE!
Running org.apache.activemq.transport.stomp.Stomp12Test
Tests run: 4, Failures: 1, Errors: 0, Skipped: 0, Time elapsed: 10.908 sec <<< FAILURE!
Running org.apache.activemq.transport.stomp.StompAdvisoryTest
Tests run: 7, Failures: 0, Errors: 0, Skipped: 0, Time elapsed: 36.716 sec
Running org.apache.activemq.transport.stomp.StompFrameTest
Tests run: 1, Failures: 0, Errors: 0, Skipped: 0, Time elapsed: 0.078 sec
Running org.apache.activemq.transport.stomp.StompLoadTest
Tests run: 1, Failures: 0, Errors: 0, Skipped: 0, Time elapsed: 73.783 sec
Running org.apache.activemq.transport.stomp.StompMissingMessageTest
Tests run: 2, Failures: 0, Errors: 0, Skipped: 0, Time elapsed: 51.369 sec
Running org.apache.activemq.transport.stomp.StompNIOLoadTest
Tests run: 1, Failures: 0, Errors: 0, Skipped: 0, Time elapsed: 73.914 sec
Running org.apache.activemq.transport.stomp.StompNIOSSLLoadTest
Tests run: 1, Failures: 0, Errors: 0, Skipped: 0, Time elapsed: 74.952 sec
Running org.apache.activemq.transport.stomp.StompNIOSSLTest
Tests run: 73, Failures: 0, Errors: 0, Skipped: 0, Time elapsed: 502.895 sec
Running org.apache.activemq.transport.stomp.StompNIOTest
Tests run: 73, Failures: 0, Errors: 0, Skipped: 0, Time elapsed: 224.041 sec
Running org.apache.activemq.transport.stomp.StompPrefetchTest
Tests run: 4, Failures: 0, Errors: 0, Skipped: 0, Time elapsed: 28.992 sec
Running org.apache.activemq.transport.stomp.StompSSLLoadTest
Tests run: 1, Failures: 0, Errors: 0, Skipped: 0, Time elapsed: 75.305 sec
Running org.apache.activemq.transport.stomp.StompSslAuthTest
Tests run: 73, Failures: 0, Errors: 0, Skipped: 0, Time elapsed: 478.758 sec
Running org.apache.activemq.transport.stomp.StompSslTest
Tests run: 73, Failures: 0, Errors: 0, Skipped: 0, Time elapsed: 401.848 sec
Running org.apache.activemq.transport.stomp.StompSubscriptionRemoveTest
Tests run: 1, Failures: 0, Errors: 0, Skipped: 0, Time elapsed: 9.786 sec
Running org.apache.activemq.transport.stomp.StompTelnetTest
Tests run: 2, Failures: 0, Errors: 0, Skipped: 0, Time elapsed: 6.254 sec
Running org.apache.activemq.transport.stomp.StompTest
Tests run: 73, Failures: 0, Errors: 0, Skipped: 0, Time elapsed: 220.915 sec
Running org.apache.activemq.transport.stomp.StompVirtualTopicTest
Tests run: 1, Failures: 0, Errors: 0, Skipped: 0, Time elapsed: 43.997 sec

Results :

Failed tests:   testAckMessageWithNoId(org.apache.activemq.transport.stomp.Stomp11NIOSSLTest)
  testAckMessageWithNoId(org.apache.activemq.transport.stomp.Stomp11NIOTest)
  testAckMessageWithNoId(org.apache.activemq.transport.stomp.Stomp11SslAuthTest)
  testAckMessageWithNoId(org.apache.activemq.transport.stomp.Stomp11Test)
  testClientAckWithoutAckId(org.apache.activemq.transport.stomp.Stomp12NIOSSLTest)
  testClientAckWithoutAckId(org.apache.activemq.transport.stomp.Stomp12NIOTest)
  testClientAckWithoutAckId(org.apache.activemq.transport.stomp.Stomp12SslAuthTest)
  testClientAckWithoutAckId(org.apache.activemq.transport.stomp.Stomp12Test)

Tests run: 506, Failures: 8, Errors: 0, Skipped: 0

[ERROR] There are test failures.

Please refer to <https://builds.apache.org/job/ActiveMQ-Java7/org.apache.activemq$activemq-stomp/ws/target/surefire-reports>
for the individual test results.

Mime
View raw message