activemq-dev mailing list archives

Site index · List index
Message view « Date » · « Thread »
Top « Date » · « Thread »
From Apache Jenkins Server <jenk...@builds.apache.org>
Subject Build failed in Jenkins: ActiveMQ-Java7 #126
Date Fri, 01 Feb 2013 21:42:39 GMT
See <https://builds.apache.org/job/ActiveMQ-Java7/126/>

------------------------------------------
Started by an SCM change
Building remotely on ubuntu1 in workspace <https://builds.apache.org/job/ActiveMQ-Java7/ws/>
Cleaning local Directory .
Checking out https://svn.apache.org/repos/asf/activemq/trunk
ERROR: Failed to check out https://svn.apache.org/repos/asf/activemq/trunk
org.tmatesoft.svn.core.SVNException: svn: OPTIONS /repos/asf/activemq/trunk failed
	at org.tmatesoft.svn.core.internal.io.dav.http.HTTPConnection.request(HTTPConnection.java:298)
	at org.tmatesoft.svn.core.internal.io.dav.http.HTTPConnection.request(HTTPConnection.java:283)
	at org.tmatesoft.svn.core.internal.io.dav.http.HTTPConnection.request(HTTPConnection.java:271)
	at org.tmatesoft.svn.core.internal.io.dav.DAVConnection.exchangeCapabilities(DAVConnection.java:533)
	at org.tmatesoft.svn.core.internal.io.dav.DAVConnection.open(DAVConnection.java:98)
	at org.tmatesoft.svn.core.internal.io.dav.DAVRepository.openConnection(DAVRepository.java:1011)
	at org.tmatesoft.svn.core.internal.io.dav.DAVRepository.getLatestRevision(DAVRepository.java:180)
	at org.tmatesoft.svn.core.wc.SVNBasicClient.getRevisionNumber(SVNBasicClient.java:482)
	at org.tmatesoft.svn.core.wc.SVNBasicClient.getLocations(SVNBasicClient.java:876)
	at org.tmatesoft.svn.core.wc.SVNBasicClient.createRepository(SVNBasicClient.java:534)
	at org.tmatesoft.svn.core.wc.SVNUpdateClient.doCheckout(SVNUpdateClient.java:901)
	at hudson.scm.subversion.CheckoutUpdater$1.perform(CheckoutUpdater.java:84)
	at hudson.scm.subversion.WorkspaceUpdater$UpdateTask.delegateTo(WorkspaceUpdater.java:136)
	at hudson.scm.SubversionSCM$CheckOutTask.perform(SubversionSCM.java:788)
	at hudson.scm.SubversionSCM$CheckOutTask.invoke(SubversionSCM.java:769)
	at hudson.scm.SubversionSCM$CheckOutTask.invoke(SubversionSCM.java:753)
	at hudson.FilePath$FileCallableWrapper.call(FilePath.java:2309)
	at hudson.remoting.UserRequest.perform(UserRequest.java:118)
	at hudson.remoting.UserRequest.perform(UserRequest.java:48)
	at hudson.remoting.Request$2.run(Request.java:326)
	at hudson.remoting.InterceptingExecutorService$1.call(InterceptingExecutorService.java:72)
	at java.util.concurrent.FutureTask$Sync.innerRun(FutureTask.java:334)
	at java.util.concurrent.FutureTask.run(FutureTask.java:166)
	at java.util.concurrent.ThreadPoolExecutor.runWorker(ThreadPoolExecutor.java:1110)
	at java.util.concurrent.ThreadPoolExecutor$Worker.run(ThreadPoolExecutor.java:603)
	at java.lang.Thread.run(Thread.java:679)
Caused by: org.tmatesoft.svn.core.SVNErrorMessage: svn: OPTIONS /repos/asf/activemq/trunk
failed
	at org.tmatesoft.svn.core.SVNErrorMessage.create(SVNErrorMessage.java:200)
	at org.tmatesoft.svn.core.SVNErrorMessage.create(SVNErrorMessage.java:146)
	at org.tmatesoft.svn.core.SVNErrorMessage.create(SVNErrorMessage.java:89)
	... 26 more
Caused by: org.tmatesoft.svn.core.SVNException: svn: OPTIONS request failed on '/repos/asf/activemq/trunk'
svn: timed out waiting for server
	at org.tmatesoft.svn.core.internal.wc.SVNErrorManager.error(SVNErrorManager.java:64)
	at org.tmatesoft.svn.core.internal.wc.SVNErrorManager.error(SVNErrorManager.java:51)
	at org.tmatesoft.svn.core.internal.io.dav.http.HTTPConnection._request(HTTPConnection.java:662)
	at org.tmatesoft.svn.core.internal.io.dav.http.HTTPConnection.request(HTTPConnection.java:292)
	... 25 more
Caused by: org.tmatesoft.svn.core.SVNErrorMessage: svn: OPTIONS request failed on '/repos/asf/activemq/trunk'
	at org.tmatesoft.svn.core.SVNErrorMessage.create(SVNErrorMessage.java:200)
	at org.tmatesoft.svn.core.internal.io.dav.http.HTTPConnection._request(HTTPConnection.java:660)
	... 26 more
Caused by: org.tmatesoft.svn.core.SVNErrorMessage: svn: timed out waiting for server
	at org.tmatesoft.svn.core.SVNErrorMessage.create(SVNErrorMessage.java:200)
	at org.tmatesoft.svn.core.internal.io.dav.http.HTTPConnection._request(HTTPConnection.java:412)
	... 26 more
Caused by: java.net.SocketTimeoutException: connect timed out
	at java.net.PlainSocketImpl.socketConnect(Native Method)
	at java.net.AbstractPlainSocketImpl.doConnect(AbstractPlainSocketImpl.java:327)
	at java.net.AbstractPlainSocketImpl.connectToAddress(AbstractPlainSocketImpl.java:193)
	at java.net.AbstractPlainSocketImpl.connect(AbstractPlainSocketImpl.java:180)
	at java.net.SocksSocketImpl.connect(SocksSocketImpl.java:384)
	at java.net.Socket.connect(Socket.java:546)
	at sun.security.ssl.SSLSocketImpl.connect(SSLSocketImpl.java:584)
	at org.tmatesoft.svn.core.internal.util.SVNSocketConnection.run(SVNSocketConnection.java:57)
	... 1 more
FATAL: null
java.lang.NullPointerException
	at java.util.ArrayList.addAll(ArrayList.java:530)
	at hudson.scm.SubversionSCM.checkout(SubversionSCM.java:743)
	at hudson.scm.SubversionSCM.checkout(SubversionSCM.java:685)
	at hudson.model.AbstractProject.checkout(AbstractProject.java:1325)
	at hudson.model.AbstractBuild$AbstractBuildExecution.defaultCheckout(AbstractBuild.java:682)
	at jenkins.scm.SCMCheckoutStrategy.checkout(SCMCheckoutStrategy.java:88)
	at hudson.model.AbstractBuild$AbstractBuildExecution.run(AbstractBuild.java:587)
	at hudson.model.Run.execute(Run.java:1543)
	at hudson.maven.MavenModuleSetBuild.run(MavenModuleSetBuild.java:477)
	at hudson.model.ResourceController.execute(ResourceController.java:88)
	at hudson.model.Executor.run(Executor.java:236)

Mime
View raw message