activemq-dev mailing list archives

Site index · List index
Message view « Date » · « Thread »
Top « Date » · « Thread »
From Apache Jenkins Server <jenk...@builds.apache.org>
Subject Build failed in Jenkins: ActiveMQ » ActiveMQ :: Core #1092
Date Thu, 04 Oct 2012 13:06:20 GMT
See <https://builds.apache.org/job/ActiveMQ/org.apache.activemq$activemq-core/1092/>

------------------------------------------
[...truncated 280 lines...]
Tests run: 2, Failures: 0, Errors: 0, Skipped: 0, Time elapsed: 3.334 sec
Running org.apache.activemq.broker.QueueSubscriptionTest
Tests run: 8, Failures: 0, Errors: 0, Skipped: 0, Time elapsed: 2.388 sec
Running org.apache.activemq.broker.ReconnectWithJMXEnabledTest
Tests run: 1, Failures: 0, Errors: 0, Skipped: 0, Time elapsed: 4.511 sec
Running org.apache.activemq.broker.RecoveryBrokerTest
Tests run: 9, Failures: 0, Errors: 0, Skipped: 0, Time elapsed: 28.097 sec
Running org.apache.activemq.broker.RedeliveryRestartTest
Tests run: 2, Failures: 0, Errors: 0, Skipped: 0, Time elapsed: 11.572 sec
Running org.apache.activemq.broker.SpringTest
Tests run: 1, Failures: 0, Errors: 0, Skipped: 0, Time elapsed: 2.386 sec
Running org.apache.activemq.broker.TopicSubscriptionTest
Tests run: 8, Failures: 0, Errors: 0, Skipped: 0, Time elapsed: 3.274 sec
Running org.apache.activemq.broker.XARecoveryBrokerTest
Tests run: 16, Failures: 0, Errors: 0, Skipped: 0, Time elapsed: 68.011 sec
Running org.apache.activemq.broker.advisory.AdvisoryBrokerTest
Tests run: 6, Failures: 0, Errors: 0, Skipped: 0, Time elapsed: 0.805 sec
Running org.apache.activemq.broker.advisory.AdvisoryDuplexNetworkBridgeTest
Tests run: 2, Failures: 0, Errors: 0, Skipped: 0, Time elapsed: 10.821 sec
Running org.apache.activemq.broker.advisory.AdvisoryJmxTest
Tests run: 1, Failures: 0, Errors: 0, Skipped: 0, Time elapsed: 0.692 sec
Running org.apache.activemq.broker.advisory.AdvisoryNetworkBridgeTest
Tests run: 2, Failures: 0, Errors: 0, Skipped: 0, Time elapsed: 10.389 sec
Running org.apache.activemq.broker.ft.DbRestartJDBCQueueMasterSlaveLeaseQuiesceTest
Tests run: 3, Failures: 0, Errors: 0, Skipped: 0, Time elapsed: 40.29 sec
Running org.apache.activemq.broker.ft.DbRestartJDBCQueueMasterSlaveLeaseTest
Tests run: 2, Failures: 0, Errors: 0, Skipped: 0, Time elapsed: 19.263 sec
Running org.apache.activemq.broker.ft.DbRestartJDBCQueueMasterSlaveTest
Running org.apache.activemq.broker.ft.JDBCQueueMasterSlaveTest
Tests run: 2, Failures: 0, Errors: 0, Skipped: 0, Time elapsed: 12.255 sec
Running org.apache.activemq.broker.ft.MasterSlaveProducerFlowControlTest
Tests run: 6, Failures: 0, Errors: 0, Skipped: 0, Time elapsed: 25.649 sec
Running org.apache.activemq.broker.ft.MasterSlaveSlaveDieTest
Tests run: 1, Failures: 0, Errors: 0, Skipped: 0, Time elapsed: 2.399 sec
Running org.apache.activemq.broker.ft.MasterSlaveSlaveShutdownTest
Tests run: 1, Failures: 0, Errors: 0, Skipped: 0, Time elapsed: 32.294 sec
Running org.apache.activemq.broker.ft.QueueMasterSlaveSingleUrlTest
Tests run: 2, Failures: 0, Errors: 0, Skipped: 0, Time elapsed: 14.69 sec
Running org.apache.activemq.broker.ft.QueueMasterSlaveTest
Tests run: 2, Failures: 0, Errors: 0, Skipped: 0, Time elapsed: 12.877 sec
Running org.apache.activemq.broker.ft.QueueMasterSlaveTestUsingSharedFileTest
Tests run: 2, Failures: 0, Errors: 0, Skipped: 0, Time elapsed: 27.149 sec
Running org.apache.activemq.broker.ft.QueueMasterSlaveUsingMasterConnectorElementCompositeQueueTest
Tests run: 2, Failures: 0, Errors: 0, Skipped: 0, Time elapsed: 13.579 sec
Running org.apache.activemq.broker.ft.QueueMasterSlaveUsingMasterConnectorElementTest
Tests run: 2, Failures: 0, Errors: 0, Skipped: 0, Time elapsed: 13.365 sec
Running org.apache.activemq.broker.ft.TopicMasterSlaveTest
Tests run: 2, Failures: 0, Errors: 0, Skipped: 0, Time elapsed: 13.375 sec
Running org.apache.activemq.broker.ft.TransactedTopicMasterSlaveTest
Tests run: 15, Failures: 0, Errors: 0, Skipped: 0, Time elapsed: 80.325 sec
Running org.apache.activemq.broker.jmx.BrokerViewSlowStoreStartupTest
Tests run: 1, Failures: 0, Errors: 0, Skipped: 0, Time elapsed: 0.955 sec
Running org.apache.activemq.broker.jmx.MBeanOperationTimeoutTest
Tests run: 1, Failures: 0, Errors: 0, Skipped: 0, Time elapsed: 8.374 sec
Running org.apache.activemq.broker.jmx.MBeanTest
Tests run: 19, Failures: 0, Errors: 0, Skipped: 0, Time elapsed: 54.759 sec
Running org.apache.activemq.broker.jmx.PurgeTest
Tests run: 5, Failures: 0, Errors: 0, Skipped: 0, Time elapsed: 16.177 sec
Running org.apache.activemq.broker.jmx.TransportConnectorMBeanTest
Tests run: 2, Failures: 0, Errors: 0, Skipped: 0, Time elapsed: 4.536 sec
Running org.apache.activemq.broker.mKahaDBXARecoveryBrokerTest
Tests run: 16, Failures: 0, Errors: 0, Skipped: 0, Time elapsed: 79.043 sec
Running org.apache.activemq.broker.message.security.MessageAuthenticationTest
Tests run: 1, Failures: 0, Errors: 0, Skipped: 0, Time elapsed: 0.637 sec
Running org.apache.activemq.broker.policy.AbortSlowConsumerTest
Tests run: 19, Failures: 0, Errors: 0, Skipped: 0, Time elapsed: 153.97 sec
Running org.apache.activemq.broker.policy.DeadLetterTest
Tests run: 4, Failures: 0, Errors: 0, Skipped: 0, Time elapsed: 2.253 sec
Running org.apache.activemq.broker.policy.DestinationCursorConfigTest
Tests run: 2, Failures: 0, Errors: 0, Skipped: 0, Time elapsed: 1.433 sec
Running org.apache.activemq.broker.policy.IndividualDeadLetterTest
Tests run: 5, Failures: 0, Errors: 0, Skipped: 0, Time elapsed: 4.397 sec
Running org.apache.activemq.broker.policy.IndividualDeadLetterViaXmlTest
Tests run: 4, Failures: 0, Errors: 0, Skipped: 0, Time elapsed: 3.188 sec
Running org.apache.activemq.broker.policy.MessageListenerDeadLetterTest
Tests run: 4, Failures: 0, Errors: 0, Skipped: 0, Time elapsed: 2.201 sec
Running org.apache.activemq.broker.policy.NoConsumerDeadLetterTest
Tests run: 5, Failures: 0, Errors: 0, Skipped: 0, Time elapsed: 1.692 sec
Running org.apache.activemq.broker.policy.NoRetryDeadLetterTest
Tests run: 4, Failures: 0, Errors: 0, Skipped: 0, Time elapsed: 0.913 sec
Running org.apache.activemq.broker.policy.PerDurableConsumerDeadLetterTest
Tests run: 4, Failures: 0, Errors: 0, Skipped: 0, Time elapsed: 2.378 sec
Running org.apache.activemq.broker.policy.PriorityNetworkDispatchPolicyTest
Tests run: 1, Failures: 0, Errors: 0, Skipped: 0, Time elapsed: 0.161 sec
Running org.apache.activemq.broker.policy.RoundRobinDispatchPolicyTest
Tests run: 9, Failures: 0, Errors: 0, Skipped: 0, Time elapsed: 2.815 sec
Running org.apache.activemq.broker.policy.SimpleDispatchPolicyTest
Tests run: 8, Failures: 0, Errors: 0, Skipped: 0, Time elapsed: 3.147 sec
Running org.apache.activemq.broker.policy.StrictOrderDispatchPolicyTest
Tests run: 8, Failures: 0, Errors: 0, Skipped: 0, Time elapsed: 3.309 sec
Running org.apache.activemq.broker.region.DestinationGCTest
Tests run: 2, Failures: 0, Errors: 0, Skipped: 0, Time elapsed: 14.795 sec
Running org.apache.activemq.broker.region.DestinationRemoveRestartTest
Tests run: 2, Failures: 0, Errors: 0, Skipped: 0, Time elapsed: 3.478 sec
Running org.apache.activemq.broker.region.QueueDuplicatesFromStoreTest
Tests run: 2, Failures: 0, Errors: 0, Skipped: 0, Time elapsed: 6.303 sec
Running org.apache.activemq.broker.region.QueueOptimizedDispatchExceptionTest
Tests run: 1, Failures: 0, Errors: 0, Skipped: 0, Time elapsed: 0.479 sec
Running org.apache.activemq.broker.region.QueuePurgeTest
Tests run: 3, Failures: 0, Errors: 0, Skipped: 0, Time elapsed: 80.434 sec
Running org.apache.activemq.broker.region.UniquePropertyMessageEvictionStrategyTest
Tests run: 1, Failures: 0, Errors: 0, Skipped: 0, Time elapsed: 12.466 sec
Running org.apache.activemq.broker.region.cursors.CursorDurableTest
Tests run: 2, Failures: 0, Errors: 0, Skipped: 0, Time elapsed: 4.085 sec
Running org.apache.activemq.broker.region.cursors.CursorQueueStoreTest
Tests run: 5, Failures: 0, Errors: 0, Skipped: 0, Time elapsed: 103.369 sec
Running org.apache.activemq.broker.region.cursors.FilePendingMessageCursorTest
Tests run: 2, Failures: 0, Errors: 0, Skipped: 0, Time elapsed: 2.455 sec
Running org.apache.activemq.broker.region.cursors.NegativeQueueTest
Tests run: 4, Failures: 0, Errors: 0, Skipped: 0, Time elapsed: 100.582 sec
Running org.apache.activemq.broker.region.cursors.OrderPendingListTest
Tests run: 9, Failures: 0, Errors: 0, Skipped: 0, Time elapsed: 0.421 sec
Running org.apache.activemq.broker.region.cursors.PrioritizedPendingListTest
Tests run: 7, Failures: 0, Errors: 0, Skipped: 0, Time elapsed: 0.334 sec
Running org.apache.activemq.broker.region.cursors.StoreBasedCursorTest
Tests run: 5, Failures: 0, Errors: 0, Skipped: 0, Time elapsed: 16.067 sec
Running org.apache.activemq.broker.region.cursors.StoreQueueCursorJDBCNoDuplicateTest
Tests run: 1, Failures: 0, Errors: 0, Skipped: 0, Time elapsed: 3.101 sec
Running org.apache.activemq.broker.region.cursors.StoreQueueCursorJournalNoDuplicateTest
Tests run: 1, Failures: 0, Errors: 0, Skipped: 0, Time elapsed: 0.792 sec
Running org.apache.activemq.broker.region.cursors.StoreQueueCursorKahaDBNoDuplicateTest
Tests run: 1, Failures: 0, Errors: 0, Skipped: 0, Time elapsed: 1.045 sec
Running org.apache.activemq.broker.region.cursors.StoreQueueCursorMemoryNoDuplicateTest
Tests run: 1, Failures: 0, Errors: 0, Skipped: 0, Time elapsed: 0.371 sec
Running org.apache.activemq.broker.region.cursors.StoreQueueCursorNoDuplicateTest
Tests run: 1, Failures: 0, Errors: 0, Skipped: 0, Time elapsed: 1.062 sec
Running org.apache.activemq.broker.region.group.MessageGroupHashBucketTest
Tests run: 2, Failures: 0, Errors: 0, Skipped: 0, Time elapsed: 0.048 sec
Running org.apache.activemq.broker.region.group.MessageGroupMapTest
Tests run: 2, Failures: 0, Errors: 0, Skipped: 0, Time elapsed: 0.031 sec
Running org.apache.activemq.broker.region.group.MessageGroupTest
Tests run: 3, Failures: 0, Errors: 0, Skipped: 0, Time elapsed: 1.351 sec
Running org.apache.activemq.broker.scheduler.CronParserTest
Tests run: 13, Failures: 0, Errors: 0, Skipped: 0, Time elapsed: 0.197 sec
Running org.apache.activemq.broker.scheduler.JmsCronSchedulerTest
Tests run: 2, Failures: 0, Errors: 0, Skipped: 0, Time elapsed: 198.581 sec
Running org.apache.activemq.broker.scheduler.JmsSchedulerTest
Tests run: 5, Failures: 0, Errors: 0, Skipped: 0, Time elapsed: 87.602 sec
Running org.apache.activemq.broker.scheduler.JobSchedulerManagementTest
Tests run: 7, Failures: 0, Errors: 0, Skipped: 0, Time elapsed: 74.945 sec
Running org.apache.activemq.broker.scheduler.JobSchedulerStoreTest
Tests run: 1, Failures: 0, Errors: 0, Skipped: 0, Time elapsed: 1.523 sec
Running org.apache.activemq.broker.scheduler.JobSchedulerTest
Tests run: 9, Failures: 1, Errors: 0, Skipped: 0, Time elapsed: 75.828 sec <<< FAILURE!
testAddCronAndByteSequence(org.apache.activemq.broker.scheduler.JobSchedulerTest)  Time elapsed:
70052 sec  <<< FAILURE!
java.lang.AssertionError
	at org.junit.Assert.fail(Assert.java:92)
	at org.junit.Assert.assertTrue(Assert.java:43)
	at org.junit.Assert.assertTrue(Assert.java:54)
	at org.apache.activemq.broker.scheduler.JobSchedulerTest.testAddCronAndByteSequence(JobSchedulerTest.java:82)
	at sun.reflect.NativeMethodAccessorImpl.invoke0(Native Method)
	at sun.reflect.NativeMethodAccessorImpl.invoke(NativeMethodAccessorImpl.java:39)
	at sun.reflect.DelegatingMethodAccessorImpl.invoke(DelegatingMethodAccessorImpl.java:25)
	at java.lang.reflect.Method.invoke(Method.java:597)
	at org.junit.runners.model.FrameworkMethod$1.runReflectiveCall(FrameworkMethod.java:45)
	at org.junit.internal.runners.model.ReflectiveCallable.run(ReflectiveCallable.java:15)
	at org.junit.runners.model.FrameworkMethod.invokeExplosively(FrameworkMethod.java:42)
	at org.junit.internal.runners.statements.InvokeMethod.evaluate(InvokeMethod.java:20)
	at org.junit.internal.runners.statements.RunBefores.evaluate(RunBefores.java:28)
	at org.junit.internal.runners.statements.RunAfters.evaluate(RunAfters.java:30)
	at org.junit.runners.ParentRunner.runLeaf(ParentRunner.java:263)
	at org.junit.runners.BlockJUnit4ClassRunner.runChild(BlockJUnit4ClassRunner.java:68)
	at org.junit.runners.BlockJUnit4ClassRunner.runChild(BlockJUnit4ClassRunner.java:47)
	at org.junit.runners.ParentRunner$3.run(ParentRunner.java:231)
	at org.junit.runners.ParentRunner$1.schedule(ParentRunner.java:60)
	at org.junit.runners.ParentRunner.runChildren(ParentRunner.java:229)
	at org.junit.runners.ParentRunner.access$000(ParentRunner.java:50)
	at org.junit.runners.ParentRunner$2.evaluate(ParentRunner.java:222)
	at org.junit.runners.ParentRunner.run(ParentRunner.java:300)
	at org.apache.maven.surefire.junit4.JUnit4Provider.execute(JUnit4Provider.java:252)
	at org.apache.maven.surefire.junit4.JUnit4Provider.executeTestSet(JUnit4Provider.java:141)
	at org.apache.maven.surefire.junit4.JUnit4Provider.invoke(JUnit4Provider.java:112)
	at sun.reflect.NativeMethodAccessorImpl.invoke0(Native Method)
	at sun.reflect.NativeMethodAccessorImpl.invoke(NativeMethodAccessorImpl.java:39)
	at sun.reflect.DelegatingMethodAccessorImpl.invoke(DelegatingMethodAccessorImpl.java:25)
	at java.lang.reflect.Method.invoke(Method.java:597)
	at org.apache.maven.surefire.util.ReflectionUtils.invokeMethodWithArray(ReflectionUtils.java:189)
	at org.apache.maven.surefire.booter.ProviderFactory$ProviderProxy.invoke(ProviderFactory.java:165)
	at org.apache.maven.surefire.booter.ProviderFactory.invokeProvider(ProviderFactory.java:85)
	at org.apache.maven.surefire.booter.ForkedBooter.runSuitesInProcess(ForkedBooter.java:115)
	at org.apache.maven.surefire.booter.ForkedBooter.main(ForkedBooter.java:75)

Running org.apache.activemq.broker.store.DefaultStoreRecoveryBrokerTest
Tests run: 9, Failures: 0, Errors: 0, Skipped: 0, Time elapsed: 32.796 sec
Running org.apache.activemq.broker.store.RecoverExpiredMessagesTest
Tests run: 4, Failures: 0, Errors: 0, Skipped: 0, Time elapsed: 30.204 sec
Running org.apache.activemq.broker.store.TransactionStoreTest
Tests run: 1, Failures: 0, Errors: 0, Skipped: 0, Time elapsed: 0.208 sec
Running org.apache.activemq.broker.util.PluginBrokerTest
Tests run: 1, Failures: 0, Errors: 0, Skipped: 0, Time elapsed: 2.369 sec
Running org.apache.activemq.broker.util.RedeliveryPluginTest
Tests run: 1, Failures: 0, Errors: 0, Skipped: 0, Time elapsed: 0.142 sec
Running org.apache.activemq.broker.util.TimeStampingBrokerPluginTest
Tests run: 3, Failures: 0, Errors: 0, Skipped: 0, Time elapsed: 6.844 sec
Running org.apache.activemq.broker.util.TraceBrokerPathPluginTest
Tests run: 1, Failures: 0, Errors: 0, Skipped: 0, Time elapsed: 2.652 sec
Running org.apache.activemq.broker.virtual.CompositeQueueTest
Tests run: 1, Failures: 0, Errors: 0, Skipped: 0, Time elapsed: 0.969 sec
Running org.apache.activemq.broker.virtual.CompositeTopicTest
Tests run: 1, Failures: 0, Errors: 0, Skipped: 0, Time elapsed: 1.429 sec
Running org.apache.activemq.broker.virtual.FilteredQueueTest
Tests run: 1, Failures: 0, Errors: 0, Skipped: 0, Time elapsed: 1.634 sec
Running org.apache.activemq.broker.virtual.MirroredQueueCorrectMemoryUsageTest
Tests run: 1, Failures: 0, Errors: 0, Skipped: 0, Time elapsed: 5.429 sec
Running org.apache.activemq.broker.virtual.MirroredQueueTest
Tests run: 2, Failures: 0, Errors: 0, Skipped: 0, Time elapsed: 0.67 sec
Running org.apache.activemq.broker.virtual.MirroredQueueUsingVirtualTopicQueueTest
Tests run: 2, Failures: 0, Errors: 0, Skipped: 0, Time elapsed: 0.668 sec
Running org.apache.activemq.broker.virtual.VirtualTopicDLQTest
Tests run: 1, Failures: 0, Errors: 0, Skipped: 0, Time elapsed: 7.422 sec
Running org.apache.activemq.broker.virtual.VirtualTopicDisconnectSelectorTest
Tests run: 1, Failures: 0, Errors: 0, Skipped: 0, Time elapsed: 1.712 sec
Running org.apache.activemq.broker.virtual.VirtualTopicPubSubTest
Tests run: 2, Failures: 0, Errors: 0, Skipped: 0, Time elapsed: 0.842 sec
Running org.apache.activemq.broker.virtual.VirtualTopicPubSubUsingXBeanTest
Tests run: 2, Failures: 0, Errors: 0, Skipped: 0, Time elapsed: 0.766 sec
Running org.apache.activemq.broker.virtual.VirtualTopicSelectorTest
Tests run: 1, Failures: 0, Errors: 0, Skipped: 0, Time elapsed: 0.643 sec
Running org.apache.activemq.broker.virtual.VirtualTopicsAndDurableSubsTest
Tests run: 20, Failures: 0, Errors: 0, Skipped: 0, Time elapsed: 48.86 sec
Running org.apache.activemq.bugs.AMQ1687Test
Tests run: 1, Failures: 0, Errors: 0, Skipped: 0, Time elapsed: 2.511 sec
Running org.apache.activemq.bugs.AMQ1853Test
Tests run: 1, Failures: 0, Errors: 0, Skipped: 0, Time elapsed: 7.361 sec
Running org.apache.activemq.bugs.AMQ1893Test
Tests run: 1, Failures: 0, Errors: 0, Skipped: 0, Time elapsed: 15.733 sec
Running org.apache.activemq.bugs.AMQ1917Test
Tests run: 1, Failures: 0, Errors: 0, Skipped: 0, Time elapsed: 4.637 sec
Running org.apache.activemq.bugs.AMQ1936Test
Tests run: 1, Failures: 0, Errors: 0, Skipped: 0, Time elapsed: 34.199 sec
Running org.apache.activemq.bugs.AMQ2021Test
Tests run: 1, Failures: 0, Errors: 0, Skipped: 0, Time elapsed: 4.636 sec
Running org.apache.activemq.bugs.AMQ2084Test
Tests run: 2, Failures: 0, Errors: 0, Skipped: 0, Time elapsed: 8.726 sec
Running org.apache.activemq.bugs.AMQ2102Test
Tests run: 2, Failures: 0, Errors: 0, Skipped: 0, Time elapsed: 47.886 sec
Running org.apache.activemq.bugs.AMQ2103Test
Tests run: 2, Failures: 0, Errors: 0, Skipped: 0, Time elapsed: 0.651 sec
Running org.apache.activemq.bugs.AMQ2149KahaDBTest

Results :

Failed tests:   testAddCronAndByteSequence(org.apache.activemq.broker.scheduler.JobSchedulerTest)

Tests run: 1228, Failures: 1, Errors: 0, Skipped: 0

mojoFailed org.apache.maven.plugins:maven-surefire-plugin:2.12.3(default-test)
[JENKINS] Recording test results
projectFailed org.apache.activemq:activemq-core:5.8-SNAPSHOT

Mime
View raw message