activemq-dev mailing list archives

Site index · List index
Message view « Date » · « Thread »
Top « Date » · « Thread »
From Apache Jenkins Server <jenk...@builds.apache.org>
Subject Build failed in Jenkins: ActiveMQ #1095
Date Sun, 07 Oct 2012 13:18:00 GMT
See <https://builds.apache.org/job/ActiveMQ/1095/changes>

Changes:

[davsclaus] AMQ-1492: Allow to configure whether changing auto commit is allowed on JDBC persistence
adapter. Some JDBC drivers dont allow changing that.

[davsclaus] AMQ-1719: Avoid potential NPE in connection state tracker.

------------------------------------------
[...truncated 6113 lines...]
Oct 7, 2012 1:17:20 PM hudson.maven.ExecutedMojo <init>
WARNING: Failed to getClass for org.apache.maven.plugin.source.SourceJarMojo
forkedProjectSucceeded org.apache.activemq.tooling:activemq-tooling:5.8-SNAPSHOT
mojoStarted org.apache.maven.plugins:maven-source-plugin:2.1.2(default-cli)
[INFO] 
[INFO] --- maven-source-plugin:2.1.2:jar (default-cli) @ activemq-tooling ---
mojoSucceeded org.apache.maven.plugins:maven-source-plugin:2.1.2(default-cli)
projectSucceeded org.apache.activemq.tooling:activemq-tooling:5.8-SNAPSHOT
projectSkipped org.apache.activemq.tooling:maven-activemq-memtest-plugin:5.8-SNAPSHOT
[INFO]                                                                         
[INFO] ------------------------------------------------------------------------
[INFO] Skipping ActiveMQ :: Memory Usage Test Plugin
[INFO] This project has been banned from the build due to previous failures.
[INFO] ------------------------------------------------------------------------
projectSkipped org.apache.activemq.tooling:maven-activemq-perf-plugin:5.8-SNAPSHOT
[INFO]                                                                         
[INFO] ------------------------------------------------------------------------
[INFO] Skipping ActiveMQ :: Performance Test Plugin
[INFO] This project has been banned from the build due to previous failures.
[INFO] ------------------------------------------------------------------------
projectSkipped org.apache.activemq.tooling:maven-activemq-plugin:5.8-SNAPSHOT
[INFO]                                                                         
[INFO] ------------------------------------------------------------------------
[INFO] Skipping ActiveMQ :: StartUp Plugin
[INFO] This project has been banned from the build due to previous failures.
[INFO] ------------------------------------------------------------------------
projectSkipped org.apache.activemq:activemq-web:5.8-SNAPSHOT
[INFO]                                                                         
[INFO] ------------------------------------------------------------------------
[INFO] Skipping ActiveMQ :: Web
[INFO] This project has been banned from the build due to previous failures.
[INFO] ------------------------------------------------------------------------
projectSkipped org.apache.activemq:activemq-web-demo:5.8-SNAPSHOT
[INFO]                                                                         
[INFO] ------------------------------------------------------------------------
[INFO] Skipping ActiveMQ :: Web Demo
[INFO] This project has been banned from the build due to previous failures.
[INFO] ------------------------------------------------------------------------
projectSkipped org.apache.activemq:activemq-xmpp:5.8-SNAPSHOT
[INFO]                                                                         
[INFO] ------------------------------------------------------------------------
[INFO] Skipping ActiveMQ :: XMPP
[INFO] This project has been banned from the build due to previous failures.
[INFO] ------------------------------------------------------------------------
projectSkipped org.apache.activemq:activemq-web-console:5.8-SNAPSHOT
[INFO]                                                                         
[INFO] ------------------------------------------------------------------------
[INFO] Skipping ActiveMQ :: Web Console
[INFO] This project has been banned from the build due to previous failures.
[INFO] ------------------------------------------------------------------------
projectStarted org.apache.activemq:tests:5.8-SNAPSHOT
[INFO] Downloading: http://repo1.maven.org/maven2/org/eclipse/jetty/maven-jetty-plugin/7.6.7.v20120910/maven-jetty-plugin-7.6.7.v20120910.pom
[WARNING] The POM for org.eclipse.jetty:maven-jetty-plugin:jar:7.6.7.v20120910 is missing,
no dependency information available
[WARNING] Failed to retrieve plugin descriptor for org.eclipse.jetty:maven-jetty-plugin:7.6.7.v20120910:
Plugin org.eclipse.jetty:maven-jetty-plugin:7.6.7.v20120910 or one of its dependencies could
not be resolved: Failed to read artifact descriptor for org.eclipse.jetty:maven-jetty-plugin:jar:7.6.7.v20120910
                                                                        
[INFO] ------------------------------------------------------------------------
[INFO] Building ActiveMQ :: Integration Tests 5.8-SNAPSHOT
[INFO] ------------------------------------------------------------------------
mojoStarted org.apache.maven.plugins:maven-clean-plugin:2.5(default-clean)
[INFO] 
[INFO] --- maven-clean-plugin:2.5:clean (default-clean) @ tests ---
mojoSucceeded org.apache.maven.plugins:maven-clean-plugin:2.5(default-clean)
mojoStarted org.apache.maven.plugins:maven-enforcer-plugin:1.0.1(default)
[INFO] 
[INFO] --- maven-enforcer-plugin:1.0.1:enforce (default) @ tests ---
mojoSucceeded org.apache.maven.plugins:maven-enforcer-plugin:1.0.1(default)
mojoStarted org.apache.felix:maven-bundle-plugin:2.3.7(cleanVersions)
[INFO] 
[INFO] --- maven-bundle-plugin:2.3.7:cleanVersions (cleanVersions) @ tests ---
mojoSucceeded org.apache.felix:maven-bundle-plugin:2.3.7(cleanVersions)
mojoStarted org.apache.maven.plugins:maven-remote-resources-plugin:1.3(default)
[INFO] 
[INFO] --- maven-remote-resources-plugin:1.3:process (default) @ tests ---
mojoSucceeded org.apache.maven.plugins:maven-remote-resources-plugin:1.3(default)
mojoStarted org.apache.maven.plugins:maven-site-plugin:3.1(attach-descriptor)
[INFO] 
[INFO] --- maven-site-plugin:3.1:attach-descriptor (attach-descriptor) @ tests ---
mojoSucceeded org.apache.maven.plugins:maven-site-plugin:3.1(attach-descriptor)
mojoStarted org.codehaus.mojo:ianal-maven-plugin:1.0-alpha-1(default)
[INFO] 
[INFO] --- ianal-maven-plugin:1.0-alpha-1:verify-legal-files (default) @ tests ---
mojoSucceeded org.codehaus.mojo:ianal-maven-plugin:1.0-alpha-1(default)
mojoStarted org.apache.maven.plugins:maven-install-plugin:2.3.1(default-install)[INFO] Installing
<https://builds.apache.org/job/ActiveMQ/ws/tests/pom.xml> to /home/hudson/hudson-slave/maven-repositories/1/org/apache/activemq/tests/5.8-SNAPSHOT/tests-5.8-SNAPSHOT.pom

[INFO] 
[INFO] --- maven-install-plugin:2.3.1:install (default-install) @ tests ---
mojoSucceeded org.apache.maven.plugins:maven-install-plugin:2.3.1(default-install)
forkedProjectStarted org.apache.activemq:tests:5.8-SNAPSHOT
mojoStarted org.apache.maven.plugins:maven-enforcer-plugin:1.0.1(default)
[INFO] 
[INFO] --- maven-enforcer-plugin:1.0.1:enforce (default) @ tests ---
mojoSucceeded org.apache.maven.plugins:maven-enforcer-plugin:1.0.1(default)
mojoStarted org.apache.felix:maven-bundle-plugin:2.3.7(cleanVersions)
[INFO] 
[INFO] --- maven-bundle-plugin:2.3.7:cleanVersions (cleanVersions) @ tests ---
mojoSucceeded org.apache.felix:maven-bundle-plugin:2.3.7(cleanVersions)
Oct 7, 2012 1:17:23 PM hudson.maven.ExecutedMojo <init>
WARNING: Failed to getClass for org.apache.maven.plugin.source.SourceJarMojo
forkedProjectSucceeded org.apache.activemq:tests:5.8-SNAPSHOT
mojoStarted org.apache.maven.plugins:maven-source-plugin:2.1.2(default-cli)
[INFO] 
[INFO] --- maven-source-plugin:2.1.2:jar (default-cli) @ tests ---
mojoSucceeded org.apache.maven.plugins:maven-source-plugin:2.1.2(default-cli)
projectSucceeded org.apache.activemq:tests:5.8-SNAPSHOT
projectSkipped org.apache.activemq:activemq-itest-spring31:5.8-SNAPSHOT
[INFO]                                                                         
[INFO] ------------------------------------------------------------------------
[INFO] Skipping ActiveMQ :: Integration Test :: Spring 3.1
[INFO] This project has been banned from the build due to previous failures.
[INFO] ------------------------------------------------------------------------
projectSkipped org.apache.activemq:apache-activemq:5.8-SNAPSHOT
[INFO]                                                                         
[INFO] ------------------------------------------------------------------------
[INFO] Skipping ActiveMQ :: Assembly
[INFO] This project has been banned from the build due to previous failures.
[INFO] ------------------------------------------------------------------------
sessionEnded
[INFO] ------------------------------------------------------------------------
[INFO] Reactor Summary:
[INFO] 
[INFO] ActiveMQ .......................................... SUCCESS [22.455s]
[INFO] ActiveMQ :: KahaDB ................................ SUCCESS [10:41.321s]
[INFO] ActiveMQ :: JAAS .................................. SUCCESS [21.949s]
[INFO] ActiveMQ :: Openwire Generator .................... SUCCESS [3.299s]
[INFO] ActiveMQ :: Core .................................. FAILURE [1:00:34.069s]
[INFO] ActiveMQ :: RA .................................... SKIPPED
[INFO] ActiveMQ :: Pool .................................. SKIPPED
[INFO] ActiveMQ :: Spring ................................ SKIPPED
[INFO] ActiveMQ :: Camel ................................. SKIPPED
[INFO] ActiveMQ :: Console ............................... SKIPPED
[INFO] ActiveMQ :: Optional .............................. SKIPPED
[INFO] ActiveMQ :: All JAR bundle ........................ SKIPPED
[INFO] ActiveMQ :: File Server ........................... SKIPPED
[INFO] ActiveMQ :: Blueprint ............................. SUCCESS [7.695s]
[INFO] ActiveMQ :: Apache Karaf .......................... SKIPPED
[INFO] ActiveMQ :: LevelDB ............................... SKIPPED
[INFO] ActiveMQ :: RAR ................................... SKIPPED
[INFO] ActiveMQ :: Run Jar ............................... SKIPPED
[INFO] ActiveMQ :: Tooling ............................... SUCCESS [2.510s]
[INFO] ActiveMQ :: Memory Usage Test Plugin .............. SKIPPED
[INFO] ActiveMQ :: Performance Test Plugin ............... SKIPPED
[INFO] ActiveMQ :: StartUp Plugin ........................ SKIPPED
[INFO] ActiveMQ :: Web ................................... SKIPPED
[INFO] ActiveMQ :: Web Demo .............................. SKIPPED
[INFO] ActiveMQ :: XMPP .................................. SKIPPED
[INFO] ActiveMQ :: Web Console ........................... SKIPPED
[INFO] ActiveMQ :: Integration Tests ..................... SUCCESS [2.383s]
[INFO] ActiveMQ :: Integration Test :: Spring 3.1 ........ SKIPPED
[INFO] ActiveMQ :: Assembly .............................. SKIPPED
[INFO] ------------------------------------------------------------------------
[INFO] BUILD FAILURE
[INFO] ------------------------------------------------------------------------
[INFO] Total time: 1:12:23.724s
[INFO] Finished at: Sun Oct 07 13:17:24 UTC 2012
[INFO] Final Memory: 99M/1232M
[INFO] ------------------------------------------------------------------------
Projects to build: [MavenProject: org.apache.activemq:activemq-parent:5.8-SNAPSHOT @ <https://builds.apache.org/job/ActiveMQ/ws/pom.xml,>
MavenProject: org.apache.activemq:kahadb:5.8-SNAPSHOT @ <https://builds.apache.org/job/ActiveMQ/ws/kahadb/pom.xml,>
MavenProject: org.apache.activemq:activemq-jaas:5.8-SNAPSHOT @ <https://builds.apache.org/job/ActiveMQ/ws/activemq-jaas/pom.xml,>
MavenProject: org.apache.activemq:activemq-openwire-generator:5.8-SNAPSHOT @ <https://builds.apache.org/job/ActiveMQ/ws/activemq-openwire-generator/pom.xml,>
MavenProject: org.apache.activemq:activemq-core:5.8-SNAPSHOT @ <https://builds.apache.org/job/ActiveMQ/ws/activemq-core/pom.xml,>
MavenProject: org.apache.activemq:activemq-ra:5.8-SNAPSHOT @ <https://builds.apache.org/job/ActiveMQ/ws/activemq-ra/pom.xml,>
MavenProject: org.apache.activemq:activemq-pool:5.8-SNAPSHOT @ <https://builds.apache.org/job/ActiveMQ/ws/activemq-pool/pom.xml,>
MavenProject: org.apache.activemq:activemq-spring:5.8-SNAPSHOT @ <https://builds.apache.org/job/ActiveMQ/ws/activemq-spring/pom.xml,>
MavenProject: org.apache.activemq:activemq-camel:5.8-SNAPSHOT @ <https://builds.apache.org/job/ActiveMQ/ws/activemq-camel/pom.xml,>
MavenProject: org.apache.activemq:activemq-console:5.8-SNAPSHOT @ <https://builds.apache.org/job/ActiveMQ/ws/activemq-console/pom.xml,>
MavenProject: org.apache.activemq:activemq-optional:5.8-SNAPSHOT @ <https://builds.apache.org/job/ActiveMQ/ws/activemq-optional/pom.xml,>
MavenProject: org.apache.activemq:activemq-all:5.8-SNAPSHOT @ <https://builds.apache.org/job/ActiveMQ/ws/activemq-all/pom.xml,>
MavenProject: org.apache.activemq:activemq-fileserver:5.8-SNAPSHOT @ <https://builds.apache.org/job/ActiveMQ/ws/activemq-fileserver/pom.xml,>
MavenProject: org.apache.activemq:activemq-blueprint:5.8-SNAPSHOT @ <https://builds.apache.org/job/ActiveMQ/ws/activemq-blueprint/pom.xml,>
MavenProject: org.apache.activemq:activemq-karaf:5.8-SNAPSHOT @ <https://builds.apache.org/job/ActiveMQ/ws/activemq-karaf/pom.xml,>
MavenProject: org.apache.activemq:activemq-leveldb:5.8-SNAPSHOT @ <https://builds.apache.org/job/ActiveMQ/ws/activemq-leveldb/pom.xml,>
MavenProject: org.apache.activemq:activemq-rar:5.8-SNAPSHOT @ <https://builds.apache.org/job/ActiveMQ/ws/activemq-rar/pom.xml,>
MavenProject: org.apache.activemq:activemq-run:5.8-SNAPSHOT @ <https://builds.apache.org/job/ActiveMQ/ws/activemq-run/pom.xml,>
MavenProject: org.apache.activemq.tooling:activemq-tooling:5.8-SNAPSHOT @ <https://builds.apache.org/job/ActiveMQ/ws/activemq-tooling/pom.xml,>
MavenProject: org.apache.activemq.tooling:maven-activemq-memtest-plugin:5.8-SNAPSHOT @ <https://builds.apache.org/job/ActiveMQ/ws/activemq-tooling/maven-activemq-memtest-plugin/pom.xml,>
MavenProject: org.apache.activemq.tooling:maven-activemq-perf-plugin:5.8-SNAPSHOT @ <https://builds.apache.org/job/ActiveMQ/ws/activemq-tooling/maven-activemq-perf-plugin/pom.xml,>
MavenProject: org.apache.activemq.tooling:maven-activemq-plugin:5.8-SNAPSHOT @ <https://builds.apache.org/job/ActiveMQ/ws/activemq-tooling/maven-activemq-plugin/pom.xml,>
MavenProject: org.apache.activemq:activemq-web:5.8-SNAPSHOT @ <https://builds.apache.org/job/ActiveMQ/ws/activemq-web/pom.xml,>
MavenProject: org.apache.activemq:activemq-web-demo:5.8-SNAPSHOT @ <https://builds.apache.org/job/ActiveMQ/ws/activemq-web-demo/pom.xml,>
MavenProject: org.apache.activemq:activemq-xmpp:5.8-SNAPSHOT @ <https://builds.apache.org/job/ActiveMQ/ws/activemq-xmpp/pom.xml,>
MavenProject: org.apache.activemq:activemq-web-console:5.8-SNAPSHOT @ <https://builds.apache.org/job/ActiveMQ/ws/activemq-web-console/pom.xml,>
MavenProject: org.apache.activemq:tests:5.8-SNAPSHOT @ <https://builds.apache.org/job/ActiveMQ/ws/tests/pom.xml,>
MavenProject: org.apache.activemq:activemq-itest-spring31:5.8-SNAPSHOT @ <https://builds.apache.org/job/ActiveMQ/ws/tests/activemq-itest-spring31/pom.xml,>
MavenProject: org.apache.activemq:apache-activemq:5.8-SNAPSHOT @ <https://builds.apache.org/job/ActiveMQ/ws/assembly/pom.xml]>
[JENKINS] Archiving <https://builds.apache.org/job/ActiveMQ/ws/pom.xml> to /home/hudson/hudson/jobs/ActiveMQ/modules/org.apache.activemq$activemq-parent/builds/2012-10-07_12-04-43/archive/org.apache.activemq/activemq-parent/5.8-SNAPSHOT/activemq-parent-5.8-SNAPSHOT.pom
[JENKINS] Archiving <https://builds.apache.org/job/ActiveMQ/ws/assembly/pom.xml> to
/home/hudson/hudson/jobs/ActiveMQ/modules/org.apache.activemq$apache-activemq/builds/2012-10-07_12-04-45/archive/org.apache.activemq/apache-activemq/5.8-SNAPSHOT/apache-activemq-5.8-SNAPSHOT.pom
[JENKINS] Archiving <https://builds.apache.org/job/ActiveMQ/ws/activemq-camel/pom.xml>
to /home/hudson/hudson/jobs/ActiveMQ/modules/org.apache.activemq$activemq-camel/builds/2012-10-07_12-04-43/archive/org.apache.activemq/activemq-camel/5.8-SNAPSHOT/activemq-camel-5.8-SNAPSHOT.pom
[JENKINS] Archiving <https://builds.apache.org/job/ActiveMQ/ws/activemq-tooling/maven-activemq-memtest-plugin/pom.xml>
to /home/hudson/hudson/jobs/ActiveMQ/modules/org.apache.activemq.tooling$maven-activemq-memtest-plugin/builds/2012-10-07_12-04-44/archive/org.apache.activemq.tooling/maven-activemq-memtest-plugin/5.8-SNAPSHOT/maven-activemq-memtest-plugin-5.8-SNAPSHOT.pom
[JENKINS] Archiving <https://builds.apache.org/job/ActiveMQ/ws/activemq-tooling/pom.xml>
to /home/hudson/hudson/jobs/ActiveMQ/modules/org.apache.activemq.tooling$activemq-tooling/builds/2012-10-07_12-04-44/archive/org.apache.activemq.tooling/activemq-tooling/5.8-SNAPSHOT/activemq-tooling-5.8-SNAPSHOT.pom
[JENKINS] Archiving <https://builds.apache.org/job/ActiveMQ/ws/activemq-core/pom.xml>
to /home/hudson/hudson/jobs/ActiveMQ/modules/org.apache.activemq$activemq-core/builds/2012-10-07_12-04-43/archive/org.apache.activemq/activemq-core/5.8-SNAPSHOT/activemq-core-5.8-SNAPSHOT.pom
[JENKINS] Archiving <https://builds.apache.org/job/ActiveMQ/ws/activemq-pool/pom.xml>
to /home/hudson/hudson/jobs/ActiveMQ/modules/org.apache.activemq$activemq-pool/builds/2012-10-07_12-04-44/archive/org.apache.activemq/activemq-pool/5.8-SNAPSHOT/activemq-pool-5.8-SNAPSHOT.pom
[JENKINS] Archiving <https://builds.apache.org/job/ActiveMQ/ws/activemq-blueprint/pom.xml>
to /home/hudson/hudson/jobs/ActiveMQ/modules/org.apache.activemq$activemq-blueprint/builds/2012-10-07_12-04-44/archive/org.apache.activemq/activemq-blueprint/5.8-SNAPSHOT/activemq-blueprint-5.8-SNAPSHOT.pom
[JENKINS] Archiving <https://builds.apache.org/job/ActiveMQ/ws/activemq-blueprint/target/activemq-blueprint-5.8-SNAPSHOT.jar>
to /home/hudson/hudson/jobs/ActiveMQ/modules/org.apache.activemq$activemq-blueprint/builds/2012-10-07_12-04-44/archive/org.apache.activemq/activemq-blueprint/5.8-SNAPSHOT/activemq-blueprint-5.8-SNAPSHOT.jar
[JENKINS] Archiving <https://builds.apache.org/job/ActiveMQ/ws/activemq-blueprint/target/activemq-blueprint-5.8-SNAPSHOT-sources.jar>
to /home/hudson/hudson/jobs/ActiveMQ/modules/org.apache.activemq$activemq-blueprint/builds/2012-10-07_12-04-44/archive/org.apache.activemq/activemq-blueprint/5.8-SNAPSHOT/activemq-blueprint-5.8-SNAPSHOT-sources.jar
[JENKINS] Archiving <https://builds.apache.org/job/ActiveMQ/ws/activemq-spring/pom.xml>
to /home/hudson/hudson/jobs/ActiveMQ/modules/org.apache.activemq$activemq-spring/builds/2012-10-07_12-04-44/archive/org.apache.activemq/activemq-spring/5.8-SNAPSHOT/activemq-spring-5.8-SNAPSHOT.pom
[JENKINS] Archiving <https://builds.apache.org/job/ActiveMQ/ws/activemq-tooling/maven-activemq-plugin/pom.xml>
to /home/hudson/hudson/jobs/ActiveMQ/modules/org.apache.activemq.tooling$maven-activemq-plugin/builds/2012-10-07_12-04-44/archive/org.apache.activemq.tooling/maven-activemq-plugin/5.8-SNAPSHOT/maven-activemq-plugin-5.8-SNAPSHOT.pom
[JENKINS] Archiving <https://builds.apache.org/job/ActiveMQ/ws/activemq-karaf/pom.xml>
to /home/hudson/hudson/jobs/ActiveMQ/modules/org.apache.activemq$activemq-karaf/builds/2012-10-07_12-04-44/archive/org.apache.activemq/activemq-karaf/5.8-SNAPSHOT/activemq-karaf-5.8-SNAPSHOT.pom
[JENKINS] Archiving <https://builds.apache.org/job/ActiveMQ/ws/activemq-leveldb/pom.xml>
to /home/hudson/hudson/jobs/ActiveMQ/modules/org.apache.activemq$activemq-leveldb/builds/2012-10-07_12-04-44/archive/org.apache.activemq/activemq-leveldb/5.8-SNAPSHOT/activemq-leveldb-5.8-SNAPSHOT.pom
[JENKINS] Archiving <https://builds.apache.org/job/ActiveMQ/ws/activemq-web-demo/pom.xml>
to /home/hudson/hudson/jobs/ActiveMQ/modules/org.apache.activemq$activemq-web-demo/builds/2012-10-07_12-04-44/archive/org.apache.activemq/activemq-web-demo/5.8-SNAPSHOT/activemq-web-demo-5.8-SNAPSHOT.pom
[JENKINS] Archiving <https://builds.apache.org/job/ActiveMQ/ws/activemq-web-console/pom.xml>
to /home/hudson/hudson/jobs/ActiveMQ/modules/org.apache.activemq$activemq-web-console/builds/2012-10-07_12-04-44/archive/org.apache.activemq/activemq-web-console/5.8-SNAPSHOT/activemq-web-console-5.8-SNAPSHOT.pom
[JENKINS] Archiving <https://builds.apache.org/job/ActiveMQ/ws/kahadb/pom.xml> to /home/hudson/hudson/jobs/ActiveMQ/modules/org.apache.activemq$kahadb/builds/2012-10-07_12-04-45/archive/org.apache.activemq/kahadb/5.8-SNAPSHOT/kahadb-5.8-SNAPSHOT.pom
[JENKINS] Archiving <https://builds.apache.org/job/ActiveMQ/ws/kahadb/target/kahadb-5.8-SNAPSHOT.jar>
to /home/hudson/hudson/jobs/ActiveMQ/modules/org.apache.activemq$kahadb/builds/2012-10-07_12-04-45/archive/org.apache.activemq/kahadb/5.8-SNAPSHOT/kahadb-5.8-SNAPSHOT.jar
[JENKINS] Archiving <https://builds.apache.org/job/ActiveMQ/ws/kahadb/target/kahadb-5.8-SNAPSHOT-sources.jar>
to /home/hudson/hudson/jobs/ActiveMQ/modules/org.apache.activemq$kahadb/builds/2012-10-07_12-04-45/archive/org.apache.activemq/kahadb/5.8-SNAPSHOT/kahadb-5.8-SNAPSHOT-sources.jar
[JENKINS] Archiving <https://builds.apache.org/job/ActiveMQ/ws/activemq-jaas/pom.xml>
to /home/hudson/hudson/jobs/ActiveMQ/modules/org.apache.activemq$activemq-jaas/builds/2012-10-07_12-04-43/archive/org.apache.activemq/activemq-jaas/5.8-SNAPSHOT/activemq-jaas-5.8-SNAPSHOT.pom
[JENKINS] Archiving <https://builds.apache.org/job/ActiveMQ/ws/activemq-jaas/target/activemq-jaas-5.8-SNAPSHOT.jar>
to /home/hudson/hudson/jobs/ActiveMQ/modules/org.apache.activemq$activemq-jaas/builds/2012-10-07_12-04-43/archive/org.apache.activemq/activemq-jaas/5.8-SNAPSHOT/activemq-jaas-5.8-SNAPSHOT.jar
[JENKINS] Archiving <https://builds.apache.org/job/ActiveMQ/ws/activemq-jaas/target/activemq-jaas-5.8-SNAPSHOT-sources.jar>
to /home/hudson/hudson/jobs/ActiveMQ/modules/org.apache.activemq$activemq-jaas/builds/2012-10-07_12-04-43/archive/org.apache.activemq/activemq-jaas/5.8-SNAPSHOT/activemq-jaas-5.8-SNAPSHOT-sources.jar
[JENKINS] Archiving <https://builds.apache.org/job/ActiveMQ/ws/activemq-run/pom.xml>
to /home/hudson/hudson/jobs/ActiveMQ/modules/org.apache.activemq$activemq-run/builds/2012-10-07_12-04-44/archive/org.apache.activemq/activemq-run/5.8-SNAPSHOT/activemq-run-5.8-SNAPSHOT.pom
[JENKINS] Archiving <https://builds.apache.org/job/ActiveMQ/ws/activemq-openwire-generator/pom.xml>
to /home/hudson/hudson/jobs/ActiveMQ/modules/org.apache.activemq$activemq-openwire-generator/builds/2012-10-07_12-04-44/archive/org.apache.activemq/activemq-openwire-generator/5.8-SNAPSHOT/activemq-openwire-generator-5.8-SNAPSHOT.pom
[JENKINS] Archiving <https://builds.apache.org/job/ActiveMQ/ws/activemq-openwire-generator/target/activemq-openwire-generator-5.8-SNAPSHOT.jar>
to /home/hudson/hudson/jobs/ActiveMQ/modules/org.apache.activemq$activemq-openwire-generator/builds/2012-10-07_12-04-44/archive/org.apache.activemq/activemq-openwire-generator/5.8-SNAPSHOT/activemq-openwire-generator-5.8-SNAPSHOT.jar
[JENKINS] Archiving <https://builds.apache.org/job/ActiveMQ/ws/activemq-openwire-generator/target/activemq-openwire-generator-5.8-SNAPSHOT-sources.jar>
to /home/hudson/hudson/jobs/ActiveMQ/modules/org.apache.activemq$activemq-openwire-generator/builds/2012-10-07_12-04-44/archive/org.apache.activemq/activemq-openwire-generator/5.8-SNAPSHOT/activemq-openwire-generator-5.8-SNAPSHOT-sources.jar
[JENKINS] Archiving <https://builds.apache.org/job/ActiveMQ/ws/activemq-web/pom.xml>
to /home/hudson/hudson/jobs/ActiveMQ/modules/org.apache.activemq$activemq-web/builds/2012-10-07_12-04-44/archive/org.apache.activemq/activemq-web/5.8-SNAPSHOT/activemq-web-5.8-SNAPSHOT.pom
[JENKINS] Archiving <https://builds.apache.org/job/ActiveMQ/ws/activemq-console/pom.xml>
to /home/hudson/hudson/jobs/ActiveMQ/modules/org.apache.activemq$activemq-console/builds/2012-10-07_12-04-43/archive/org.apache.activemq/activemq-console/5.8-SNAPSHOT/activemq-console-5.8-SNAPSHOT.pom
[JENKINS] Archiving <https://builds.apache.org/job/ActiveMQ/ws/tests/pom.xml> to /home/hudson/hudson/jobs/ActiveMQ/modules/org.apache.activemq$tests/builds/2012-10-07_12-04-44/archive/org.apache.activemq/tests/5.8-SNAPSHOT/tests-5.8-SNAPSHOT.pom
[JENKINS] Archiving <https://builds.apache.org/job/ActiveMQ/ws/activemq-xmpp/pom.xml>
to /home/hudson/hudson/jobs/ActiveMQ/modules/org.apache.activemq$activemq-xmpp/builds/2012-10-07_12-04-44/archive/org.apache.activemq/activemq-xmpp/5.8-SNAPSHOT/activemq-xmpp-5.8-SNAPSHOT.pom
[JENKINS] Archiving <https://builds.apache.org/job/ActiveMQ/ws/activemq-fileserver/pom.xml>
to /home/hudson/hudson/jobs/ActiveMQ/modules/org.apache.activemq$activemq-fileserver/builds/2012-10-07_12-04-43/archive/org.apache.activemq/activemq-fileserver/5.8-SNAPSHOT/activemq-fileserver-5.8-SNAPSHOT.pom
[JENKINS] Archiving <https://builds.apache.org/job/ActiveMQ/ws/tests/activemq-itest-spring31/pom.xml>
to /home/hudson/hudson/jobs/ActiveMQ/modules/org.apache.activemq$activemq-itest-spring31/builds/2012-10-07_12-04-44/archive/org.apache.activemq/activemq-itest-spring31/5.8-SNAPSHOT/activemq-itest-spring31-5.8-SNAPSHOT.pom
[JENKINS] Archiving <https://builds.apache.org/job/ActiveMQ/ws/activemq-all/pom.xml>
to /home/hudson/hudson/jobs/ActiveMQ/modules/org.apache.activemq$activemq-all/builds/2012-10-07_12-04-43/archive/org.apache.activemq/activemq-all/5.8-SNAPSHOT/activemq-all-5.8-SNAPSHOT.pom
[JENKINS] Archiving <https://builds.apache.org/job/ActiveMQ/ws/activemq-tooling/maven-activemq-perf-plugin/pom.xml>
to /home/hudson/hudson/jobs/ActiveMQ/modules/org.apache.activemq.tooling$maven-activemq-perf-plugin/builds/2012-10-07_12-04-44/archive/org.apache.activemq.tooling/maven-activemq-perf-plugin/5.8-SNAPSHOT/maven-activemq-perf-plugin-5.8-SNAPSHOT.pom
[JENKINS] Archiving <https://builds.apache.org/job/ActiveMQ/ws/activemq-optional/pom.xml>
to /home/hudson/hudson/jobs/ActiveMQ/modules/org.apache.activemq$activemq-optional/builds/2012-10-07_12-04-44/archive/org.apache.activemq/activemq-optional/5.8-SNAPSHOT/activemq-optional-5.8-SNAPSHOT.pom
[JENKINS] Archiving <https://builds.apache.org/job/ActiveMQ/ws/activemq-ra/pom.xml>
to /home/hudson/hudson/jobs/ActiveMQ/modules/org.apache.activemq$activemq-ra/builds/2012-10-07_12-04-44/archive/org.apache.activemq/activemq-ra/5.8-SNAPSHOT/activemq-ra-5.8-SNAPSHOT.pom
[JENKINS] Archiving <https://builds.apache.org/job/ActiveMQ/ws/activemq-rar/pom.xml>
to /home/hudson/hudson/jobs/ActiveMQ/modules/org.apache.activemq$activemq-rar/builds/2012-10-07_12-04-44/archive/org.apache.activemq/activemq-rar/5.8-SNAPSHOT/activemq-rar-5.8-SNAPSHOT.pom
Waiting for Jenkins to finish collecting data
mavenExecutionResult exceptions not empty
message : Failed to execute goal org.apache.maven.plugins:maven-surefire-plugin:2.12.3:test
(default-test) on project activemq-core: Execution default-test of goal org.apache.maven.plugins:maven-surefire-plugin:2.12.3:test
failed.
cause : Execution default-test of goal org.apache.maven.plugins:maven-surefire-plugin:2.12.3:test
failed.
Stack trace : 
org.apache.maven.lifecycle.LifecycleExecutionException: Failed to execute goal org.apache.maven.plugins:maven-surefire-plugin:2.12.3:test
(default-test) on project activemq-core: Execution default-test of goal org.apache.maven.plugins:maven-surefire-plugin:2.12.3:test
failed.
	at org.apache.maven.lifecycle.internal.MojoExecutor.execute(MojoExecutor.java:225)
	at org.apache.maven.lifecycle.internal.MojoExecutor.execute(MojoExecutor.java:153)
	at org.apache.maven.lifecycle.internal.MojoExecutor.execute(MojoExecutor.java:145)
	at org.apache.maven.lifecycle.internal.LifecycleModuleBuilder.buildProject(LifecycleModuleBuilder.java:84)
	at org.apache.maven.lifecycle.internal.LifecycleModuleBuilder.buildProject(LifecycleModuleBuilder.java:59)
	at org.apache.maven.lifecycle.internal.LifecycleStarter.singleThreadedBuild(LifecycleStarter.java:183)
	at org.apache.maven.lifecycle.internal.LifecycleStarter.execute(LifecycleStarter.java:161)
	at org.apache.maven.DefaultMaven.doExecute(DefaultMaven.java:319)
	at org.apache.maven.DefaultMaven.execute(DefaultMaven.java:156)
	at org.jvnet.hudson.maven3.launcher.Maven3Launcher.main(Maven3Launcher.java:79)
	at sun.reflect.NativeMethodAccessorImpl.invoke0(Native Method)
	at sun.reflect.NativeMethodAccessorImpl.invoke(NativeMethodAccessorImpl.java:39)
	at sun.reflect.DelegatingMethodAccessorImpl.invoke(DelegatingMethodAccessorImpl.java:25)
	at java.lang.reflect.Method.invoke(Method.java:597)
	at org.codehaus.plexus.classworlds.launcher.Launcher.launchStandard(Launcher.java:329)
	at org.codehaus.plexus.classworlds.launcher.Launcher.launch(Launcher.java:239)
	at org.jvnet.hudson.maven3.agent.Maven3Main.launch(Maven3Main.java:158)
	at hudson.maven.Maven3Builder.call(Maven3Builder.java:98)
	at hudson.maven.Maven3Builder.call(Maven3Builder.java:64)
	at hudson.remoting.UserRequest.perform(UserRequest.java:118)
	at hudson.remoting.UserRequest.perform(UserRequest.java:48)
	at hudson.remoting.Request$2.run(Request.java:326)
	at hudson.remoting.InterceptingExecutorService$1.call(InterceptingExecutorService.java:72)
	at java.util.concurrent.FutureTask$Sync.innerRun(FutureTask.java:303)
	at java.util.concurrent.FutureTask.run(FutureTask.java:138)
	at java.util.concurrent.ThreadPoolExecutor$Worker.runTask(ThreadPoolExecutor.java:886)
	at java.util.concurrent.ThreadPoolExecutor$Worker.run(ThreadPoolExecutor.java:908)
	at java.lang.Thread.run(Thread.java:662)
Caused by: org.apache.maven.plugin.PluginExecutionException: Execution default-test of goal
org.apache.maven.plugins:maven-surefire-plugin:2.12.3:test failed.
	at org.apache.maven.plugin.DefaultBuildPluginManager.executeMojo(DefaultBuildPluginManager.java:110)
	at org.apache.maven.lifecycle.internal.MojoExecutor.execute(MojoExecutor.java:209)
	... 27 more
Caused by: java.util.concurrent.RejectedExecutionException
	at java.util.concurrent.ThreadPoolExecutor$AbortPolicy.rejectedExecution(ThreadPoolExecutor.java:1768)
	at java.util.concurrent.ThreadPoolExecutor.reject(ThreadPoolExecutor.java:767)
	at java.util.concurrent.ThreadPoolExecutor.execute(ThreadPoolExecutor.java:658)
	at java.util.concurrent.AbstractExecutorService.submit(AbstractExecutorService.java:92)
	at org.apache.maven.plugin.surefire.booterclient.ForkStarter.runSuitesForkPerTestSet(ForkStarter.java:168)
	at org.apache.maven.plugin.surefire.booterclient.ForkStarter.run(ForkStarter.java:121)
	at org.apache.maven.plugin.surefire.AbstractSurefireMojo.executeProvider(AbstractSurefireMojo.java:740)
	at org.apache.maven.plugin.surefire.AbstractSurefireMojo.executeAllProviders(AbstractSurefireMojo.java:682)
	at org.apache.maven.plugin.surefire.AbstractSurefireMojo.executeAfterPreconditionsChecked(AbstractSurefireMojo.java:648)
	at org.apache.maven.plugin.surefire.AbstractSurefireMojo.execute(AbstractSurefireMojo.java:586)
	at org.apache.maven.plugin.DefaultBuildPluginManager.executeMojo(DefaultBuildPluginManager.java:101)
	... 28 more
Sending e-mails to: dev@activemq.apache.org
channel stopped
[locks-and-latches] Releasing all the locks
[locks-and-latches] All the locks released

Mime
View raw message