activemq-dev mailing list archives

Site index · List index
Message view « Date » · « Thread »
Top « Date » · « Thread »
From Apache Jenkins Server <jenk...@builds.apache.org>
Subject Build failed in Jenkins: ActiveMQ-Java7 #19
Date Sat, 29 Sep 2012 01:45:47 GMT
See <https://builds.apache.org/job/ActiveMQ-Java7/19/changes>

Changes:

[tabish] Polish the code, remove warnings fix spelling errors in the docs, add some new javadocs,
etc.

[gtully] https://issues.apache.org/jira/browse/AMQ-2106 - Allow broker to evenly distribute
message groups among consumers - have consumer order take number of assigned groups into account,
such that priority is given to the least loaded consumers. When groups change frequently or
are suspended this allows better distribution. When new consumer arrive they now have a good
chance of getting the next available groups

------------------------------------------
[...truncated 6022 lines...]
projectSkipped org.apache.activemq:activemq-leveldb:5.7-SNAPSHOT
[INFO]                                                                         
[INFO] ------------------------------------------------------------------------
[INFO] Skipping ActiveMQ :: LevelDB
[INFO] This project has been banned from the build due to previous failures.
[INFO] ------------------------------------------------------------------------
projectSkipped org.apache.activemq:activemq-rar:5.7-SNAPSHOT
[INFO]                                                                         
[INFO] ------------------------------------------------------------------------
[INFO] Skipping ActiveMQ :: RAR
[INFO] This project has been banned from the build due to previous failures.
[INFO] ------------------------------------------------------------------------
projectSkipped org.apache.activemq:activemq-run:5.7-SNAPSHOT
[INFO]                                                                         
[INFO] ------------------------------------------------------------------------
[INFO] Skipping ActiveMQ :: Run Jar
[INFO] This project has been banned from the build due to previous failures.
[INFO] ------------------------------------------------------------------------
projectStarted org.apache.activemq.tooling:activemq-tooling:5.7-SNAPSHOT
[INFO] Downloading: http://repo1.maven.org/maven2/org/eclipse/jetty/maven-jetty-plugin/7.6.7.v20120910/maven-jetty-plugin-7.6.7.v20120910.pom
[WARNING] The POM for org.eclipse.jetty:maven-jetty-plugin:jar:7.6.7.v20120910 is missing,
no dependency information available
[WARNING] Failed to retrieve plugin descriptor for org.eclipse.jetty:maven-jetty-plugin:7.6.7.v20120910:
Plugin org.eclipse.jetty:maven-jetty-plugin:7.6.7.v20120910 or one of its dependencies could
not be resolved: Failed to read artifact descriptor for org.eclipse.jetty:maven-jetty-plugin:jar:7.6.7.v20120910
                                                                        
[INFO] ------------------------------------------------------------------------
[INFO] Building ActiveMQ :: Tooling 5.7-SNAPSHOT
[INFO] ------------------------------------------------------------------------
mojoStarted org.apache.maven.plugins:maven-clean-plugin:2.5(default-clean)
[INFO] 
[INFO] --- maven-clean-plugin:2.5:clean (default-clean) @ activemq-tooling ---
mojoSucceeded org.apache.maven.plugins:maven-clean-plugin:2.5(default-clean)
mojoStarted org.apache.maven.plugins:maven-enforcer-plugin:1.0.1(default)
[INFO] 
[INFO] --- maven-enforcer-plugin:1.0.1:enforce (default) @ activemq-tooling ---
mojoSucceeded org.apache.maven.plugins:maven-enforcer-plugin:1.0.1(default)
mojoStarted org.apache.felix:maven-bundle-plugin:2.3.7(cleanVersions)
[INFO] 
[INFO] --- maven-bundle-plugin:2.3.7:cleanVersions (cleanVersions) @ activemq-tooling ---
mojoSucceeded org.apache.felix:maven-bundle-plugin:2.3.7(cleanVersions)
mojoStarted org.apache.maven.plugins:maven-remote-resources-plugin:1.3(default)
[INFO] 
[INFO] --- maven-remote-resources-plugin:1.3:process (default) @ activemq-tooling ---
mojoSucceeded org.apache.maven.plugins:maven-remote-resources-plugin:1.3(default)
mojoStarted org.apache.maven.plugins:maven-site-plugin:3.1(attach-descriptor)
[INFO] 
[INFO] --- maven-site-plugin:3.1:attach-descriptor (attach-descriptor) @ activemq-tooling
---
mojoSucceeded org.apache.maven.plugins:maven-site-plugin:3.1(attach-descriptor)
mojoStarted org.codehaus.mojo:ianal-maven-plugin:1.0-alpha-1(default)
[INFO] 
[INFO] --- ianal-maven-plugin:1.0-alpha-1:verify-legal-files (default) @ activemq-tooling
---
mojoSucceeded org.codehaus.mojo:ianal-maven-plugin:1.0-alpha-1(default)
mojoStarted org.apache.maven.plugins:maven-install-plugin:2.3.1(default-install)[INFO] Installing
<https://builds.apache.org/job/ActiveMQ-Java7/ws/activemq-tooling/pom.xml> to /home/hudson/hudson-slave/maven-repositories/0/org/apache/activemq/tooling/activemq-tooling/5.7-SNAPSHOT/activemq-tooling-5.7-SNAPSHOT.pom

[INFO] 
[INFO] --- maven-install-plugin:2.3.1:install (default-install) @ activemq-tooling ---
mojoSucceeded org.apache.maven.plugins:maven-install-plugin:2.3.1(default-install)
forkedProjectStarted org.apache.activemq.tooling:activemq-tooling:5.7-SNAPSHOT
mojoStarted org.apache.maven.plugins:maven-enforcer-plugin:1.0.1(default)
[INFO] 
[INFO] --- maven-enforcer-plugin:1.0.1:enforce (default) @ activemq-tooling ---
mojoSucceeded org.apache.maven.plugins:maven-enforcer-plugin:1.0.1(default)
mojoStarted org.apache.felix:maven-bundle-plugin:2.3.7(cleanVersions)
[INFO] 
[INFO] --- maven-bundle-plugin:2.3.7:cleanVersions (cleanVersions) @ activemq-tooling ---
mojoSucceeded org.apache.felix:maven-bundle-plugin:2.3.7(cleanVersions)
Sep 29, 2012 1:45:27 AM hudson.maven.ExecutedMojo <init>
forkedProjectSucceeded org.apache.activemq.tooling:activemq-tooling:5.7-SNAPSHOTWARNING: Failed
to getClass for org.apache.maven.plugin.source.SourceJarMojo

mojoStarted org.apache.maven.plugins:maven-source-plugin:2.1.2(default-cli)
[INFO] 
[INFO] --- maven-source-plugin:2.1.2:jar (default-cli) @ activemq-tooling ---
mojoSucceeded org.apache.maven.plugins:maven-source-plugin:2.1.2(default-cli)
projectSucceeded org.apache.activemq.tooling:activemq-tooling:5.7-SNAPSHOT
projectSkipped org.apache.activemq.tooling:maven-activemq-memtest-plugin:5.7-SNAPSHOT
[INFO]                                                                         
[INFO] ------------------------------------------------------------------------
[INFO] Skipping ActiveMQ :: Memory Usage Test Plugin
[INFO] This project has been banned from the build due to previous failures.
[INFO] ------------------------------------------------------------------------
projectSkipped org.apache.activemq.tooling:maven-activemq-perf-plugin:5.7-SNAPSHOT
[INFO]                                                                         
[INFO] ------------------------------------------------------------------------
[INFO] Skipping ActiveMQ :: Performance Test Plugin
[INFO] This project has been banned from the build due to previous failures.
[INFO] ------------------------------------------------------------------------
projectSkipped org.apache.activemq.tooling:maven-activemq-plugin:5.7-SNAPSHOT
[INFO]                                                                         
[INFO] ------------------------------------------------------------------------
[INFO] Skipping ActiveMQ :: StartUp Plugin
[INFO] This project has been banned from the build due to previous failures.
[INFO] ------------------------------------------------------------------------
projectSkipped org.apache.activemq:activemq-web:5.7-SNAPSHOT
[INFO]                                                                         
[INFO] ------------------------------------------------------------------------
[INFO] Skipping ActiveMQ :: Web
[INFO] This project has been banned from the build due to previous failures.
[INFO] ------------------------------------------------------------------------
projectSkipped org.apache.activemq:activemq-web-demo:5.7-SNAPSHOT
[INFO]                                                                         
[INFO] ------------------------------------------------------------------------
[INFO] Skipping ActiveMQ :: Web Demo
[INFO] This project has been banned from the build due to previous failures.
[INFO] ------------------------------------------------------------------------
projectSkipped org.apache.activemq:activemq-xmpp:5.7-SNAPSHOT
[INFO]                                                                         
[INFO] ------------------------------------------------------------------------
[INFO] Skipping ActiveMQ :: XMPP
[INFO] This project has been banned from the build due to previous failures.
[INFO] ------------------------------------------------------------------------
projectSkipped org.apache.activemq:activemq-web-console:5.7-SNAPSHOT
[INFO]                                                                         
[INFO] ------------------------------------------------------------------------
[INFO] Skipping ActiveMQ :: Web Console
[INFO] This project has been banned from the build due to previous failures.
[INFO] ------------------------------------------------------------------------
projectSkipped org.apache.activemq:apache-activemq:5.7-SNAPSHOT
[INFO]                                                                         
[INFO] ------------------------------------------------------------------------
[INFO] Skipping ActiveMQ :: Assembly
[INFO] This project has been banned from the build due to previous failures.
[INFO] ------------------------------------------------------------------------
sessionEnded
[INFO] ------------------------------------------------------------------------
[INFO] Reactor Summary:
[INFO] 
[INFO] ActiveMQ .......................................... SUCCESS [25.330s]
[INFO] ActiveMQ :: KahaDB ................................ SUCCESS [7:33.582s]
[INFO] ActiveMQ :: JAAS .................................. SUCCESS [16.609s]
[INFO] ActiveMQ :: Openwire Generator .................... SUCCESS [3.080s]
[INFO] ActiveMQ :: Core .................................. FAILURE [1:00:52.460s]
[INFO] ActiveMQ :: RA .................................... SKIPPED
[INFO] ActiveMQ :: Pool .................................. SKIPPED
[INFO] ActiveMQ :: Spring ................................ SKIPPED
[INFO] ActiveMQ :: Camel ................................. SKIPPED
[INFO] ActiveMQ :: Console ............................... SKIPPED
[INFO] ActiveMQ :: Optional .............................. SKIPPED
[INFO] ActiveMQ :: All JAR bundle ........................ SKIPPED
[INFO] ActiveMQ :: File Server ........................... SKIPPED
[INFO] ActiveMQ :: Blueprint ............................. SUCCESS [5.508s]
[INFO] ActiveMQ :: Apache Karaf .......................... SKIPPED
[INFO] ActiveMQ :: LevelDB ............................... SKIPPED
[INFO] ActiveMQ :: RAR ................................... SKIPPED
[INFO] ActiveMQ :: Run Jar ............................... SKIPPED
[INFO] ActiveMQ :: Tooling ............................... SUCCESS [1.892s]
[INFO] ActiveMQ :: Memory Usage Test Plugin .............. SKIPPED
[INFO] ActiveMQ :: Performance Test Plugin ............... SKIPPED
[INFO] ActiveMQ :: StartUp Plugin ........................ SKIPPED
[INFO] ActiveMQ :: Web ................................... SKIPPED
[INFO] ActiveMQ :: Web Demo .............................. SKIPPED
[INFO] ActiveMQ :: XMPP .................................. SKIPPED
[INFO] ActiveMQ :: Web Console ........................... SKIPPED
[INFO] ActiveMQ :: Assembly .............................. SKIPPED
[INFO] ------------------------------------------------------------------------
[INFO] BUILD FAILURE
[INFO] ------------------------------------------------------------------------
[INFO] Total time: 1:09:23.534s
[INFO] Finished at: Sat Sep 29 01:45:27 UTC 2012
[INFO] Final Memory: 78M/1234M
[INFO] ------------------------------------------------------------------------
Projects to build: [MavenProject: org.apache.activemq:activemq-parent:5.7-SNAPSHOT @ <https://builds.apache.org/job/ActiveMQ-Java7/ws/pom.xml,>
MavenProject: org.apache.activemq:kahadb:5.7-SNAPSHOT @ <https://builds.apache.org/job/ActiveMQ-Java7/ws/kahadb/pom.xml,>
MavenProject: org.apache.activemq:activemq-jaas:5.7-SNAPSHOT @ <https://builds.apache.org/job/ActiveMQ-Java7/ws/activemq-jaas/pom.xml,>
MavenProject: org.apache.activemq:activemq-openwire-generator:5.7-SNAPSHOT @ <https://builds.apache.org/job/ActiveMQ-Java7/ws/activemq-openwire-generator/pom.xml,>
MavenProject: org.apache.activemq:activemq-core:5.7-SNAPSHOT @ <https://builds.apache.org/job/ActiveMQ-Java7/ws/activemq-core/pom.xml,>
MavenProject: org.apache.activemq:activemq-ra:5.7-SNAPSHOT @ <https://builds.apache.org/job/ActiveMQ-Java7/ws/activemq-ra/pom.xml,>
MavenProject: org.apache.activemq:activemq-pool:5.7-SNAPSHOT @ <https://builds.apache.org/job/ActiveMQ-Java7/ws/activemq-pool/pom.xml,>
MavenProject: org.apache.activemq:activemq-spring:5.7-SNAPSHOT @ <https://builds.apache.org/job/ActiveMQ-Java7/ws/activemq-spring/pom.xml,>
MavenProject: org.apache.activemq:activemq-camel:5.7-SNAPSHOT @ <https://builds.apache.org/job/ActiveMQ-Java7/ws/activemq-camel/pom.xml,>
MavenProject: org.apache.activemq:activemq-console:5.7-SNAPSHOT @ <https://builds.apache.org/job/ActiveMQ-Java7/ws/activemq-console/pom.xml,>
MavenProject: org.apache.activemq:activemq-optional:5.7-SNAPSHOT @ <https://builds.apache.org/job/ActiveMQ-Java7/ws/activemq-optional/pom.xml,>
MavenProject: org.apache.activemq:activemq-all:5.7-SNAPSHOT @ <https://builds.apache.org/job/ActiveMQ-Java7/ws/activemq-all/pom.xml,>
MavenProject: org.apache.activemq:activemq-fileserver:5.7-SNAPSHOT @ <https://builds.apache.org/job/ActiveMQ-Java7/ws/activemq-fileserver/pom.xml,>
MavenProject: org.apache.activemq:activemq-blueprint:5.7-SNAPSHOT @ <https://builds.apache.org/job/ActiveMQ-Java7/ws/activemq-blueprint/pom.xml,>
MavenProject: org.apache.activemq:activemq-karaf:5.7-SNAPSHOT @ <https://builds.apache.org/job/ActiveMQ-Java7/ws/activemq-karaf/pom.xml,>
MavenProject: org.apache.activemq:activemq-leveldb:5.7-SNAPSHOT @ <https://builds.apache.org/job/ActiveMQ-Java7/ws/activemq-leveldb/pom.xml,>
MavenProject: org.apache.activemq:activemq-rar:5.7-SNAPSHOT @ <https://builds.apache.org/job/ActiveMQ-Java7/ws/activemq-rar/pom.xml,>
MavenProject: org.apache.activemq:activemq-run:5.7-SNAPSHOT @ <https://builds.apache.org/job/ActiveMQ-Java7/ws/activemq-run/pom.xml,>
MavenProject: org.apache.activemq.tooling:activemq-tooling:5.7-SNAPSHOT @ <https://builds.apache.org/job/ActiveMQ-Java7/ws/activemq-tooling/pom.xml,>
MavenProject: org.apache.activemq.tooling:maven-activemq-memtest-plugin:5.7-SNAPSHOT @ <https://builds.apache.org/job/ActiveMQ-Java7/ws/activemq-tooling/maven-activemq-memtest-plugin/pom.xml,>
MavenProject: org.apache.activemq.tooling:maven-activemq-perf-plugin:5.7-SNAPSHOT @ <https://builds.apache.org/job/ActiveMQ-Java7/ws/activemq-tooling/maven-activemq-perf-plugin/pom.xml,>
MavenProject: org.apache.activemq.tooling:maven-activemq-plugin:5.7-SNAPSHOT @ <https://builds.apache.org/job/ActiveMQ-Java7/ws/activemq-tooling/maven-activemq-plugin/pom.xml,>
MavenProject: org.apache.activemq:activemq-web:5.7-SNAPSHOT @ <https://builds.apache.org/job/ActiveMQ-Java7/ws/activemq-web/pom.xml,>
MavenProject: org.apache.activemq:activemq-web-demo:5.7-SNAPSHOT @ <https://builds.apache.org/job/ActiveMQ-Java7/ws/activemq-web-demo/pom.xml,>
MavenProject: org.apache.activemq:activemq-xmpp:5.7-SNAPSHOT @ <https://builds.apache.org/job/ActiveMQ-Java7/ws/activemq-xmpp/pom.xml,>
MavenProject: org.apache.activemq:activemq-web-console:5.7-SNAPSHOT @ <https://builds.apache.org/job/ActiveMQ-Java7/ws/activemq-web-console/pom.xml,>
MavenProject: org.apache.activemq:apache-activemq:5.7-SNAPSHOT @ <https://builds.apache.org/job/ActiveMQ-Java7/ws/assembly/pom.xml]>
[JENKINS] Archiving <https://builds.apache.org/job/ActiveMQ-Java7/ws/pom.xml> to /home/hudson/hudson/jobs/ActiveMQ-Java7/modules/org.apache.activemq$activemq-parent/builds/2012-09-29_00-35-41/archive/org.apache.activemq/activemq-parent/5.7-SNAPSHOT/activemq-parent-5.7-SNAPSHOT.pom
[JENKINS] Archiving <https://builds.apache.org/job/ActiveMQ-Java7/ws/assembly/pom.xml>
to /home/hudson/hudson/jobs/ActiveMQ-Java7/modules/org.apache.activemq$apache-activemq/builds/2012-09-29_00-35-43/archive/org.apache.activemq/apache-activemq/5.7-SNAPSHOT/apache-activemq-5.7-SNAPSHOT.pom
[JENKINS] Archiving <https://builds.apache.org/job/ActiveMQ-Java7/ws/activemq-camel/pom.xml>
to /home/hudson/hudson/jobs/ActiveMQ-Java7/modules/org.apache.activemq$activemq-camel/builds/2012-09-29_00-35-41/archive/org.apache.activemq/activemq-camel/5.7-SNAPSHOT/activemq-camel-5.7-SNAPSHOT.pom
[JENKINS] Archiving <https://builds.apache.org/job/ActiveMQ-Java7/ws/activemq-tooling/pom.xml>
to /home/hudson/hudson/jobs/ActiveMQ-Java7/modules/org.apache.activemq.tooling$activemq-tooling/builds/2012-09-29_00-35-42/archive/org.apache.activemq.tooling/activemq-tooling/5.7-SNAPSHOT/activemq-tooling-5.7-SNAPSHOT.pom
[JENKINS] Archiving <https://builds.apache.org/job/ActiveMQ-Java7/ws/activemq-pool/pom.xml>
to /home/hudson/hudson/jobs/ActiveMQ-Java7/modules/org.apache.activemq$activemq-pool/builds/2012-09-29_00-35-42/archive/org.apache.activemq/activemq-pool/5.7-SNAPSHOT/activemq-pool-5.7-SNAPSHOT.pom
[JENKINS] Archiving <https://builds.apache.org/job/ActiveMQ-Java7/ws/activemq-tooling/maven-activemq-memtest-plugin/pom.xml>
to /home/hudson/hudson/jobs/ActiveMQ-Java7/modules/org.apache.activemq.tooling$maven-activemq-memtest-plugin/builds/2012-09-29_00-35-42/archive/org.apache.activemq.tooling/maven-activemq-memtest-plugin/5.7-SNAPSHOT/maven-activemq-memtest-plugin-5.7-SNAPSHOT.pom
[JENKINS] Archiving <https://builds.apache.org/job/ActiveMQ-Java7/ws/activemq-core/pom.xml>
to /home/hudson/hudson/jobs/ActiveMQ-Java7/modules/org.apache.activemq$activemq-core/builds/2012-09-29_00-35-41/archive/org.apache.activemq/activemq-core/5.7-SNAPSHOT/activemq-core-5.7-SNAPSHOT.pom
[JENKINS] Archiving <https://builds.apache.org/job/ActiveMQ-Java7/ws/activemq-blueprint/pom.xml>
to /home/hudson/hudson/jobs/ActiveMQ-Java7/modules/org.apache.activemq$activemq-blueprint/builds/2012-09-29_00-35-41/archive/org.apache.activemq/activemq-blueprint/5.7-SNAPSHOT/activemq-blueprint-5.7-SNAPSHOT.pom
[JENKINS] Archiving <https://builds.apache.org/job/ActiveMQ-Java7/ws/activemq-blueprint/target/activemq-blueprint-5.7-SNAPSHOT.jar>
to /home/hudson/hudson/jobs/ActiveMQ-Java7/modules/org.apache.activemq$activemq-blueprint/builds/2012-09-29_00-35-41/archive/org.apache.activemq/activemq-blueprint/5.7-SNAPSHOT/activemq-blueprint-5.7-SNAPSHOT.jar
[JENKINS] Archiving <https://builds.apache.org/job/ActiveMQ-Java7/ws/activemq-blueprint/target/activemq-blueprint-5.7-SNAPSHOT-sources.jar>
to /home/hudson/hudson/jobs/ActiveMQ-Java7/modules/org.apache.activemq$activemq-blueprint/builds/2012-09-29_00-35-41/archive/org.apache.activemq/activemq-blueprint/5.7-SNAPSHOT/activemq-blueprint-5.7-SNAPSHOT-sources.jar
[JENKINS] Archiving <https://builds.apache.org/job/ActiveMQ-Java7/ws/activemq-spring/pom.xml>
to /home/hudson/hudson/jobs/ActiveMQ-Java7/modules/org.apache.activemq$activemq-spring/builds/2012-09-29_00-35-42/archive/org.apache.activemq/activemq-spring/5.7-SNAPSHOT/activemq-spring-5.7-SNAPSHOT.pom
[JENKINS] Archiving <https://builds.apache.org/job/ActiveMQ-Java7/ws/activemq-tooling/maven-activemq-plugin/pom.xml>
to /home/hudson/hudson/jobs/ActiveMQ-Java7/modules/org.apache.activemq.tooling$maven-activemq-plugin/builds/2012-09-29_00-35-42/archive/org.apache.activemq.tooling/maven-activemq-plugin/5.7-SNAPSHOT/maven-activemq-plugin-5.7-SNAPSHOT.pom
[JENKINS] Archiving <https://builds.apache.org/job/ActiveMQ-Java7/ws/activemq-karaf/pom.xml>
to /home/hudson/hudson/jobs/ActiveMQ-Java7/modules/org.apache.activemq$activemq-karaf/builds/2012-09-29_00-35-42/archive/org.apache.activemq/activemq-karaf/5.7-SNAPSHOT/activemq-karaf-5.7-SNAPSHOT.pom
[JENKINS] Archiving <https://builds.apache.org/job/ActiveMQ-Java7/ws/activemq-leveldb/pom.xml>
to /home/hudson/hudson/jobs/ActiveMQ-Java7/modules/org.apache.activemq$activemq-leveldb/builds/2012-09-29_00-35-42/archive/org.apache.activemq/activemq-leveldb/5.7-SNAPSHOT/activemq-leveldb-5.7-SNAPSHOT.pom
[JENKINS] Archiving <https://builds.apache.org/job/ActiveMQ-Java7/ws/activemq-web-demo/pom.xml>
to /home/hudson/hudson/jobs/ActiveMQ-Java7/modules/org.apache.activemq$activemq-web-demo/builds/2012-09-29_00-35-42/archive/org.apache.activemq/activemq-web-demo/5.7-SNAPSHOT/activemq-web-demo-5.7-SNAPSHOT.pom
[JENKINS] Archiving <https://builds.apache.org/job/ActiveMQ-Java7/ws/activemq-web-console/pom.xml>
to /home/hudson/hudson/jobs/ActiveMQ-Java7/modules/org.apache.activemq$activemq-web-console/builds/2012-09-29_00-35-42/archive/org.apache.activemq/activemq-web-console/5.7-SNAPSHOT/activemq-web-console-5.7-SNAPSHOT.pom
[JENKINS] Archiving <https://builds.apache.org/job/ActiveMQ-Java7/ws/kahadb/pom.xml>
to /home/hudson/hudson/jobs/ActiveMQ-Java7/modules/org.apache.activemq$kahadb/builds/2012-09-29_00-35-43/archive/org.apache.activemq/kahadb/5.7-SNAPSHOT/kahadb-5.7-SNAPSHOT.pom
[JENKINS] Archiving <https://builds.apache.org/job/ActiveMQ-Java7/ws/kahadb/target/kahadb-5.7-SNAPSHOT.jar>
to /home/hudson/hudson/jobs/ActiveMQ-Java7/modules/org.apache.activemq$kahadb/builds/2012-09-29_00-35-43/archive/org.apache.activemq/kahadb/5.7-SNAPSHOT/kahadb-5.7-SNAPSHOT.jar
[JENKINS] Archiving <https://builds.apache.org/job/ActiveMQ-Java7/ws/kahadb/target/kahadb-5.7-SNAPSHOT-sources.jar>
to /home/hudson/hudson/jobs/ActiveMQ-Java7/modules/org.apache.activemq$kahadb/builds/2012-09-29_00-35-43/archive/org.apache.activemq/kahadb/5.7-SNAPSHOT/kahadb-5.7-SNAPSHOT-sources.jar
[JENKINS] Archiving <https://builds.apache.org/job/ActiveMQ-Java7/ws/activemq-jaas/pom.xml>
to /home/hudson/hudson/jobs/ActiveMQ-Java7/modules/org.apache.activemq$activemq-jaas/builds/2012-09-29_00-35-41/archive/org.apache.activemq/activemq-jaas/5.7-SNAPSHOT/activemq-jaas-5.7-SNAPSHOT.pom
[JENKINS] Archiving <https://builds.apache.org/job/ActiveMQ-Java7/ws/activemq-jaas/target/activemq-jaas-5.7-SNAPSHOT.jar>
to /home/hudson/hudson/jobs/ActiveMQ-Java7/modules/org.apache.activemq$activemq-jaas/builds/2012-09-29_00-35-41/archive/org.apache.activemq/activemq-jaas/5.7-SNAPSHOT/activemq-jaas-5.7-SNAPSHOT.jar
[JENKINS] Archiving <https://builds.apache.org/job/ActiveMQ-Java7/ws/activemq-jaas/target/activemq-jaas-5.7-SNAPSHOT-sources.jar>
to /home/hudson/hudson/jobs/ActiveMQ-Java7/modules/org.apache.activemq$activemq-jaas/builds/2012-09-29_00-35-41/archive/org.apache.activemq/activemq-jaas/5.7-SNAPSHOT/activemq-jaas-5.7-SNAPSHOT-sources.jar
[JENKINS] Archiving <https://builds.apache.org/job/ActiveMQ-Java7/ws/activemq-run/pom.xml>
to /home/hudson/hudson/jobs/ActiveMQ-Java7/modules/org.apache.activemq$activemq-run/builds/2012-09-29_00-35-42/archive/org.apache.activemq/activemq-run/5.7-SNAPSHOT/activemq-run-5.7-SNAPSHOT.pom
[JENKINS] Archiving <https://builds.apache.org/job/ActiveMQ-Java7/ws/activemq-openwire-generator/pom.xml>
to /home/hudson/hudson/jobs/ActiveMQ-Java7/modules/org.apache.activemq$activemq-openwire-generator/builds/2012-09-29_00-35-42/archive/org.apache.activemq/activemq-openwire-generator/5.7-SNAPSHOT/activemq-openwire-generator-5.7-SNAPSHOT.pom
[JENKINS] Archiving <https://builds.apache.org/job/ActiveMQ-Java7/ws/activemq-openwire-generator/target/activemq-openwire-generator-5.7-SNAPSHOT.jar>
to /home/hudson/hudson/jobs/ActiveMQ-Java7/modules/org.apache.activemq$activemq-openwire-generator/builds/2012-09-29_00-35-42/archive/org.apache.activemq/activemq-openwire-generator/5.7-SNAPSHOT/activemq-openwire-generator-5.7-SNAPSHOT.jar
[JENKINS] Archiving <https://builds.apache.org/job/ActiveMQ-Java7/ws/activemq-openwire-generator/target/activemq-openwire-generator-5.7-SNAPSHOT-sources.jar>
to /home/hudson/hudson/jobs/ActiveMQ-Java7/modules/org.apache.activemq$activemq-openwire-generator/builds/2012-09-29_00-35-42/archive/org.apache.activemq/activemq-openwire-generator/5.7-SNAPSHOT/activemq-openwire-generator-5.7-SNAPSHOT-sources.jar
[JENKINS] Archiving <https://builds.apache.org/job/ActiveMQ-Java7/ws/activemq-web/pom.xml>
to /home/hudson/hudson/jobs/ActiveMQ-Java7/modules/org.apache.activemq$activemq-web/builds/2012-09-29_00-35-42/archive/org.apache.activemq/activemq-web/5.7-SNAPSHOT/activemq-web-5.7-SNAPSHOT.pom
[JENKINS] Archiving <https://builds.apache.org/job/ActiveMQ-Java7/ws/activemq-console/pom.xml>
to /home/hudson/hudson/jobs/ActiveMQ-Java7/modules/org.apache.activemq$activemq-console/builds/2012-09-29_00-35-41/archive/org.apache.activemq/activemq-console/5.7-SNAPSHOT/activemq-console-5.7-SNAPSHOT.pom
[JENKINS] Archiving <https://builds.apache.org/job/ActiveMQ-Java7/ws/activemq-xmpp/pom.xml>
to /home/hudson/hudson/jobs/ActiveMQ-Java7/modules/org.apache.activemq$activemq-xmpp/builds/2012-09-29_00-35-42/archive/org.apache.activemq/activemq-xmpp/5.7-SNAPSHOT/activemq-xmpp-5.7-SNAPSHOT.pom
[JENKINS] Archiving <https://builds.apache.org/job/ActiveMQ-Java7/ws/activemq-fileserver/pom.xml>
to /home/hudson/hudson/jobs/ActiveMQ-Java7/modules/org.apache.activemq$activemq-fileserver/builds/2012-09-29_00-35-41/archive/org.apache.activemq/activemq-fileserver/5.7-SNAPSHOT/activemq-fileserver-5.7-SNAPSHOT.pom
[JENKINS] Archiving <https://builds.apache.org/job/ActiveMQ-Java7/ws/activemq-all/pom.xml>
to /home/hudson/hudson/jobs/ActiveMQ-Java7/modules/org.apache.activemq$activemq-all/builds/2012-09-29_00-35-41/archive/org.apache.activemq/activemq-all/5.7-SNAPSHOT/activemq-all-5.7-SNAPSHOT.pom
[JENKINS] Archiving <https://builds.apache.org/job/ActiveMQ-Java7/ws/activemq-tooling/maven-activemq-perf-plugin/pom.xml>
to /home/hudson/hudson/jobs/ActiveMQ-Java7/modules/org.apache.activemq.tooling$maven-activemq-perf-plugin/builds/2012-09-29_00-35-42/archive/org.apache.activemq.tooling/maven-activemq-perf-plugin/5.7-SNAPSHOT/maven-activemq-perf-plugin-5.7-SNAPSHOT.pom
[JENKINS] Archiving <https://builds.apache.org/job/ActiveMQ-Java7/ws/activemq-optional/pom.xml>
to /home/hudson/hudson/jobs/ActiveMQ-Java7/modules/org.apache.activemq$activemq-optional/builds/2012-09-29_00-35-42/archive/org.apache.activemq/activemq-optional/5.7-SNAPSHOT/activemq-optional-5.7-SNAPSHOT.pom
[JENKINS] Archiving <https://builds.apache.org/job/ActiveMQ-Java7/ws/activemq-ra/pom.xml>
to /home/hudson/hudson/jobs/ActiveMQ-Java7/modules/org.apache.activemq$activemq-ra/builds/2012-09-29_00-35-42/archive/org.apache.activemq/activemq-ra/5.7-SNAPSHOT/activemq-ra-5.7-SNAPSHOT.pom
[JENKINS] Archiving <https://builds.apache.org/job/ActiveMQ-Java7/ws/activemq-rar/pom.xml>
to /home/hudson/hudson/jobs/ActiveMQ-Java7/modules/org.apache.activemq$activemq-rar/builds/2012-09-29_00-35-42/archive/org.apache.activemq/activemq-rar/5.7-SNAPSHOT/activemq-rar-5.7-SNAPSHOT.pom
Waiting for Jenkins to finish collecting data
mavenExecutionResult exceptions not empty
message : Failed to execute goal org.apache.maven.plugins:maven-surefire-plugin:2.12.3:test
(default-test) on project activemq-core: Execution default-test of goal org.apache.maven.plugins:maven-surefire-plugin:2.12.3:test
failed: Task java.util.concurrent.FutureTask@2ab506 rejected from java.util.concurrent.ThreadPoolExecutor@1d2b28a[Running,
pool size = 1, active threads = 1, queued tasks = 500, completed tasks = 0]
cause : Execution default-test of goal org.apache.maven.plugins:maven-surefire-plugin:2.12.3:test
failed: Task java.util.concurrent.FutureTask@2ab506 rejected from java.util.concurrent.ThreadPoolExecutor@1d2b28a[Running,
pool size = 1, active threads = 1, queued tasks = 500, completed tasks = 0]
Stack trace : 
org.apache.maven.lifecycle.LifecycleExecutionException: Failed to execute goal org.apache.maven.plugins:maven-surefire-plugin:2.12.3:test
(default-test) on project activemq-core: Execution default-test of goal org.apache.maven.plugins:maven-surefire-plugin:2.12.3:test
failed: Task java.util.concurrent.FutureTask@2ab506 rejected from java.util.concurrent.ThreadPoolExecutor@1d2b28a[Running,
pool size = 1, active threads = 1, queued tasks = 500, completed tasks = 0]
	at org.apache.maven.lifecycle.internal.MojoExecutor.execute(MojoExecutor.java:225)
	at org.apache.maven.lifecycle.internal.MojoExecutor.execute(MojoExecutor.java:153)
	at org.apache.maven.lifecycle.internal.MojoExecutor.execute(MojoExecutor.java:145)
	at org.apache.maven.lifecycle.internal.LifecycleModuleBuilder.buildProject(LifecycleModuleBuilder.java:84)
	at org.apache.maven.lifecycle.internal.LifecycleModuleBuilder.buildProject(LifecycleModuleBuilder.java:59)
	at org.apache.maven.lifecycle.internal.LifecycleStarter.singleThreadedBuild(LifecycleStarter.java:183)
	at org.apache.maven.lifecycle.internal.LifecycleStarter.execute(LifecycleStarter.java:161)
	at org.apache.maven.DefaultMaven.doExecute(DefaultMaven.java:319)
	at org.apache.maven.DefaultMaven.execute(DefaultMaven.java:156)
	at org.jvnet.hudson.maven3.launcher.Maven3Launcher.main(Maven3Launcher.java:79)
	at sun.reflect.NativeMethodAccessorImpl.invoke0(Native Method)
	at sun.reflect.NativeMethodAccessorImpl.invoke(NativeMethodAccessorImpl.java:57)
	at sun.reflect.DelegatingMethodAccessorImpl.invoke(DelegatingMethodAccessorImpl.java:43)
	at java.lang.reflect.Method.invoke(Method.java:601)
	at org.codehaus.plexus.classworlds.launcher.Launcher.launchStandard(Launcher.java:329)
	at org.codehaus.plexus.classworlds.launcher.Launcher.launch(Launcher.java:239)
	at org.jvnet.hudson.maven3.agent.Maven3Main.launch(Maven3Main.java:158)
	at hudson.maven.Maven3Builder.call(Maven3Builder.java:98)
	at hudson.maven.Maven3Builder.call(Maven3Builder.java:64)
	at hudson.remoting.UserRequest.perform(UserRequest.java:118)
	at hudson.remoting.UserRequest.perform(UserRequest.java:48)
	at hudson.remoting.Request$2.run(Request.java:326)
	at hudson.remoting.InterceptingExecutorService$1.call(InterceptingExecutorService.java:72)
	at java.util.concurrent.FutureTask$Sync.innerRun(FutureTask.java:334)
	at java.util.concurrent.FutureTask.run(FutureTask.java:166)
	at java.util.concurrent.ThreadPoolExecutor.runWorker(ThreadPoolExecutor.java:1110)
	at java.util.concurrent.ThreadPoolExecutor$Worker.run(ThreadPoolExecutor.java:603)
	at java.lang.Thread.run(Thread.java:722)
Caused by: org.apache.maven.plugin.PluginExecutionException: Execution default-test of goal
org.apache.maven.plugins:maven-surefire-plugin:2.12.3:test failed: Task java.util.concurrent.FutureTask@2ab506
rejected from java.util.concurrent.ThreadPoolExecutor@1d2b28a[Running, pool size = 1, active
threads = 1, queued tasks = 500, completed tasks = 0]
	at org.apache.maven.plugin.DefaultBuildPluginManager.executeMojo(DefaultBuildPluginManager.java:110)
	at org.apache.maven.lifecycle.internal.MojoExecutor.execute(MojoExecutor.java:209)
	... 27 more
Caused by: java.util.concurrent.RejectedExecutionException: Task java.util.concurrent.FutureTask@2ab506
rejected from java.util.concurrent.ThreadPoolExecutor@1d2b28a[Running, pool size = 1, active
threads = 1, queued tasks = 500, completed tasks = 0]
	at java.util.concurrent.ThreadPoolExecutor$AbortPolicy.rejectedExecution(ThreadPoolExecutor.java:2001)
	at java.util.concurrent.ThreadPoolExecutor.reject(ThreadPoolExecutor.java:816)
	at java.util.concurrent.ThreadPoolExecutor.execute(ThreadPoolExecutor.java:1337)
	at java.util.concurrent.AbstractExecutorService.submit(AbstractExecutorService.java:132)
	at org.apache.maven.plugin.surefire.booterclient.ForkStarter.runSuitesForkPerTestSet(ForkStarter.java:168)
	at org.apache.maven.plugin.surefire.booterclient.ForkStarter.run(ForkStarter.java:121)
	at org.apache.maven.plugin.surefire.AbstractSurefireMojo.executeProvider(AbstractSurefireMojo.java:740)
	at org.apache.maven.plugin.surefire.AbstractSurefireMojo.executeAllProviders(AbstractSurefireMojo.java:682)
	at org.apache.maven.plugin.surefire.AbstractSurefireMojo.executeAfterPreconditionsChecked(AbstractSurefireMojo.java:648)
	at org.apache.maven.plugin.surefire.AbstractSurefireMojo.execute(AbstractSurefireMojo.java:586)
	at org.apache.maven.plugin.DefaultBuildPluginManager.executeMojo(DefaultBuildPluginManager.java:101)
	... 28 more
Sending e-mails to: dev@activemq.apache.org
channel stopped
[locks-and-latches] Releasing all the locks
[locks-and-latches] All the locks released

Mime
View raw message